{"text_format":"1","workbook":"xlsx","n_sheets":9,"sheets":["Input","Lighting","HVAC and Refrigeration","Energy Efficient Equipment","O&M Practices","Management Practice","Report","Question Sets","Variables"],"not_rendered":{"charts":2,"images":13,"macros":1,"external_links":0,"defined_names":26,"comments":0,"pivot_tables":0},"unopened":[],"bounds":{"document_bytes":16777216,"sheet_cells":100000,"rows_first":2000,"rows_last":500,"rows_between":2000,"halvings":0,"cell_chars":16384,"cell_head_chars":4096},"cells_cut":0,"cells_raw":0,"read":"whole","date_system":"1900"}

{"sheet":"Input","index":0,"n_rows":48,"n_cols":4,"rows_kept":48,"cut":false,"hidden":false,"merged":[[33,2,33,3],[40,2,40,3],[25,2,25,3],[35,2,37,4],[42,2,44,4]]}
[]
[]
[]
[null,"Strategic energy management assessment"]
[]
[null,null,"Business Name"]
[]
[null,null,"Sector"]
{"$rows_left_out":41}
{"sheet":"Lighting","index":1,"n_rows":16,"n_cols":3,"rows_kept":16,"cut":false,"hidden":true,"merged":[]}
[]
[]
[]
[]
[]
[null,"Question Set: "]
[null,{"$f":"Sector","v":0}]
[null,"Section: "]
{"$rows_left_out":9}
{"sheet":"HVAC and Refrigeration","index":2,"n_rows":16,"n_cols":3,"rows_kept":16,"cut":false,"hidden":true,"merged":[]}
[]
[]
[]
[]
[]
[null,"Question Set: "]
[null,{"$f":"Sector","v":0}]
[null,"Section: "]
{"$rows_left_out":9}
{"sheet":"Energy Efficient Equipment","index":3,"n_rows":16,"n_cols":3,"rows_kept":16,"cut":false,"hidden":true,"merged":[]}
[]
[]
[]
[]
[]
[null,"Question Set: "]
[null,{"$f":"Sector","v":0}]
[null,"Section: "]
{"$rows_left_out":9}
{"sheet":"O&M Practices","index":4,"n_rows":16,"n_cols":3,"rows_kept":16,"cut":false,"hidden":true,"merged":[]}
[]
[]
[]
[]
[]
[null,"Question Set: "]
[null,{"$f":"Sector","v":0}]
[null,"Section: "]
{"$rows_left_out":9}
{"sheet":"Management Practice","index":5,"n_rows":16,"n_cols":3,"rows_kept":16,"cut":false,"hidden":true,"merged":[]}
[]
[]
[]
[]
[]
[null,"Question Set: "]
[null,{"$f":"Sector","v":0}]
[null,"Section: "]
{"$rows_left_out":9}
{"sheet":"Report","index":6,"n_rows":95,"n_cols":14,"rows_kept":95,"cut":false,"hidden":true,"merged":[[52,8,54,9],[53,0,53,7],[37,0,37,5],[38,0,38,5],[34,8,34,9],[32,0,32,7],[33,0,33,7],[34,0,34,7],[33,8,33,9],[32,8,32,9],[25,0,25,7],[3,0,3,9],[6,0,6,9],[5,0,5,9],[19,0,20,9],[10,0,14,9],[16,0,16,9],[17,8,17,9],[23,8,23,9],[22,0,22,9],[49,8,51,9],[50,0,50,7],[39,0,39,5],[23,0,23,7],[30,0,30,7],[31,0,31,7],[26,0,26,7],[27,0,27,7],[29,0,29,9],[24,8,24,9],[26,8,26,9],[30,8,30,9],[31,8,31,9],[27,8,27,9],[25,8,25,9],[24,0,24,7],[66,7,66,8],[67,0,67,9],[68,0,68,9],[70,0,70,9],[71,0,71,9],[94,0,100,9],[56,8,58,9],[57,0,57,7],[62,7,62,8],[63,0,63,9],[64,0,64,9],[79,0,79,9],[81,0,81,9],[82,0,82,9],[84,0,84,9],[85,0,85,9],[73,7,73,8],[74,0,74,9],[75,0,75,9],[77,7,77,8],[78,0,78,9]]}
[]
["Prepared for: "]
[]
[{"$f":"Input!C7","v":0}]
[]
["By: Conservation and Energy Management, (604) 433 2700, powersmart@bchydro.com"]
[{"$f":"IF(Account=\"\",\"For: \",\"For: Account number ending with \"&RIGHT(Account,4)&\", \")&Input!C11&\", \"&Input!C13&\", \"&Input!C15&\", \"&TEXT(Input!C18,\"dd/mm/yyyy\")","v":"For: , , , 05/07/2018"}]
[]
{"$rows_left_out":88}
{"sheet":"Question Sets","index":7,"n_rows":123,"n_cols":21,"rows_kept":123,"cut":false,"hidden":true,"merged":[]}
["ID","Question set","Diagnostic Heading","Q","Report Heading","BCH Funded","Available BC Hydro Funding","Question","Action","Proposed Link","Selected","Answer","FundedYes","OperationalYes","a","b","c","ES Percent","ES Value","DisplaySavings","Reference for Column C"]
[{"$f":"INDEX(Table7[Q],MATCH(Table3[[#This Row],[Question set]],Table7[Question Set],0))&\".\"&INDEX(Table5[S],MATCH(Table3[[#This Row],[Diagnostic Heading]],Table5[Diagnostic Heading],0))&\".\"&Table3[[#This Row],[Q]]","v":"1.1.1"},"Education","Lighting",1,"LED Lighting","yes","Average incentive of 50% of product cost","We have upgraded our incandescent lighting to energy efficient LED lamps.","BC Hydro funding is available. Assess the cost effectiveness of upgrading your incandescent lighting to energy efficient LEDs. LEDs use at least 75% less energy than a standard incandescent and last about 15 to 20 times longer than incandescent lighting, and about three times longer than CFLs. Learn more about LEDs by clicking the link below. ","http://www.bchydro.com/news/conservation/2014/led-lighting-increasingly-popular.html",{"$f":"INDEX(Table1[Evaluator Question Set],MATCH(Sector,Table1[BC Hydro Sector Allocation],0))=Table3[[#This Row],[Question set]]","v":{"$error":"#N/A"}},{"$f":"IF(Table3[[#This Row],[Selected]],INDIRECT(\"'\"&INDEX(Table5[SheetName],MATCH(Table3[[#This Row],[Diagnostic Heading]],Table5[Diagnostic Heading],0))&\"'\"&\"!C\"&11+Table3[[#This Row],[Q]]),\"\")","v":{"$error":"#N/A"}},{"$f":"IFERROR(AND(Table3[[#This Row],[BCH Funded]]=\"Yes\",Table3[[#This Row],[Answer]]=\"No\"),\"\")","v":""},{"$f":"IFERROR(AND(Table3[[#This Row],[BCH Funded]]=\"no\",Table3[[#This Row],[Answer]]=\"No\"),\"\")","v":""},{"$f":"IFERROR(IF(Table3[[#This Row],[Answer]]=\"No\",INDEX(Table10[],MATCH(INDEX(Table8[CPR Type],MATCH(Table3[[#This Row],[Report Heading]],Table8[Report Heading],0)),Table10[Segment],0),MATCH(Table3[[#This Row],[Question set]],Table10[#Headers],0)),0),0.01/COUNTIFS(Table3[Question set],INDEX(Table1[Evaluator Question Set],MATCH(Sector,Table1[BC Hydro Sector Allocation],0)),Table3[Diagnostic Heading],Table3[[#This Row],[Diagnostic Heading]],Table3[Selected],TRUE))","v":{"$error":"#DIV/0!"}},0.05,0.75,{"$f":"Table3[[#This Row],[a]]*Table3[[#This Row],[b]]*Table3[[#This Row],[c]]","v":{"$error":"#DIV/0!"}},{"$f":"Table3[[#This Row],[ES Percent]]*AnnEgyCons","v":{"$error":"#DIV/0!"}},true,"Cristian Suvagau"]
[{"$f":"INDEX(Table7[Q],MATCH(Table3[[#This Row],[Question set]],Table7[Question Set],0))&\".\"&INDEX(Table5[S],MATCH(Table3[[#This Row],[Diagnostic Heading]],Table5[Diagnostic Heading],0))&\".\"&Table3[[#This Row],[Q]]","v":"1.1.2"},"Education","Lighting",2,"Fluorescent lighting","yes","Average incentive of 25% of project cost when upgrading to LED","Have you upgraded your lighting system in the last 5 years?","Consider upgrading your fluorescent lighting to energy efficient T8 lamps. If you currently have T12 lamps, upgrading to the latest T8 lamps and electronic ballasts could reduce your lighting costs by up to 40%.  Also consider upgrading to LEDs to increase your savings by up to 60% and be eligible for BC Hydro incentives.","https://www.bchydro.com/ecatalog/eCatServlet?cmd=all_psp_incentives&existId=&energyId=13&p=1&sb=3&dir=1&ip=50",{"$f":"INDEX(Table1[Evaluator Question Set],MATCH(Sector,Table1[BC Hydro Sector Allocation],0))=Table3[[#This Row],[Question set]]","v":{"$error":"#N/A"}},{"$f":"IF(Table3[[#This Row],[Selected]],INDIRECT(\"'\"&INDEX(Table5[SheetName],MATCH(Table3[[#This Row],[Diagnostic Heading]],Table5[Diagnostic Heading],0))&\"'\"&\"!C\"&11+Table3[[#This Row],[Q]]),\"\")","v":{"$error":"#N/A"}},{"$f":"IFERROR(AND(Table3[[#This Row],[BCH Funded]]=\"Yes\",Table3[[#This Row],[Answer]]=\"No\"),\"\")","v":""},{"$f":"IFERROR(AND(Table3[[#This Row],[BCH Funded]]=\"no\",Table3[[#This Row],[Answer]]=\"No\"),\"\")","v":""},{"$f":"IFERROR(IF(Table3[[#This Row],[Answer]]=\"No\",INDEX(Table10[],MATCH(INDEX(Table8[CPR Type],MATCH(Table3[[#This Row],[Report Heading]],Table8[Report Heading],0)),Table10[Segment],0),MATCH(Table3[[#This Row],[Question set]],Table10[#Headers],0)),0),0.01/COUNTIFS(Table3[Question set],INDEX(Table1[Evaluator Question Set],MATCH(Sector,Table1[BC Hydro Sector Allocation],0)),Table3[Diagnostic Heading],Table3[[#This Row],[Diagnostic Heading]],Table3[Selected],TRUE))","v":{"$error":"#DIV/0!"}},0.9,0.3,{"$f":"Table3[[#This Row],[a]]*Table3[[#This Row],[b]]*Table3[[#This Row],[c]]","v":{"$error":"#DIV/0!"}},{"$f":"Table3[[#This Row],[ES Percent]]*AnnEgyCons","v":{"$error":"#DIV/0!"}},true,"Cristian Suvagau"]
[{"$f":"INDEX(Table7[Q],MATCH(Table3[[#This Row],[Question set]],Table7[Question Set],0))&\".\"&INDEX(Table5[S],MATCH(Table3[[#This Row],[Diagnostic Heading]],Table5[Diagnostic Heading],0))&\".\"&Table3[[#This Row],[Q]]","v":"1.1.3"},"Education","Lighting",3,"LED Exit lighting","no",null,"We have replaced incandescent exit signs with energy efficient LED exit signs.","Did you know that exit signs are now legislated by the federal government?","http://www.nrcan.gc.ca/energy/regulations-codes-standards/18419",{"$f":"INDEX(Table1[Evaluator Question Set],MATCH(Sector,Table1[BC Hydro Sector Allocation],0))=Table3[[#This Row],[Question set]]","v":{"$error":"#N/A"}},{"$f":"IF(Table3[[#This Row],[Selected]],INDIRECT(\"'\"&INDEX(Table5[SheetName],MATCH(Table3[[#This Row],[Diagnostic Heading]],Table5[Diagnostic Heading],0))&\"'\"&\"!C\"&11+Table3[[#This Row],[Q]]),\"\")","v":{"$error":"#N/A"}},{"$f":"IFERROR(AND(Table3[[#This Row],[BCH Funded]]=\"Yes\",Table3[[#This Row],[Answer]]=\"No\"),\"\")","v":""},{"$f":"IFERROR(AND(Table3[[#This Row],[BCH Funded]]=\"no\",Table3[[#This Row],[Answer]]=\"No\"),\"\")","v":""},{"$f":"IFERROR(IF(Table3[[#This Row],[Answer]]=\"No\",INDEX(Table10[],MATCH(INDEX(Table8[CPR Type],MATCH(Table3[[#This Row],[Report Heading]],Table8[Report Heading],0)),Table10[Segment],0),MATCH(Table3[[#This Row],[Question set]],Table10[#Headers],0)),0),0.01/COUNTIFS(Table3[Question set],INDEX(Table1[Evaluator Question Set],MATCH(Sector,Table1[BC Hydro Sector Allocation],0)),Table3[Diagnostic Heading],Table3[[#This Row],[Diagnostic Heading]],Table3[Selected],TRUE))","v":{"$error":"#DIV/0!"}},0.04,0.9,{"$f":"Table3[[#This Row],[a]]*Table3[[#This Row],[b]]*Table3[[#This Row],[c]]","v":{"$error":"#DIV/0!"}},{"$f":"Table3[[#This Row],[ES Percent]]*AnnEgyCons","v":{"$error":"#DIV/0!"}},true,"Cristian Suvagau"]
[{"$f":"INDEX(Table7[Q],MATCH(Table3[[#This Row],[Question set]],Table7[Question Set],0))&\".\"&INDEX(Table5[S],MATCH(Table3[[#This Row],[Diagnostic Heading]],Table5[Diagnostic Heading],0))&\".\"&Table3[[#This Row],[Q]]","v":"1.1.4"},"Education","Lighting",4,"Exterior Lighting","yes","Average incentive of 25% of project cost","We have upgraded our exterior lighting to energy efficient lamps and fixtures that reduce glare, light pollution and lighting costs (e.g. in parking lots).","Consider upgrading your exterior lighting (e.g. in parking lots) to T8 fluorescent or LED (incentives available for specific LED technologies). These will provide savings and you can get your return even quicker with incentives.","https://www.bchydro.com/ecatalog/eCatServlet?cmd=all_psp_incentives&existId=&energyId=13&p=1&sb=3&dir=1&ip=50",{"$f":"INDEX(Table1[Evaluator Question Set],MATCH(Sector,Table1[BC Hydro Sector Allocation],0))=Table3[[#This Row],[Question set]]","v":{"$error":"#N/A"}},{"$f":"IF(Table3[[#This Row],[Selected]],INDIRECT(\"'\"&INDEX(Table5[SheetName],MATCH(Table3[[#This Row],[Diagnostic Heading]],Table5[Diagnostic Heading],0))&\"'\"&\"!C\"&11+Table3[[#This Row],[Q]]),\"\")","v":{"$error":"#N/A"}},{"$f":"IFERROR(AND(Table3[[#This Row],[BCH Funded]]=\"Yes\",Table3[[#This Row],[Answer]]=\"No\"),\"\")","v":""},{"$f":"IFERROR(AND(Table3[[#This Row],[BCH Funded]]=\"no\",Table3[[#This Row],[Answer]]=\"No\"),\"\")","v":""},{"$f":"IFERROR(IF(Table3[[#This Row],[Answer]]=\"No\",INDEX(Table10[],MATCH(INDEX(Table8[CPR Type],MATCH(Table3[[#This Row],[Report Heading]],Table8[Report Heading],0)),Table10[Segment],0),MATCH(Table3[[#This Row],[Question set]],Table10[#Headers],0)),0),0.01/COUNTIFS(Table3[Question set],INDEX(Table1[Evaluator Question Set],MATCH(Sector,Table1[BC Hydro Sector Allocation],0)),Table3[Diagnostic Heading],Table3[[#This Row],[Diagnostic Heading]],Table3[Selected],TRUE))","v":{"$error":"#DIV/0!"}},1,0.5,{"$f":"Table3[[#This Row],[a]]*Table3[[#This Row],[b]]*Table3[[#This Row],[c]]","v":{"$error":"#DIV/0!"}},{"$f":"Table3[[#This Row],[ES Percent]]*AnnEgyCons","v":{"$error":"#DIV/0!"}},true,"Cristian Suvagau"]
[{"$f":"INDEX(Table7[Q],MATCH(Table3[[#This Row],[Question set]],Table7[Question Set],0))&\".\"&INDEX(Table5[S],MATCH(Table3[[#This Row],[Diagnostic Heading]],Table5[Diagnostic Heading],0))&\".\"&Table3[[#This Row],[Q]]","v":"1.1.5"},"Education","Lighting",5,"Lighting control","No",null,"We have installed controls on lighting to turn off when not required (e.g. timers or occupancy sensors in offices and meeting rooms, daylight harvesting in offices).","Lighting controls can provide you with energy savings and better management of your lighting systems.  Adding lighting controls may be eligible for additional incentive funding when completing a lighting retrofit as not all controls energy savings are recognized by BC Hydro.","https://www.bchydro.com/ecatalog/eCatServlet?cmd=all_psp_incentives&existId=&energyId=14",{"$f":"INDEX(Table1[Evaluator Question Set],MATCH(Sector,Table1[BC Hydro Sector Allocation],0))=Table3[[#This Row],[Question set]]","v":{"$error":"#N/A"}},{"$f":"IF(Table3[[#This Row],[Selected]],INDIRECT(\"'\"&INDEX(Table5[SheetName],MATCH(Table3[[#This Row],[Diagnostic Heading]],Table5[Diagnostic Heading],0))&\"'\"&\"!C\"&11+Table3[[#This Row],[Q]]),\"\")","v":{"$error":"#N/A"}},{"$f":"IFERROR(AND(Table3[[#This Row],[BCH Funded]]=\"Yes\",Table3[[#This Row],[Answer]]=\"No\"),\"\")","v":""},{"$f":"IFERROR(AND(Table3[[#This Row],[BCH Funded]]=\"no\",Table3[[#This Row],[Answer]]=\"No\"),\"\")","v":""},{"$f":"IFERROR(IF(Table3[[#This Row],[Answer]]=\"No\",INDEX(Table10[],MATCH(INDEX(Table8[CPR Type],MATCH(Table3[[#This Row],[Report Heading]],Table8[Report Heading],0)),Table10[Segment],0),MATCH(Table3[[#This Row],[Question set]],Table10[#Headers],0)),0),0.01/COUNTIFS(Table3[Question set],INDEX(Table1[Evaluator Question Set],MATCH(Sector,Table1[BC Hydro Sector Allocation],0)),Table3[Diagnostic Heading],Table3[[#This Row],[Diagnostic Heading]],Table3[Selected],TRUE))","v":{"$error":"#DIV/0!"}},0.15,0.3,{"$f":"Table3[[#This Row],[a]]*Table3[[#This Row],[b]]*Table3[[#This Row],[c]]","v":{"$error":"#DIV/0!"}},{"$f":"Table3[[#This Row],[ES Percent]]*AnnEgyCons","v":{"$error":"#DIV/0!"}},true,"Cristian Suvagau"]
[{"$f":"INDEX(Table7[Q],MATCH(Table3[[#This Row],[Question set]],Table7[Question Set],0))&\".\"&INDEX(Table5[S],MATCH(Table3[[#This Row],[Diagnostic Heading]],Table5[Diagnostic Heading],0))&\".\"&Table3[[#This Row],[Q]]","v":"1.2.1"},"Education","Heating, Ventilation, Air Conditioning / Refrigeration",1,"Air tightness","no",null,"We have examined ways to improve the air-tightness of air-conditioned spaces (e.g. closing doors, windows and installing air curtains).","Stretch your legs. Have a walk around and look for where you could improve the air-tightness of air-conditioned spaces (e.g. closing doors, windows, installing air curtains). Learn more about air leakage control in your building through the link below.","http://www.energycodes.gov/sites/default/files/documents/BECP_Buidling%20Energy%20Code%20Resource%20Guide%20Air%20Leakage%20Guide_Sept2011_v00_lores.pdf ",{"$f":"INDEX(Table1[Evaluator Question Set],MATCH(Sector,Table1[BC Hydro Sector Allocation],0))=Table3[[#This Row],[Question set]]","v":{"$error":"#N/A"}},{"$f":"IF(Table3[[#This Row],[Selected]],INDIRECT(\"'\"&INDEX(Table5[SheetName],MATCH(Table3[[#This Row],[Diagnostic Heading]],Table5[Diagnostic Heading],0))&\"'\"&\"!C\"&11+Table3[[#This Row],[Q]]),\"\")","v":{"$error":"#N/A"}},{"$f":"IFERROR(AND(Table3[[#This Row],[BCH Funded]]=\"Yes\",Table3[[#This Row],[Answer]]=\"No\"),\"\")","v":""},{"$f":"IFERROR(AND(Table3[[#This Row],[BCH Funded]]=\"no\",Table3[[#This Row],[Answer]]=\"No\"),\"\")","v":""},{"$f":"IFERROR(IF(Table3[[#This Row],[Answer]]=\"No\",INDEX(Table10[],MATCH(INDEX(Table8[CPR Type],MATCH(Table3[[#This Row],[Report Heading]],Table8[Report Heading],0)),Table10[Segment],0),MATCH(Table3[[#This Row],[Question set]],Table10[#Headers],0)),0),0.01/COUNTIFS(Table3[Question set],INDEX(Table1[Evaluator Question Set],MATCH(Sector,Table1[BC Hydro Sector Allocation],0)),Table3[Diagnostic Heading],Table3[[#This Row],[Diagnostic Heading]],Table3[Selected],TRUE))","v":{"$error":"#DIV/0!"}},1,0.02,{"$f":"Table3[[#This Row],[a]]*Table3[[#This Row],[b]]*Table3[[#This Row],[c]]","v":{"$error":"#DIV/0!"}},{"$f":"Table3[[#This Row],[ES Percent]]*AnnEgyCons","v":{"$error":"#DIV/0!"}},true,"ASHRAE- Simulation of the Impact of Commercial Building Envelope Airtightness on Building Energy Utilization"]
[{"$f":"INDEX(Table7[Q],MATCH(Table3[[#This Row],[Question set]],Table7[Question Set],0))&\".\"&INDEX(Table5[S],MATCH(Table3[[#This Row],[Diagnostic Heading]],Table5[Diagnostic Heading],0))&\".\"&Table3[[#This Row],[Q]]","v":"1.2.2"},"Education","Heating, Ventilation, Air Conditioning / Refrigeration",2,"Heating / cooling controls","yes","Average incentive of 20% of project cost","We have upgraded our heating, ventilation & air conditioning system to include variable frequency drives on fans and pumps and/or variable speed ECM pumps.","BC Hydro funding is available. Consider upgrading your heating, ventilation & air conditioning system to include variable frequency drives on fans and pumps and/or variable speed ECM pumps.","https://www.bchydro.com/ecatalog/",{"$f":"INDEX(Table1[Evaluator Question Set],MATCH(Sector,Table1[BC Hydro Sector Allocation],0))=Table3[[#This Row],[Question set]]","v":{"$error":"#N/A"}},{"$f":"IF(Table3[[#This Row],[Selected]],INDIRECT(\"'\"&INDEX(Table5[SheetName],MATCH(Table3[[#This Row],[Diagnostic Heading]],Table5[Diagnostic Heading],0))&\"'\"&\"!C\"&11+Table3[[#This Row],[Q]]),\"\")","v":{"$error":"#N/A"}},{"$f":"IFERROR(AND(Table3[[#This Row],[BCH Funded]]=\"Yes\",Table3[[#This Row],[Answer]]=\"No\"),\"\")","v":""},{"$f":"IFERROR(AND(Table3[[#This Row],[BCH Funded]]=\"no\",Table3[[#This Row],[Answer]]=\"No\"),\"\")","v":""},{"$f":"IFERROR(IF(Table3[[#This Row],[Answer]]=\"No\",INDEX(Table10[],MATCH(INDEX(Table8[CPR Type],MATCH(Table3[[#This Row],[Report Heading]],Table8[Report Heading],0)),Table10[Segment],0),MATCH(Table3[[#This Row],[Question set]],Table10[#Headers],0)),0),0.01/COUNTIFS(Table3[Question set],INDEX(Table1[Evaluator Question Set],MATCH(Sector,Table1[BC Hydro Sector Allocation],0)),Table3[Diagnostic Heading],Table3[[#This Row],[Diagnostic Heading]],Table3[Selected],TRUE))","v":{"$error":"#DIV/0!"}},1,0.2,{"$f":"Table3[[#This Row],[a]]*Table3[[#This Row],[b]]*Table3[[#This Row],[c]]","v":{"$error":"#DIV/0!"}},{"$f":"Table3[[#This Row],[ES Percent]]*AnnEgyCons","v":{"$error":"#DIV/0!"}},true,"Past commercial incentives"]
{"$rows_left_out":116}
{"sheet":"Variables","index":8,"n_rows":46,"n_cols":82,"rows_kept":46,"cut":false,"hidden":true,"merged":[[20,59,20,60],[4,51,4,58],[20,69,20,70],[21,69,21,70],[4,62,4,71],[1,81,7,89],[14,62,14,70],[12,58,14,58],[13,51,13,57],[3,59,5,60],[2,69,2,70],[11,69,11,70],[12,62,12,70],[13,62,13,70],[3,62,3,71]]}
["BC Hydro Sector Allocation","Evaluator Question Set","Rebate",null,"Question Set","Q",null,null,"S","Diagnostic Heading","SheetName",null,"#","Report Heading","BC Stat Type","CPR Type",null,null,null,null,null,null,null,null,null,null,null,null,null,null,null,null,null,null,null,null,null,null,"Diagnostic Heading","Factor","Description","Source",null,null,"Barrier","Reason","B","R"]
["Advanced Education","Education",3353,null,"Education",1,null,null,1,"Lighting","Lighting",null,null,"LED Exit lighting","Lights","Lighting",null,null,null,"Energy Use","Education","Retail (non-food)","Retail (food)","Office","Hospitality",null,"Segment","Accommodation","Colleges/Universities","Food Service","Hospital","Logistics/Warehouses","Long Term Care","Office ","Other Commercial","Retail - Food","Retail - Non Food",null,"Lighting","a","(%) Ltg usage in comm. Buildings","BC Energy Use Commercial Stats",null,null,"Long payback","For the environment",{"$f":"Barrier=Table6[[#This Row],[Barrier]]","v":false},{"$f":"Reason=Table6[[#This Row],[Reason]]","v":false},null,null,null,null,null,null,null,null,null,null,null,null,null,null,null,null,null,null,null,null,null,null,null,null,null,"Next Steps",null,null,null,null,null,null,null,"The data and information provided in this report was compiled solely for BC Hydro purposes. BC Hydro expressly disclaims any warranties or representations, either expressed or implied, with respect to the accuracy, reliability, usefulness, completeness, non-infringement of intellectual property rights, or quality of data and information contained herein. BC Hydro, its employees, servants and agents do not accept any liability of any kind arising in any way out of the use of or reliance on this data and information by any person. Any person using or relying on this data and information does so at their own risk."]
["Government","Office",3840,null,"Retail (non-food)",2,null,null,2,"Heating, Ventilation, Air Conditioning / Refrigeration","HVAC and Refrigeration",null,null,"Lighting control","Lights","Lighting",null,null,null,"Cool",1.925,4.8849999999999998,1.7,10.605,4.96,null,"Cooking",6,4,41,7,4,7,13,4,4,7,null,"Lighting","b","(%) ECM usage  vs total ECM usage per building sector","Past Experience",null,null,"No capital dollars","For the financial savings",{"$f":"Barrier=Table6[[#This Row],[Barrier]]","v":false},{"$f":"Reason=Table6[[#This Row],[Reason]]","v":false},null,null,null,null,null,null,null,null,null,null,null,null,null,null,null,null,null,null,null,null,null,null,null,null,null,"1.  Review the report and recommended actions."]
["Health Authority","Hospitality",2781,null,"Office",3,null,null,4,"Energy Efficient Equipment","Energy Efficient Equipment",null,null,"Exterior Lighting","Ext. Lts","Ext. Lts",null,null,null,"Heat",30.434999999999999,9.6150000000000002,1.66,13.39,11.15,null,"NVAC Fans/Pumps",144,208,140,119,102,75,876,432,80,296,null,"Lighting","c","(%) ECM savings representative of  Action type","Past Experience",null,null,"Don't know where to begin","Green branding",{"$f":"Barrier=Table6[[#This Row],[Barrier]]","v":false},{"$f":"Reason=Table6[[#This Row],[Reason]]","v":false},null,null,null,null,null,null,null,null,null,null,null,null,null,null,null,null,null,null,null,null,null,null,null,null,null,"2.  Go to www.bchydro.com/referral to get a list of Energy Professionals to help you with your project."]
["Hospitality","Hospitality",2477,null,"Hospitality",4,null,null,5,"Operating and Maintenance Practices","O&M Practices",null,null,"Fluorescent lighting","Lights","Lighting",null,null,null,"Lights",33.020000000000003,29.759999999999998,17.89,33.96,18.484999999999999,null,"Hot Water",27,15,72,1,12,6,63,30,7,16,null,null,null,null,null,null,null,"Lack of information ","Better quality equipment",{"$f":"Barrier=Table6[[#This Row],[Barrier]]","v":false},{"$f":"Reason=Table6[[#This Row],[Reason]]","v":false},null,null,null,null,null,null,null,null,null,null,null,null,null,null,null,null,null,null,null,null,null,null,null,null,null,"3.  Go to www.bchydro.com/express to fill out an application form for incentives before any works starts."]
["Municipalities","Office",2284,null,"Retail (food)",5,null,null,6,"Management Practice","Management Practice",null,null,"LED Lighting","Lights","Lighting",null,null,null,"Fans",17.11,10.08,8.7899999999999991,17.61,12.635,null,"Lighting",325,257,328,154,393,131,1635,399,279,1225,null,null,null,null,null,null,null,"Leasing limitation","Competitive advantage",{"$f":"Barrier=Table6[[#This Row],[Barrier]]","v":false},{"$f":"Reason=Table6[[#This Row],[Reason]]","v":false},null,null,null,null,null,null,null,null,null,null,null,null,null,null,null,null,null,null,null,null,null,null,null,null,null,"4.  To find out more about BC Hydro funding call 1 866 522 4713."]
["Offices","Office",3620,null,null,null,null,null,null,null,null,null,null,"Economizer sensor","Heat","Space Cooling",null,null,null,"Equip.",5.65,11.19,4.9800000000000004,12.005000000000001,20.39,null,"Office Equipment",56,40,4,7,15,6,253,8,0,37,null,null,null,null,null,null,null,"Other","Other",{"$f":"Barrier=Table6[[#This Row],[Barrier]]","v":false},{"$f":"Reason=Table6[[#This Row],[Reason]]","v":false}]
["Property Management","Office",3620,null,null,null,null,null,null,null,null,null,null,"Economizer operation","Heat","Space Cooling",null,null,null,"Refrig.",0.69,20.029999999999998,56.29,1.4750000000000001,4.62,null,"Other",50,37,153,112,164,28,403,110,63,420]
{"$rows_left_out":38}