{"text_format":"1","workbook":"xlsx","n_sheets":10,"sheets":["User Guide","Project Info & Results","Luminaire Schedule","Interior - Building Area Method","Interior - Space-By-Space","Exterior","ASHRAE","NECB","Basic Lists","Sheet1"],"not_rendered":{"charts":2,"images":6,"macros":1,"external_links":3,"defined_names":100,"comments":4,"pivot_tables":0},"unopened":[],"bounds":{"document_bytes":16777216,"sheet_cells":100000,"rows_first":2000,"rows_last":500,"rows_between":2000,"halvings":0,"cell_chars":16384,"cell_head_chars":4096},"cells_cut":0,"cells_raw":0,"read":"whole","date_system":"1900"}

{"sheet":"User Guide","index":0,"n_rows":83,"n_cols":2,"rows_kept":83,"cut":false,"hidden":false,"merged":[[0,1,0,13],[1,1,1,13],[82,0,82,1]]}
[null,"New Construction Program"]
[null,"Lighting Calculator User Guide"]
[null,{"$f":"'Basic Lists'!A100","v":"NCP LC v.4.0"}]
[]
[]
[]
[]
[]
[]
[]
{"$rows_left_out":74}
{"sheet":"Project Info & Results","index":1,"n_rows":24,"n_cols":8,"rows_kept":24,"cut":false,"hidden":false,"merged":[[0,1,0,4],[1,1,1,4],[3,4,3,7],[19,5,19,7]]}
[null,"New Construction Program"]
[null,"Lighting Calculator"]
[null,{"$f":"'Basic Lists'!A100","v":"NCP LC v.4.0"}]
[null,"Project information",null,null,"Project totals"]
[]
[null,"Project name",null,null,null,"Interior","Exterior","Total"]
[null,"Project site address",null,null,"Baseline demand, kW",{"$f":"IF(ProjectMethod=SBS,'Interior - Space-By-Space'!$AV$56,IF(ProjectMethod=BAM,'Interior - Building Area Method'!$O$59,0))","v":0},{"$f":"IF(ISNUMBER(Exterior!$AB$70),Exterior!$AB$70,0)","v":0},{"$f":"F7+G7","v":0}]
[null,"Customer contact name",null,null,"Baseline energy consumption, kWh",{"$f":"IF(ProjectMethod=SBS,'Interior - Space-By-Space'!$AT$56,IF(ProjectMethod=BAM,'Interior - Building Area Method'!$O$60,0))","v":0},{"$f":"IF(ISNUMBER(Exterior!$Z$70),Exterior!$Z$70,0)","v":0},{"$f":"F8+G8","v":0}]
[null,"Customer contact phone #",null,null,"Design demand, kW",{"$f":"IF(ProjectMethod=SBS,'Interior - Space-By-Space'!$AW$56,IF(ProjectMethod=BAM,'Interior - Building Area Method'!$O$61,0))","v":0},{"$f":"Exterior!$AC$70","v":0},0]
[null,"Consultant company",null,null,"Design energy consumption, kWh",{"$f":"IF(ProjectMethod=SBS,'Interior - Space-By-Space'!$AU$56,IF(ProjectMethod=BAM,'Interior - Building Area Method'!$O$62,0))","v":0},{"$f":"Exterior!$AA$70","v":0},0]
{"$rows_left_out":15}
{"sheet":"Luminaire Schedule","index":2,"n_rows":157,"n_cols":5,"rows_kept":157,"cut":false,"hidden":false,"merged":[[0,1,0,4],[1,1,1,4],[3,1,3,4]]}
[null,"New Construction Program"]
[null,"Lighting Calculator"]
[null,{"$f":"'Basic Lists'!A100","v":"NCP LC v.4.0"}]
[null,"Luminaire schedule"]
["Example","A1","2'x4' recessed drywall flange LED panel luminaire with 0-10V dimmind driver and integrated OS, 4500lm, 3500K",48,100]
[null,"Luminaire type","Luminaire description","Luminaire input wattage","# of luminaires"]
[null,null,null,null,{"$f":"IF(ProjectMethod=SBS,SUM(SUMIF('Interior - Space-By-Space'!$M$16:OFFSET('Interior - Space-By-Space'!$M$56,-1,0),$B7,'Interior - Space-By-Space'!$O$16:OFFSET('Interior - Space-By-Space'!$O$56,-1,0)),SUMIF('Interior - Space-By-Space'!$Q$16:OFFSET('Interior - Space-By-Space'!$Q$56,-1,0),$B7,'Interior - Space-By-Space'!$S$16:OFFSET('Interior - Space-By-Space'!$S$56,-1,0)),SUMIF('Interior - Space-By-Space'!$U$16:OFFSET('Interior - Space-By-Space'!$U$56,-1,0),$B7,'Interior - Space-By-Space'!$W$16:OFFSET('Interior - Space-By-Space'!$W$56,-1,0)),SUMIF('Interior - Space-By-Space'!$Y$16:OFFSET('Interior - Space-By-Space'!$Y$56,-1,0),$B7,'Interior - Space-By-Space'!$AA$16:OFFSET('Interior - Space-By-Space'!$AA$56,-1,0)),SUMIF('Interior - Space-By-Space'!$AC$16:OFFSET('Interior - Space-By-Space'!$AC$56,-1,0),$B7,'Interior - Space-By-Space'!$AE$16:OFFSET('Interior - Space-By-Space'!$AE$56,-1,0)),SUMIF('Interior - Space-By-Space'!$AG$16:OFFSET('Interior - Space-By-Space'!$AG$56,-1,0),$B7,'Interior - Space-By-Space'!$AI$16:OFFSET('Interior - Space-By-Space'!$AI$56,-1,0)),SUMIF('Interior - Space-By-Space'!$AK$16:OFFSET('Interior - Space-By-Space'!$AK$56,-1,0),$B7,'Interior - Space-By-Space'!$AM$16:OFFSET('Interior - Space-By-Space'!$AM$56,-1,0)),SUMIF('Interior - Space-By-Space'!$AO$16:OFFSET('Interior - Space-By-Space'!$AO$56,-1,0),$B7,'Interior - Space-By-Space'!$AQ$16:OFFSET('Interior - Space-By-Space'!$AQ$56,-1,0))),IF(ProjectMethod=BAM,SUM('Interior - Building Area Method'!$C18,'Interior - Building Area Method'!$E18,'Interior - Building Area Method'!$G18,'Interior - Building Area Method'!$I18,'Interior - Building Area Method'!$K18),0))+SUM(SUMIF(Exterior!$J$19:$J$69,$B7,Exterior!$K$19:$K$69),SUMIF(Exterior!$M$19:$M$69,$B7,Exterior!$N$19:$N$69),SUMIF(Exterior!$P$19:$P$69,$B7,Exterior!$Q$19:$Q$69),SUMIF(Exterior!$S$19:$S$69,$B7,Exterior!$T$19:$T$69),SUMIF(Exterior!$V$19:$V$69,$B7,Exterior!$W$19:$W$69))","v":0}]
[null,null,null,null,{"$f":"IF(ProjectMethod=SBS,SUM(SUMIF('Interior - Space-By-Space'!$M$16:OFFSET('Interior - Space-By-Space'!$M$56,-1,0),$B8,'Interior - Space-By-Space'!$O$16:OFFSET('Interior - Space-By-Space'!$O$56,-1,0)),SUMIF('Interior - Space-By-Space'!$Q$16:OFFSET('Interior - Space-By-Space'!$Q$56,-1,0),$B8,'Interior - Space-By-Space'!$S$16:OFFSET('Interior - Space-By-Space'!$S$56,-1,0)),SUMIF('Interior - Space-By-Space'!$U$16:OFFSET('Interior - Space-By-Space'!$U$56,-1,0),$B8,'Interior - Space-By-Space'!$W$16:OFFSET('Interior - Space-By-Space'!$W$56,-1,0)),SUMIF('Interior - Space-By-Space'!$Y$16:OFFSET('Interior - Space-By-Space'!$Y$56,-1,0),$B8,'Interior - Space-By-Space'!$AA$16:OFFSET('Interior - Space-By-Space'!$AA$56,-1,0)),SUMIF('Interior - Space-By-Space'!$AC$16:OFFSET('Interior - Space-By-Space'!$AC$56,-1,0),$B8,'Interior - Space-By-Space'!$AE$16:OFFSET('Interior - Space-By-Space'!$AE$56,-1,0)),SUMIF('Interior - Space-By-Space'!$AG$16:OFFSET('Interior - Space-By-Space'!$AG$56,-1,0),$B8,'Interior - Space-By-Space'!$AI$16:OFFSET('Interior - Space-By-Space'!$AI$56,-1,0)),SUMIF('Interior - Space-By-Space'!$AK$16:OFFSET('Interior - Space-By-Space'!$AK$56,-1,0),$B8,'Interior - Space-By-Space'!$AM$16:OFFSET('Interior - Space-By-Space'!$AM$56,-1,0)),SUMIF('Interior - Space-By-Space'!$AO$16:OFFSET('Interior - Space-By-Space'!$AO$56,-1,0),$B8,'Interior - Space-By-Space'!$AQ$16:OFFSET('Interior - Space-By-Space'!$AQ$56,-1,0))),IF(ProjectMethod=BAM,SUM('Interior - Building Area Method'!$C19,'Interior - Building Area Method'!$E19,'Interior - Building Area Method'!$G19,'Interior - Building Area Method'!$I19,'Interior - Building Area Method'!$K19),0))+SUM(SUMIF(Exterior!$J$19:$J$69,$B8,Exterior!$K$19:$K$69),SUMIF(Exterior!$M$19:$M$69,$B8,Exterior!$N$19:$N$69),SUMIF(Exterior!$P$19:$P$69,$B8,Exterior!$Q$19:$Q$69),SUMIF(Exterior!$S$19:$S$69,$B8,Exterior!$T$19:$T$69),SUMIF(Exterior!$V$19:$V$69,$B8,Exterior!$W$19:$W$69))","v":0}]
[null,null,null,null,{"$f":"IF(ProjectMethod=SBS,SUM(SUMIF('Interior - Space-By-Space'!$M$16:OFFSET('Interior - Space-By-Space'!$M$56,-1,0),$B9,'Interior - Space-By-Space'!$O$16:OFFSET('Interior - Space-By-Space'!$O$56,-1,0)),SUMIF('Interior - Space-By-Space'!$Q$16:OFFSET('Interior - Space-By-Space'!$Q$56,-1,0),$B9,'Interior - Space-By-Space'!$S$16:OFFSET('Interior - Space-By-Space'!$S$56,-1,0)),SUMIF('Interior - Space-By-Space'!$U$16:OFFSET('Interior - Space-By-Space'!$U$56,-1,0),$B9,'Interior - Space-By-Space'!$W$16:OFFSET('Interior - Space-By-Space'!$W$56,-1,0)),SUMIF('Interior - Space-By-Space'!$Y$16:OFFSET('Interior - Space-By-Space'!$Y$56,-1,0),$B9,'Interior - Space-By-Space'!$AA$16:OFFSET('Interior - Space-By-Space'!$AA$56,-1,0)),SUMIF('Interior - Space-By-Space'!$AC$16:OFFSET('Interior - Space-By-Space'!$AC$56,-1,0),$B9,'Interior - Space-By-Space'!$AE$16:OFFSET('Interior - Space-By-Space'!$AE$56,-1,0)),SUMIF('Interior - Space-By-Space'!$AG$16:OFFSET('Interior - Space-By-Space'!$AG$56,-1,0),$B9,'Interior - Space-By-Space'!$AI$16:OFFSET('Interior - Space-By-Space'!$AI$56,-1,0)),SUMIF('Interior - Space-By-Space'!$AK$16:OFFSET('Interior - Space-By-Space'!$AK$56,-1,0),$B9,'Interior - Space-By-Space'!$AM$16:OFFSET('Interior - Space-By-Space'!$AM$56,-1,0)),SUMIF('Interior - Space-By-Space'!$AO$16:OFFSET('Interior - Space-By-Space'!$AO$56,-1,0),$B9,'Interior - Space-By-Space'!$AQ$16:OFFSET('Interior - Space-By-Space'!$AQ$56,-1,0))),IF(ProjectMethod=BAM,SUM('Interior - Building Area Method'!$C20,'Interior - Building Area Method'!$E20,'Interior - Building Area Method'!$G20,'Interior - Building Area Method'!$I20,'Interior - Building Area Method'!$K20),0))+SUM(SUMIF(Exterior!$J$19:$J$69,$B9,Exterior!$K$19:$K$69),SUMIF(Exterior!$M$19:$M$69,$B9,Exterior!$N$19:$N$69),SUMIF(Exterior!$P$19:$P$69,$B9,Exterior!$Q$19:$Q$69),SUMIF(Exterior!$S$19:$S$69,$B9,Exterior!$T$19:$T$69),SUMIF(Exterior!$V$19:$V$69,$B9,Exterior!$W$19:$W$69))","v":0}]
[null,null,null,null,{"$f":"IF(ProjectMethod=SBS,SUM(SUMIF('Interior - Space-By-Space'!$M$16:OFFSET('Interior - Space-By-Space'!$M$56,-1,0),$B10,'Interior - Space-By-Space'!$O$16:OFFSET('Interior - Space-By-Space'!$O$56,-1,0)),SUMIF('Interior - Space-By-Space'!$Q$16:OFFSET('Interior - Space-By-Space'!$Q$56,-1,0),$B10,'Interior - Space-By-Space'!$S$16:OFFSET('Interior - Space-By-Space'!$S$56,-1,0)),SUMIF('Interior - Space-By-Space'!$U$16:OFFSET('Interior - Space-By-Space'!$U$56,-1,0),$B10,'Interior - Space-By-Space'!$W$16:OFFSET('Interior - Space-By-Space'!$W$56,-1,0)),SUMIF('Interior - Space-By-Space'!$Y$16:OFFSET('Interior - Space-By-Space'!$Y$56,-1,0),$B10,'Interior - Space-By-Space'!$AA$16:OFFSET('Interior - Space-By-Space'!$AA$56,-1,0)),SUMIF('Interior - Space-By-Space'!$AC$16:OFFSET('Interior - Space-By-Space'!$AC$56,-1,0),$B10,'Interior - Space-By-Space'!$AE$16:OFFSET('Interior - Space-By-Space'!$AE$56,-1,0)),SUMIF('Interior - Space-By-Space'!$AG$16:OFFSET('Interior - Space-By-Space'!$AG$56,-1,0),$B10,'Interior - Space-By-Space'!$AI$16:OFFSET('Interior - Space-By-Space'!$AI$56,-1,0)),SUMIF('Interior - Space-By-Space'!$AK$16:OFFSET('Interior - Space-By-Space'!$AK$56,-1,0),$B10,'Interior - Space-By-Space'!$AM$16:OFFSET('Interior - Space-By-Space'!$AM$56,-1,0)),SUMIF('Interior - Space-By-Space'!$AO$16:OFFSET('Interior - Space-By-Space'!$AO$56,-1,0),$B10,'Interior - Space-By-Space'!$AQ$16:OFFSET('Interior - Space-By-Space'!$AQ$56,-1,0))),IF(ProjectMethod=BAM,SUM('Interior - Building Area Method'!$C21,'Interior - Building Area Method'!$E21,'Interior - Building Area Method'!$G21,'Interior - Building Area Method'!$I21,'Interior - Building Area Method'!$K21),0))+SUM(SUMIF(Exterior!$J$19:$J$69,$B10,Exterior!$K$19:$K$69),SUMIF(Exterior!$M$19:$M$69,$B10,Exterior!$N$19:$N$69),SUMIF(Exterior!$P$19:$P$69,$B10,Exterior!$Q$19:$Q$69),SUMIF(Exterior!$S$19:$S$69,$B10,Exterior!$T$19:$T$69),SUMIF(Exterior!$V$19:$V$69,$B10,Exterior!$W$19:$W$69))","v":0}]
{"$rows_left_out":148}
{"sheet":"Interior - Building Area Method","index":3,"n_rows":168,"n_cols":16,"rows_kept":168,"cut":false,"hidden":false,"merged":[[49,14,49,15],[10,1,10,4],[0,1,0,12],[1,1,1,12],[15,1,15,4],[16,13,16,15],[3,1,3,2],[17,14,17,15],[25,14,25,15],[33,14,33,15],[41,14,41,15],[6,2,6,4],[7,2,7,4],[8,2,8,4],[5,1,5,6]]}
[null,"New Construction Program"]
[null,"Lighting Calculator"]
[null,{"$f":"'Basic Lists'!A100","v":"NCP LC v.4.0"}]
[null,"Interior lighting calculator"]
[]
[null,"Interior totals"]
[null,"LPD savings",{"$f":"IF(SUM($C$14:$K$14)=0,0,(C8*1000)/SUM($C$14:$K$14))","v":0},null,null,null,{"$f":"IF(ProjectUnits=\"Imperial\",\"W/sqft\",\"W/sqm\")","v":"W/sqm"}]
[null,"Demand savings",{"$f":"O59-O61","v":0},null,null,null,"kW"]
[null,"Energy savings",{"$f":"O60-O62","v":0},null,null,null,"kWh"]
[]
{"$rows_left_out":159}
{"sheet":"Interior - Space-By-Space","index":4,"n_rows":56,"n_cols":55,"rows_kept":56,"cut":false,"hidden":false,"merged":[[12,44,12,45],[12,49,12,50],[0,2,0,12],[1,2,1,12],[5,2,5,5],[6,2,6,3],[7,2,7,3],[8,2,8,3],[9,2,9,3],[8,8,9,10],[8,12,9,12],[12,12,12,15]]}
[null,null,"New Construction Program"]
[null,null,"Lighting Calculator"]
[null,null,{"$f":"'Basic Lists'!A100","v":"NCP LC v.4.0"}]
[null,null,"Interior lighting calculator"]
[]
[null,null,"Interior totals"]
[null,null,"Demand savings",null,{"$f":"$AY$56","v":{"$error":"#N/A"}},"kW"]
[null,null,"Energy savings - LPD",null,{"$f":"$AZ$56","v":{"$error":"#N/A"}},"kWh"]
[null,null,"Energy savings - lighting controls",null,{"$f":"$BA$56","v":{"$error":"#N/A"}},"kWh",null,null,"Number of Luminaire Columns to Show:",null,null,null,4]
[null,null,"Energy savings - total",null,{"$f":"$BB$56","v":{"$error":"#N/A"}},"kWh"]
{"$rows_left_out":47}
{"sheet":"Exterior","index":5,"n_rows":70,"n_cols":34,"rows_kept":70,"cut":false,"hidden":false,"merged":[[15,29,15,30],[0,2,0,9],[1,2,1,9],[15,24,15,25],[11,2,11,3],[6,4,6,5],[7,4,7,5],[8,4,8,5],[9,4,9,5],[6,2,6,3],[7,2,7,3],[8,2,8,3],[9,2,9,3],[5,2,5,6],[15,9,15,11]]}
[null,null,"New Construction Program"]
[null,null,"Lighting Calculator"]
[null,null,{"$f":"'Basic Lists'!A100","v":"NCP LC v.4.0"}]
[null,null,"Exterior lighting calculator"]
[]
[null,null,"Exterior totals"]
[null,null,"Demand savings",null,{"$f":"$AE$70","v":0},null,"kW"]
[null,null,"Energy savings - LPD",null,{"$f":"$AF$70","v":0},null,"kWh"]
[null,null,"Energy savings - lighting controls",null,{"$f":"$AG$70","v":0},null,"kWh"]
[null,null,"Energy savings - total",null,{"$f":"$AH$70","v":0},null,"kWh"]
{"$rows_left_out":61}
{"sheet":"ASHRAE","index":6,"n_rows":105,"n_cols":21,"rows_kept":105,"cut":false,"hidden":true,"merged":[]}
["ASHRAE/IES Standard 90.1-2016 Part 9 Lighting"]
[null,null,null,null,null,null,null,null,null,null,null,null,null,null,{"$f":"N2+1","v":1},{"$f":"O2+1","v":2},3,4,5,6,7]
["INTERIOR",null,null,null,null,null,null,"EXTERIOR",null,null,null,null,null,null,"BUILDING TYPES"]
["Proposed effective table",null,null,null,null,null,null,"Proposed effective table",null,null,null,null,null,null,"Proposed effective table",null,null,null,"*","*","*"]
["Proposed space names","LPD (W/sqft ) [default units]",{"$f":"IF(ProjectUnits=\"Imperial\",\"LPD (W/sqft) [active units]\",\"LPD (W/sqm) [active units]\")","v":"LPD (W/sqm) [active units]"},"Annual hours","OS/ TC required?","RCR threshold",null,"Proposed space names","Zone 1 LPD (W/sqft ) [default units]","Zone 2 LPD (W/sqft ) [default units]","Zone 3 LPD (W/sqft ) [default units]","Zone 4 LPD (W/sqft ) [default units]",{"$f":"\"Zone \"&IF(ISBLANK(ProjectZone),\"N/A\",RIGHT(ProjectZone))&\" LPD \"&IF(ProjectUnits=\"Imperial\",\"(W/sqft)\",\"(W/sqm)\")&\" [active zone, active units]\"","v":"Zone N/A LPD (W/sqm) [active zone, active units]"},null,"Proposed building type names","LPD (W/sqft) [default units]",{"$f":"IF(ProjectUnits=\"Imperial\",\"LPD (W/sqft) [active units]\",\"LPD (W/sqm) [active units]\")","v":"LPD (W/sqm) [active units]"},"Hours","Common areas","Washroom/ Locker room","Stairwell"]
["Atrium - first 40ft in height",0.03,{"$f":"IF(ProjectUnits=\"Imperial\",B6,ROUND(B6*3.2808399,1))","v":0.1},3880,null,1000000,null,"Entry canopies",0.2,0.25,0.4,0.4,{"$f":"ROUND(IF(ProjectUnits=\"Imperial\",INDEX(ASHRAE_ExteriorTable,1,RIGHT(ProjectZone)+1),INDEX(ASHRAE_ExteriorTable,1,RIGHT(ProjectZone)+1)*'Basic Lists'!B107),2)","v":{"$error":"#VALUE!"}},null,"Automotive facility",0.71,{"$f":"IF(ProjectUnits=\"Imperial\",P6,ROUND(P6*10.7639104,1))","v":7.6},3210,3880,3100,2910]
["Atrium - height above 40ft",0.02,{"$f":"IF(ProjectUnits=\"Imperial\",B7,ROUND(B7*3.2808399,2))","v":7.0000000000000007E-2},3880,null,1000000,null,"Entrances and exits [linear]",14,14,21,21,{"$f":"ROUND(IF(ProjectUnits=\"Imperial\",INDEX(ASHRAE_ExteriorTable,2,RIGHT(ProjectZone)+1),INDEX(ASHRAE_ExteriorTable,2,RIGHT(ProjectZone)+1)*'Basic Lists'!B106),2)","v":{"$error":"#VALUE!"}},null,"Convention centre",0.76,8.1999999999999993,3530,3880,3100,2910]
["Audience/seating area - for auditorium",0.63,{"$f":"IF(ProjectUnits=\"Imperial\",B8,ROUND(B8*10.7639104,1))","v":6.8},2980,true,6,null,"Dining areas",0.65,0.65,0.75,0.95,{"$f":"ROUND(IF(ProjectUnits=\"Imperial\",INDEX(ASHRAE_ExteriorTable,3,RIGHT(ProjectZone)+1),INDEX(ASHRAE_ExteriorTable,3,RIGHT(ProjectZone)+1)*'Basic Lists'!B107),2)","v":{"$error":"#VALUE!"}},null,"Courthouse",0.9,9.6999999999999993,2820,2930,2340,2200]
["Audience/seating area - for convention centre",0.82,8.8000000000000007,3880,null,4,null,"Landscaping",0.03,0.04,0.04,0.04,{"$f":"ROUND(IF(ProjectUnits=\"Imperial\",INDEX(ASHRAE_ExteriorTable,4,RIGHT(ProjectZone)+1),INDEX(ASHRAE_ExteriorTable,4,RIGHT(ProjectZone)+1)*'Basic Lists'!B107),2)","v":{"$error":"#VALUE!"}},null,"Dining: bar lounge/leisure",0.9,9.6999999999999993,4740,5220,4180,3920]
["Audience/seating area - general",0.42,4.5,2930,null,4,null,"Loading docks - exterior",0.35,0.35,0.35,0.35,{"$f":"ROUND(IF(ProjectUnits=\"Imperial\",INDEX(ASHRAE_ExteriorTable,5,RIGHT(ProjectZone)+1),INDEX(ASHRAE_ExteriorTable,5,RIGHT(ProjectZone)+1)*'Basic Lists'!B107),2)","v":{"$error":"#VALUE!"}},null,"Dining: cafeteria/fast food",0.79,8.5,4590,5220,4180,3920]
{"$rows_left_out":96}
{"sheet":"NECB","index":7,"n_rows":104,"n_cols":17,"rows_kept":104,"cut":false,"hidden":true,"merged":[]}
["National Energy Code of Canada for Buildings (NECB) 2015 Division B Part 4 Lighting"]
[null,null,null,null,null,null,null,null,null,null,null,null,null,{"$f":"M2+1","v":1},{"$f":"N2+1","v":2},3,4]
["INTERIOR",null,null,null,null,null,"EXTERIOR",null,null,null,null,null,null,"BUILDING TYPES"]
["Proposed effective table",null,null,null,null,null,"Proposed effective table",null,null,null,null,null,null,"Proposed effective table"]
["Proposed space names","LPD (W/sqm) [default units]",{"$f":"IF(ProjectUnits=\"Imperial\",\"LPD (W/sqft) [active units]\",\"LPD (W/sqm) [active units]\")","v":"LPD (W/sqm) [active units]"},"Annual hours","OS/ TC Required?",null,"Proposed space names","Zone 1 LPD (W/sqm ) [default units]","Zone 2 LPD (W/sqm ) [default units]","Zone 3 LPD (W/sqm ) [default units]","Zone 4 LPD (W/sqm ) [default units]",{"$f":"\"Zone \"&IF(ISBLANK(ProjectZone),\"N/A\",RIGHT(ProjectZone))&\" LPD \"&IF(ProjectUnits=\"Imperial\",\"(W/sqft)\",\"(W/sqm)\")&\" [active zone, active units]\"","v":"Zone N/A LPD (W/sqm) [active zone, active units]"},null,"Proposed building type names","LPD (W/sqm) [default units]",{"$f":"IF(ProjectUnits=\"Imperial\",\"LPD (W/sqft) [active units]\",\"LPD (W/sqm) [active units]\")","v":"LPD (W/sqm) [active units]"},"Hours"]
[{"$f":"IF(ProjectUnits = \"Imperial\", \"Atrium - first 40ft in height\", \"Atrium - first 12m in height\")","v":"Atrium - first 12m in height"},0.106,{"$f":"IF(ProjectUnits=\"Imperial\",ROUND(B6/3.2808399,2),B6)","v":0.106},3880,null,null,"Entry canopies",2.7,2.7,4.3,4.3,{"$f":"IF(ProjectUnits=\"Imperial\",INDEX(NECB_ExteriorTable,1,RIGHT(ProjectZone)+1)/10.7639104,INDEX(NECB_ExteriorTable,1,RIGHT(ProjectZone)+1))","v":{"$error":"#VALUE!"}},null,"Automotive facility",8.6,{"$f":"IF(ProjectUnits=\"Imperial\",ROUND(O6/10.7639104,2),O6)","v":8.6},3210]
[{"$f":"IF(ProjectUnits = \"Imperial\", \"Atrium - height above 40ft\", \"Atrium - height above 12m\")","v":"Atrium - height above 12m"},7.0999999999999994E-2,{"$f":"IF(ProjectUnits=\"Imperial\",ROUND(B7/3.2808399,2),B7)","v":7.0999999999999994E-2},3880,null,null,"Landscape lighting",0.4,0.5,0.5,0.5,{"$f":"IF(ProjectUnits=\"Imperial\",INDEX(NECB_ExteriorTable,2,RIGHT(ProjectZone)+1)/10.7639104,INDEX(NECB_ExteriorTable,2,RIGHT(ProjectZone)+1))","v":{"$error":"#VALUE!"}},null,"Convention centre",10.9,10.9,3530]
["Audience/seating area - for auditorium",6.8,{"$f":"IF(ProjectUnits=\"Imperial\",ROUND(B8/10.7639104,2),B8)","v":6.8},2980,true,null,"Main entries [linear]",66,66,98,98,{"$f":"ROUND(IF(ProjectUnits=\"Imperial\",INDEX(NECB_ExteriorTable,3,RIGHT(ProjectZone)+1)/'Basic Lists'!$B106,INDEX(NECB_ExteriorTable,3,RIGHT(ProjectZone)+1)),2)","v":{"$error":"#VALUE!"}},null,"Courthouse",10.9,10.9,2820]
["Audience/ seating area - for convention centre",8.9,8.9,3880,null,null,"Open outdoor sales areas, vehicle sales lots",2.7,2.7,5.4,7.5,{"$f":"IF(ProjectUnits=\"Imperial\",INDEX(NECB_ExteriorTable,4,RIGHT(ProjectZone)+1)/10.7639104,INDEX(NECB_ExteriorTable,4,RIGHT(ProjectZone)+1))","v":{"$error":"#VALUE!"}},null,"Dining: bar lounge/leisure",10.9,10.9,4740]
["Audience/seating area - general",4.5999999999999996,4.5999999999999996,2950,null,null,"Other (non-main) entries [linear]",66,66,66,66,{"$f":"ROUND(IF(ProjectUnits=\"Imperial\",INDEX(NECB_ExteriorTable,5,RIGHT(ProjectZone)+1)/'Basic Lists'!$B106,INDEX(NECB_ExteriorTable,5,RIGHT(ProjectZone)+1)),2)","v":{"$error":"#VALUE!"}},null,"Dining: cafeteria/fast food",9.6999999999999993,9.6999999999999993,4590]
{"$rows_left_out":95}
{"sheet":"Basic Lists","index":8,"n_rows":107,"n_cols":18,"rows_kept":107,"cut":false,"hidden":true,"merged":[]}
["Yes_No","Project_Types","Compliance_Types","Building_Zones","Units","Compliance_Code","Interior_ControlsTypes","Control Reduction","Control Reduction (OS Req)","Exterior_ControlsTypes","Control Reduction","OSRequired_Spaces","Technology_Types","Ballast List","BallastTypes_Linear","BallastTypes_HID","N_A","Luminaire_Count"]
["Yes","Energy-Efficient Lighting Design","Building area method","Zone 1","Imperial","ASHRAE/IES Standard 90.1-2016",null,null,null,"Photocell and/or timer",0,"Audience/seating area - for auditorium","T8 Fluor linear ","BallastTypes_Linear","IS-NBF","Magn"," ",3]
["No","System Design","Space-by-space method","Zone 2","Metric","NECB 2015","Manual local switch",0,0,"Photocell and/or timer+OS",0.25,"Classroom/lecture/training - for penitentiary","T5/T5HO Fluor linear","BallastTypes_Linear","IS-LBF","Elec",null,4]
[null,"Whole Building Design",null,"Zone 3",null,null,"Scheduling  (building/ floor level)",0,0,null,null,"Classroom/lecture/training - general","Other Fluor linear ","BallastTypes_Linear","IS-HBF",null,null,5]
[null,"NOT USED",null,"Zone 4",null,null,"High-end trim/ output tuning",0.2,0.2,null,null,"Conference/meeting/multipurpose","CFL pin-based","BallastTypes_HID","HE-IS-NBF",null,null,6]
[null,null,null,null,null,null,"Timer local (enclosed area)",0.2,0,null,null,"Copy/print room","CFL screw-in","N_A","HE-IS-LBF",null,null,7]
[null,null,null,null,null,null,"Dimming manual (enclosed area)",0.1,0.1,null,null,"Dressing/fitting room - for performance arts theatre","Induction","N_A","HE-IS-HBF",null,null,8]
[null,null,null,null,null,null,"Dimming (workstation PC-controlled)",0.15,0.15,null,null,"Dressing/fitting room - for retail","LED","N_A","PrS-NBF"]
[null,null,null,null,null,null,"OS (open space)",0.15,0,null,null,"Guest room","OLED","N_A","PrS-LBF"]
[null,null,null,null,null,null,"OS (private/zoned)",0.25,0,null,null,"Health care - lounge/break","MH/CMH/PSMH","BallastTypes_HID","PrS-HBF"]
{"$rows_left_out":98}
{"sheet":"Sheet1","index":9,"n_rows":0,"n_cols":0,"rows_kept":0,"cut":false,"hidden":true,"merged":[]}