{"text_format":"1","workbook":"xlsx","n_sheets":10,"sheets":["User Guide","Project Info & Results","Luminaire Schedule","Interior - Building Area Method","Interior - Space-By-Space","Exterior","ASHRAE","NECB","Basic Lists","Sheet1"],"not_rendered":{"charts":2,"images":6,"macros":1,"external_links":3,"defined_names":100,"comments":4,"pivot_tables":0},"unopened":[],"bounds":{"document_bytes":16777216,"sheet_cells":100000,"rows_first":2000,"rows_last":500,"rows_between":2000,"halvings":0,"cell_chars":16384,"cell_head_chars":4096},"cells_cut":0,"cells_raw":0,"read":"whole","date_system":"1900"}

{"sheet":"User Guide","index":0,"n_rows":83,"n_cols":2,"rows_kept":83,"cut":false,"hidden":false,"merged":[[0,1,0,13],[1,1,1,13],[82,0,82,1]]}
[null,"New Construction Program"]
[null,"Lighting Calculator User Guide"]
[null,{"$f":"'Basic Lists'!A100","v":"NCP LC v.4.0"}]
[]
[]
[]
[]
[]
[]
[]
[]
[]
[]
[]
[]
[]
[]
[]
[]
[]
[]
[]
[]
[]
[]
[]
[]
[]
[]
[]
[]
[]
[]
[]
[]
[]
[]
[]
[]
[]
[]
[]
[]
[]
[]
[]
[]
[]
[]
[]
[]
[]
[]
[]
[]
[]
[]
[]
[]
[]
[]
[]
[]
[]
[]
[]
[]
[]
[]
[]
[]
[]
[]
[]
[]
[]
[]
[]
[]
[]
[]
[]
[{"$f":"'Basic Lists'!A101","v":"2019-01-15"}]

{"sheet":"Project Info & Results","index":1,"n_rows":24,"n_cols":8,"rows_kept":24,"cut":false,"hidden":false,"merged":[[0,1,0,4],[1,1,1,4],[3,4,3,7],[19,5,19,7]]}
[null,"New Construction Program"]
[null,"Lighting Calculator"]
[null,{"$f":"'Basic Lists'!A100","v":"NCP LC v.4.0"}]
[null,"Project information",null,null,"Project totals"]
[]
[null,"Project name",null,null,null,"Interior","Exterior","Total"]
[null,"Project site address",null,null,"Baseline demand, kW",{"$f":"IF(ProjectMethod=SBS,'Interior - Space-By-Space'!$AV$56,IF(ProjectMethod=BAM,'Interior - Building Area Method'!$O$59,0))","v":0},{"$f":"IF(ISNUMBER(Exterior!$AB$70),Exterior!$AB$70,0)","v":0},{"$f":"F7+G7","v":0}]
[null,"Customer contact name",null,null,"Baseline energy consumption, kWh",{"$f":"IF(ProjectMethod=SBS,'Interior - Space-By-Space'!$AT$56,IF(ProjectMethod=BAM,'Interior - Building Area Method'!$O$60,0))","v":0},{"$f":"IF(ISNUMBER(Exterior!$Z$70),Exterior!$Z$70,0)","v":0},{"$f":"F8+G8","v":0}]
[null,"Customer contact phone #",null,null,"Design demand, kW",{"$f":"IF(ProjectMethod=SBS,'Interior - Space-By-Space'!$AW$56,IF(ProjectMethod=BAM,'Interior - Building Area Method'!$O$61,0))","v":0},{"$f":"Exterior!$AC$70","v":0},0]
[null,"Consultant company",null,null,"Design energy consumption, kWh",{"$f":"IF(ProjectMethod=SBS,'Interior - Space-By-Space'!$AU$56,IF(ProjectMethod=BAM,'Interior - Building Area Method'!$O$62,0))","v":0},{"$f":"Exterior!$AA$70","v":0},0]
[null,"Consultant name",null,null,"Demand savings, kW",{"$f":"F7-F9","v":0},{"$f":"G7-G9","v":0},0]
[null,"Consultant phone #",null,null,"Lighting energy savings, kWh",{"$f":"F8-F10","v":0},{"$f":"G8-G10","v":0},0]
[]
[null,"Compliance method*",null,null,"Energy concervation measure","Demand savings, kW",null,"Energy savings, kWh"]
[null,"Compliance code*",null,null,"LPD reduction - interior",{"$f":"IF(ProjectMethod=SBS,'Interior - Space-By-Space'!$AY$56,IF(ProjectMethod=BAM,'Interior - Building Area Method'!$O$59-'Interior - Building Area Method'!$O$61,0))","v":0},null,{"$f":"IF(ProjectMethod=SBS,'Interior - Space-By-Space'!$AZ$56,IF(ProjectMethod=BAM,'Interior - Building Area Method'!$O$60-'Interior - Building Area Method'!$O$62,0))","v":0}]
[null,"Project design date",null,null,"Lighting controls - interior",null,null,{"$f":"IF(ProjectMethod=SBS,'Interior - Space-By-Space'!$BA$56,0)","v":0}]
[null,"Estimated completion date",null,null,"LPD  reduction  - exterior",{"$f":"IF(ISNUMBER(Exterior!$AE$70),Exterior!$AE$70,0)","v":0},null,{"$f":"IF(ISNUMBER(Exterior!$AF$70),Exterior!$AF$70,0)","v":0}]
[null,"Unit system*",null,null,"Lighting controls - exterior",null,null,{"$f":"Exterior!$AG$70","v":0}]
[null,"Primary building type*",null,null,"Total project lighting energy savings, kWh",null,null,{"$f":"H12","v":0}]
[null,"* REQUIRED INFO"]
[null,"Data for Chart",null,null,"Data for incentive calculation"]
[null,"Design Energy Consumption",{"$f":"H10","v":0},null,"Project interior area (sqft)",{"$f":"IF(ProjectUnits=\"Imperial\",1,10.736)*IF(ProjectMethod=SBS,'Interior - Space-By-Space'!J56,IF(ProjectMethod=BAM,SUM('Interior - Building Area Method'!C14,'Interior - Building Area Method'!E14,'Interior - Building Area Method'!G14,'Interior - Building Area Method'!I14,'Interior - Building Area Method'!K14),0))","v":0}]
[null,"LPD Reduction",{"$f":"IF((H15+H17)<0,0,H15+H17)","v":0},null,"Project total area (active units)",{"$f":"IF(ProjectMethod=SBS,'Interior - Space-By-Space'!$J$56,IF(ProjectMethod=BAM,SUM('Interior - Building Area Method'!$C$14,'Interior - Building Area Method'!$E$14,'Interior - Building Area Method'!$G$14,'Interior - Building Area Method'!$I$14,'Interior - Building Area Method'!$K$14),0))+Exterior!$G$70","v":0}]
[null,"Lighting Controls",{"$f":"IF((H16+H18)<0,0,H16+H18)","v":0}]

{"sheet":"Luminaire Schedule","index":2,"n_rows":157,"n_cols":5,"rows_kept":157,"cut":false,"hidden":false,"merged":[[0,1,0,4],[1,1,1,4],[3,1,3,4]]}
[null,"New Construction Program"]
[null,"Lighting Calculator"]
[null,{"$f":"'Basic Lists'!A100","v":"NCP LC v.4.0"}]
[null,"Luminaire schedule"]
["Example","A1","2'x4' recessed drywall flange LED panel luminaire with 0-10V dimmind driver and integrated OS, 4500lm, 3500K",48,100]
[null,"Luminaire type","Luminaire description","Luminaire input wattage","# of luminaires"]
[null,null,null,null,{"$f":"IF(ProjectMethod=SBS,SUM(SUMIF('Interior - Space-By-Space'!$M$16:OFFSET('Interior - Space-By-Space'!$M$56,-1,0),$B7,'Interior - Space-By-Space'!$O$16:OFFSET('Interior - Space-By-Space'!$O$56,-1,0)),SUMIF('Interior - Space-By-Space'!$Q$16:OFFSET('Interior - Space-By-Space'!$Q$56,-1,0),$B7,'Interior - Space-By-Space'!$S$16:OFFSET('Interior - Space-By-Space'!$S$56,-1,0)),SUMIF('Interior - Space-By-Space'!$U$16:OFFSET('Interior - Space-By-Space'!$U$56,-1,0),$B7,'Interior - Space-By-Space'!$W$16:OFFSET('Interior - Space-By-Space'!$W$56,-1,0)),SUMIF('Interior - Space-By-Space'!$Y$16:OFFSET('Interior - Space-By-Space'!$Y$56,-1,0),$B7,'Interior - Space-By-Space'!$AA$16:OFFSET('Interior - Space-By-Space'!$AA$56,-1,0)),SUMIF('Interior - Space-By-Space'!$AC$16:OFFSET('Interior - Space-By-Space'!$AC$56,-1,0),$B7,'Interior - Space-By-Space'!$AE$16:OFFSET('Interior - Space-By-Space'!$AE$56,-1,0)),SUMIF('Interior - Space-By-Space'!$AG$16:OFFSET('Interior - Space-By-Space'!$AG$56,-1,0),$B7,'Interior - Space-By-Space'!$AI$16:OFFSET('Interior - Space-By-Space'!$AI$56,-1,0)),SUMIF('Interior - Space-By-Space'!$AK$16:OFFSET('Interior - Space-By-Space'!$AK$56,-1,0),$B7,'Interior - Space-By-Space'!$AM$16:OFFSET('Interior - Space-By-Space'!$AM$56,-1,0)),SUMIF('Interior - Space-By-Space'!$AO$16:OFFSET('Interior - Space-By-Space'!$AO$56,-1,0),$B7,'Interior - Space-By-Space'!$AQ$16:OFFSET('Interior - Space-By-Space'!$AQ$56,-1,0))),IF(ProjectMethod=BAM,SUM('Interior - Building Area Method'!$C18,'Interior - Building Area Method'!$E18,'Interior - Building Area Method'!$G18,'Interior - Building Area Method'!$I18,'Interior - Building Area Method'!$K18),0))+SUM(SUMIF(Exterior!$J$19:$J$69,$B7,Exterior!$K$19:$K$69),SUMIF(Exterior!$M$19:$M$69,$B7,Exterior!$N$19:$N$69),SUMIF(Exterior!$P$19:$P$69,$B7,Exterior!$Q$19:$Q$69),SUMIF(Exterior!$S$19:$S$69,$B7,Exterior!$T$19:$T$69),SUMIF(Exterior!$V$19:$V$69,$B7,Exterior!$W$19:$W$69))","v":0}]
[null,null,null,null,{"$f":"IF(ProjectMethod=SBS,SUM(SUMIF('Interior - Space-By-Space'!$M$16:OFFSET('Interior - Space-By-Space'!$M$56,-1,0),$B8,'Interior - Space-By-Space'!$O$16:OFFSET('Interior - Space-By-Space'!$O$56,-1,0)),SUMIF('Interior - Space-By-Space'!$Q$16:OFFSET('Interior - Space-By-Space'!$Q$56,-1,0),$B8,'Interior - Space-By-Space'!$S$16:OFFSET('Interior - Space-By-Space'!$S$56,-1,0)),SUMIF('Interior - Space-By-Space'!$U$16:OFFSET('Interior - Space-By-Space'!$U$56,-1,0),$B8,'Interior - Space-By-Space'!$W$16:OFFSET('Interior - Space-By-Space'!$W$56,-1,0)),SUMIF('Interior - Space-By-Space'!$Y$16:OFFSET('Interior - Space-By-Space'!$Y$56,-1,0),$B8,'Interior - Space-By-Space'!$AA$16:OFFSET('Interior - Space-By-Space'!$AA$56,-1,0)),SUMIF('Interior - Space-By-Space'!$AC$16:OFFSET('Interior - Space-By-Space'!$AC$56,-1,0),$B8,'Interior - Space-By-Space'!$AE$16:OFFSET('Interior - Space-By-Space'!$AE$56,-1,0)),SUMIF('Interior - Space-By-Space'!$AG$16:OFFSET('Interior - Space-By-Space'!$AG$56,-1,0),$B8,'Interior - Space-By-Space'!$AI$16:OFFSET('Interior - Space-By-Space'!$AI$56,-1,0)),SUMIF('Interior - Space-By-Space'!$AK$16:OFFSET('Interior - Space-By-Space'!$AK$56,-1,0),$B8,'Interior - Space-By-Space'!$AM$16:OFFSET('Interior - Space-By-Space'!$AM$56,-1,0)),SUMIF('Interior - Space-By-Space'!$AO$16:OFFSET('Interior - Space-By-Space'!$AO$56,-1,0),$B8,'Interior - Space-By-Space'!$AQ$16:OFFSET('Interior - Space-By-Space'!$AQ$56,-1,0))),IF(ProjectMethod=BAM,SUM('Interior - Building Area Method'!$C19,'Interior - Building Area Method'!$E19,'Interior - Building Area Method'!$G19,'Interior - Building Area Method'!$I19,'Interior - Building Area Method'!$K19),0))+SUM(SUMIF(Exterior!$J$19:$J$69,$B8,Exterior!$K$19:$K$69),SUMIF(Exterior!$M$19:$M$69,$B8,Exterior!$N$19:$N$69),SUMIF(Exterior!$P$19:$P$69,$B8,Exterior!$Q$19:$Q$69),SUMIF(Exterior!$S$19:$S$69,$B8,Exterior!$T$19:$T$69),SUMIF(Exterior!$V$19:$V$69,$B8,Exterior!$W$19:$W$69))","v":0}]
[null,null,null,null,{"$f":"IF(ProjectMethod=SBS,SUM(SUMIF('Interior - Space-By-Space'!$M$16:OFFSET('Interior - Space-By-Space'!$M$56,-1,0),$B9,'Interior - Space-By-Space'!$O$16:OFFSET('Interior - Space-By-Space'!$O$56,-1,0)),SUMIF('Interior - Space-By-Space'!$Q$16:OFFSET('Interior - Space-By-Space'!$Q$56,-1,0),$B9,'Interior - Space-By-Space'!$S$16:OFFSET('Interior - Space-By-Space'!$S$56,-1,0)),SUMIF('Interior - Space-By-Space'!$U$16:OFFSET('Interior - Space-By-Space'!$U$56,-1,0),$B9,'Interior - Space-By-Space'!$W$16:OFFSET('Interior - Space-By-Space'!$W$56,-1,0)),SUMIF('Interior - Space-By-Space'!$Y$16:OFFSET('Interior - Space-By-Space'!$Y$56,-1,0),$B9,'Interior - Space-By-Space'!$AA$16:OFFSET('Interior - Space-By-Space'!$AA$56,-1,0)),SUMIF('Interior - Space-By-Space'!$AC$16:OFFSET('Interior - Space-By-Space'!$AC$56,-1,0),$B9,'Interior - Space-By-Space'!$AE$16:OFFSET('Interior - Space-By-Space'!$AE$56,-1,0)),SUMIF('Interior - Space-By-Space'!$AG$16:OFFSET('Interior - Space-By-Space'!$AG$56,-1,0),$B9,'Interior - Space-By-Space'!$AI$16:OFFSET('Interior - Space-By-Space'!$AI$56,-1,0)),SUMIF('Interior - Space-By-Space'!$AK$16:OFFSET('Interior - Space-By-Space'!$AK$56,-1,0),$B9,'Interior - Space-By-Space'!$AM$16:OFFSET('Interior - Space-By-Space'!$AM$56,-1,0)),SUMIF('Interior - Space-By-Space'!$AO$16:OFFSET('Interior - Space-By-Space'!$AO$56,-1,0),$B9,'Interior - Space-By-Space'!$AQ$16:OFFSET('Interior - Space-By-Space'!$AQ$56,-1,0))),IF(ProjectMethod=BAM,SUM('Interior - Building Area Method'!$C20,'Interior - Building Area Method'!$E20,'Interior - Building Area Method'!$G20,'Interior - Building Area Method'!$I20,'Interior - Building Area Method'!$K20),0))+SUM(SUMIF(Exterior!$J$19:$J$69,$B9,Exterior!$K$19:$K$69),SUMIF(Exterior!$M$19:$M$69,$B9,Exterior!$N$19:$N$69),SUMIF(Exterior!$P$19:$P$69,$B9,Exterior!$Q$19:$Q$69),SUMIF(Exterior!$S$19:$S$69,$B9,Exterior!$T$19:$T$69),SUMIF(Exterior!$V$19:$V$69,$B9,Exterior!$W$19:$W$69))","v":0}]
[null,null,null,null,{"$f":"IF(ProjectMethod=SBS,SUM(SUMIF('Interior - Space-By-Space'!$M$16:OFFSET('Interior - Space-By-Space'!$M$56,-1,0),$B10,'Interior - Space-By-Space'!$O$16:OFFSET('Interior - Space-By-Space'!$O$56,-1,0)),SUMIF('Interior - Space-By-Space'!$Q$16:OFFSET('Interior - Space-By-Space'!$Q$56,-1,0),$B10,'Interior - Space-By-Space'!$S$16:OFFSET('Interior - Space-By-Space'!$S$56,-1,0)),SUMIF('Interior - Space-By-Space'!$U$16:OFFSET('Interior - Space-By-Space'!$U$56,-1,0),$B10,'Interior - Space-By-Space'!$W$16:OFFSET('Interior - Space-By-Space'!$W$56,-1,0)),SUMIF('Interior - Space-By-Space'!$Y$16:OFFSET('Interior - Space-By-Space'!$Y$56,-1,0),$B10,'Interior - Space-By-Space'!$AA$16:OFFSET('Interior - Space-By-Space'!$AA$56,-1,0)),SUMIF('Interior - Space-By-Space'!$AC$16:OFFSET('Interior - Space-By-Space'!$AC$56,-1,0),$B10,'Interior - Space-By-Space'!$AE$16:OFFSET('Interior - Space-By-Space'!$AE$56,-1,0)),SUMIF('Interior - Space-By-Space'!$AG$16:OFFSET('Interior - Space-By-Space'!$AG$56,-1,0),$B10,'Interior - Space-By-Space'!$AI$16:OFFSET('Interior - Space-By-Space'!$AI$56,-1,0)),SUMIF('Interior - Space-By-Space'!$AK$16:OFFSET('Interior - Space-By-Space'!$AK$56,-1,0),$B10,'Interior - Space-By-Space'!$AM$16:OFFSET('Interior - Space-By-Space'!$AM$56,-1,0)),SUMIF('Interior - Space-By-Space'!$AO$16:OFFSET('Interior - Space-By-Space'!$AO$56,-1,0),$B10,'Interior - Space-By-Space'!$AQ$16:OFFSET('Interior - Space-By-Space'!$AQ$56,-1,0))),IF(ProjectMethod=BAM,SUM('Interior - Building Area Method'!$C21,'Interior - Building Area Method'!$E21,'Interior - Building Area Method'!$G21,'Interior - Building Area Method'!$I21,'Interior - Building Area Method'!$K21),0))+SUM(SUMIF(Exterior!$J$19:$J$69,$B10,Exterior!$K$19:$K$69),SUMIF(Exterior!$M$19:$M$69,$B10,Exterior!$N$19:$N$69),SUMIF(Exterior!$P$19:$P$69,$B10,Exterior!$Q$19:$Q$69),SUMIF(Exterior!$S$19:$S$69,$B10,Exterior!$T$19:$T$69),SUMIF(Exterior!$V$19:$V$69,$B10,Exterior!$W$19:$W$69))","v":0}]
[null,null,null,null,{"$f":"IF(ProjectMethod=SBS,SUM(SUMIF('Interior - Space-By-Space'!$M$16:OFFSET('Interior - Space-By-Space'!$M$56,-1,0),$B11,'Interior - Space-By-Space'!$O$16:OFFSET('Interior - Space-By-Space'!$O$56,-1,0)),SUMIF('Interior - Space-By-Space'!$Q$16:OFFSET('Interior - Space-By-Space'!$Q$56,-1,0),$B11,'Interior - Space-By-Space'!$S$16:OFFSET('Interior - Space-By-Space'!$S$56,-1,0)),SUMIF('Interior - Space-By-Space'!$U$16:OFFSET('Interior - Space-By-Space'!$U$56,-1,0),$B11,'Interior - Space-By-Space'!$W$16:OFFSET('Interior - Space-By-Space'!$W$56,-1,0)),SUMIF('Interior - Space-By-Space'!$Y$16:OFFSET('Interior - Space-By-Space'!$Y$56,-1,0),$B11,'Interior - Space-By-Space'!$AA$16:OFFSET('Interior - Space-By-Space'!$AA$56,-1,0)),SUMIF('Interior - Space-By-Space'!$AC$16:OFFSET('Interior - Space-By-Space'!$AC$56,-1,0),$B11,'Interior - Space-By-Space'!$AE$16:OFFSET('Interior - Space-By-Space'!$AE$56,-1,0)),SUMIF('Interior - Space-By-Space'!$AG$16:OFFSET('Interior - Space-By-Space'!$AG$56,-1,0),$B11,'Interior - Space-By-Space'!$AI$16:OFFSET('Interior - Space-By-Space'!$AI$56,-1,0)),SUMIF('Interior - Space-By-Space'!$AK$16:OFFSET('Interior - Space-By-Space'!$AK$56,-1,0),$B11,'Interior - Space-By-Space'!$AM$16:OFFSET('Interior - Space-By-Space'!$AM$56,-1,0)),SUMIF('Interior - Space-By-Space'!$AO$16:OFFSET('Interior - Space-By-Space'!$AO$56,-1,0),$B11,'Interior - Space-By-Space'!$AQ$16:OFFSET('Interior - Space-By-Space'!$AQ$56,-1,0))),IF(ProjectMethod=BAM,SUM('Interior - Building Area Method'!$C22,'Interior - Building Area Method'!$E22,'Interior - Building Area Method'!$G22,'Interior - Building Area Method'!$I22,'Interior - Building Area Method'!$K22),0))+SUM(SUMIF(Exterior!$J$19:$J$69,$B11,Exterior!$K$19:$K$69),SUMIF(Exterior!$M$19:$M$69,$B11,Exterior!$N$19:$N$69),SUMIF(Exterior!$P$19:$P$69,$B11,Exterior!$Q$19:$Q$69),SUMIF(Exterior!$S$19:$S$69,$B11,Exterior!$T$19:$T$69),SUMIF(Exterior!$V$19:$V$69,$B11,Exterior!$W$19:$W$69))","v":0}]
[null,null,null,null,{"$f":"IF(ProjectMethod=SBS,SUM(SUMIF('Interior - Space-By-Space'!$M$16:OFFSET('Interior - Space-By-Space'!$M$56,-1,0),$B12,'Interior - Space-By-Space'!$O$16:OFFSET('Interior - Space-By-Space'!$O$56,-1,0)),SUMIF('Interior - Space-By-Space'!$Q$16:OFFSET('Interior - Space-By-Space'!$Q$56,-1,0),$B12,'Interior - Space-By-Space'!$S$16:OFFSET('Interior - Space-By-Space'!$S$56,-1,0)),SUMIF('Interior - Space-By-Space'!$U$16:OFFSET('Interior - Space-By-Space'!$U$56,-1,0),$B12,'Interior - Space-By-Space'!$W$16:OFFSET('Interior - Space-By-Space'!$W$56,-1,0)),SUMIF('Interior - Space-By-Space'!$Y$16:OFFSET('Interior - Space-By-Space'!$Y$56,-1,0),$B12,'Interior - Space-By-Space'!$AA$16:OFFSET('Interior - Space-By-Space'!$AA$56,-1,0)),SUMIF('Interior - Space-By-Space'!$AC$16:OFFSET('Interior - Space-By-Space'!$AC$56,-1,0),$B12,'Interior - Space-By-Space'!$AE$16:OFFSET('Interior - Space-By-Space'!$AE$56,-1,0)),SUMIF('Interior - Space-By-Space'!$AG$16:OFFSET('Interior - Space-By-Space'!$AG$56,-1,0),$B12,'Interior - Space-By-Space'!$AI$16:OFFSET('Interior - Space-By-Space'!$AI$56,-1,0)),SUMIF('Interior - Space-By-Space'!$AK$16:OFFSET('Interior - Space-By-Space'!$AK$56,-1,0),$B12,'Interior - Space-By-Space'!$AM$16:OFFSET('Interior - Space-By-Space'!$AM$56,-1,0)),SUMIF('Interior - Space-By-Space'!$AO$16:OFFSET('Interior - Space-By-Space'!$AO$56,-1,0),$B12,'Interior - Space-By-Space'!$AQ$16:OFFSET('Interior - Space-By-Space'!$AQ$56,-1,0))),IF(ProjectMethod=BAM,SUM('Interior - Building Area Method'!$C23,'Interior - Building Area Method'!$E23,'Interior - Building Area Method'!$G23,'Interior - Building Area Method'!$I23,'Interior - Building Area Method'!$K23),0))+SUM(SUMIF(Exterior!$J$19:$J$69,$B12,Exterior!$K$19:$K$69),SUMIF(Exterior!$M$19:$M$69,$B12,Exterior!$N$19:$N$69),SUMIF(Exterior!$P$19:$P$69,$B12,Exterior!$Q$19:$Q$69),SUMIF(Exterior!$S$19:$S$69,$B12,Exterior!$T$19:$T$69),SUMIF(Exterior!$V$19:$V$69,$B12,Exterior!$W$19:$W$69))","v":0}]
[null,null,null,null,{"$f":"IF(ProjectMethod=SBS,SUM(SUMIF('Interior - Space-By-Space'!$M$16:OFFSET('Interior - Space-By-Space'!$M$56,-1,0),$B13,'Interior - Space-By-Space'!$O$16:OFFSET('Interior - Space-By-Space'!$O$56,-1,0)),SUMIF('Interior - Space-By-Space'!$Q$16:OFFSET('Interior - Space-By-Space'!$Q$56,-1,0),$B13,'Interior - Space-By-Space'!$S$16:OFFSET('Interior - Space-By-Space'!$S$56,-1,0)),SUMIF('Interior - Space-By-Space'!$U$16:OFFSET('Interior - Space-By-Space'!$U$56,-1,0),$B13,'Interior - Space-By-Space'!$W$16:OFFSET('Interior - Space-By-Space'!$W$56,-1,0)),SUMIF('Interior - Space-By-Space'!$Y$16:OFFSET('Interior - Space-By-Space'!$Y$56,-1,0),$B13,'Interior - Space-By-Space'!$AA$16:OFFSET('Interior - Space-By-Space'!$AA$56,-1,0)),SUMIF('Interior - Space-By-Space'!$AC$16:OFFSET('Interior - Space-By-Space'!$AC$56,-1,0),$B13,'Interior - Space-By-Space'!$AE$16:OFFSET('Interior - Space-By-Space'!$AE$56,-1,0)),SUMIF('Interior - Space-By-Space'!$AG$16:OFFSET('Interior - Space-By-Space'!$AG$56,-1,0),$B13,'Interior - Space-By-Space'!$AI$16:OFFSET('Interior - Space-By-Space'!$AI$56,-1,0)),SUMIF('Interior - Space-By-Space'!$AK$16:OFFSET('Interior - Space-By-Space'!$AK$56,-1,0),$B13,'Interior - Space-By-Space'!$AM$16:OFFSET('Interior - Space-By-Space'!$AM$56,-1,0)),SUMIF('Interior - Space-By-Space'!$AO$16:OFFSET('Interior - Space-By-Space'!$AO$56,-1,0),$B13,'Interior - Space-By-Space'!$AQ$16:OFFSET('Interior - Space-By-Space'!$AQ$56,-1,0))),IF(ProjectMethod=BAM,SUM('Interior - Building Area Method'!$C24,'Interior - Building Area Method'!$E24,'Interior - Building Area Method'!$G24,'Interior - Building Area Method'!$I24,'Interior - Building Area Method'!$K24),0))+SUM(SUMIF(Exterior!$J$19:$J$69,$B13,Exterior!$K$19:$K$69),SUMIF(Exterior!$M$19:$M$69,$B13,Exterior!$N$19:$N$69),SUMIF(Exterior!$P$19:$P$69,$B13,Exterior!$Q$19:$Q$69),SUMIF(Exterior!$S$19:$S$69,$B13,Exterior!$T$19:$T$69),SUMIF(Exterior!$V$19:$V$69,$B13,Exterior!$W$19:$W$69))","v":0}]
[null,null,null,null,{"$f":"IF(ProjectMethod=SBS,SUM(SUMIF('Interior - Space-By-Space'!$M$16:OFFSET('Interior - Space-By-Space'!$M$56,-1,0),$B14,'Interior - Space-By-Space'!$O$16:OFFSET('Interior - Space-By-Space'!$O$56,-1,0)),SUMIF('Interior - Space-By-Space'!$Q$16:OFFSET('Interior - Space-By-Space'!$Q$56,-1,0),$B14,'Interior - Space-By-Space'!$S$16:OFFSET('Interior - Space-By-Space'!$S$56,-1,0)),SUMIF('Interior - Space-By-Space'!$U$16:OFFSET('Interior - Space-By-Space'!$U$56,-1,0),$B14,'Interior - Space-By-Space'!$W$16:OFFSET('Interior - Space-By-Space'!$W$56,-1,0)),SUMIF('Interior - Space-By-Space'!$Y$16:OFFSET('Interior - Space-By-Space'!$Y$56,-1,0),$B14,'Interior - Space-By-Space'!$AA$16:OFFSET('Interior - Space-By-Space'!$AA$56,-1,0)),SUMIF('Interior - Space-By-Space'!$AC$16:OFFSET('Interior - Space-By-Space'!$AC$56,-1,0),$B14,'Interior - Space-By-Space'!$AE$16:OFFSET('Interior - Space-By-Space'!$AE$56,-1,0)),SUMIF('Interior - Space-By-Space'!$AG$16:OFFSET('Interior - Space-By-Space'!$AG$56,-1,0),$B14,'Interior - Space-By-Space'!$AI$16:OFFSET('Interior - Space-By-Space'!$AI$56,-1,0)),SUMIF('Interior - Space-By-Space'!$AK$16:OFFSET('Interior - Space-By-Space'!$AK$56,-1,0),$B14,'Interior - Space-By-Space'!$AM$16:OFFSET('Interior - Space-By-Space'!$AM$56,-1,0)),SUMIF('Interior - Space-By-Space'!$AO$16:OFFSET('Interior - Space-By-Space'!$AO$56,-1,0),$B14,'Interior - Space-By-Space'!$AQ$16:OFFSET('Interior - Space-By-Space'!$AQ$56,-1,0))),IF(ProjectMethod=BAM,SUM('Interior - Building Area Method'!$C25,'Interior - Building Area Method'!$E25,'Interior - Building Area Method'!$G25,'Interior - Building Area Method'!$I25,'Interior - Building Area Method'!$K25),0))+SUM(SUMIF(Exterior!$J$19:$J$69,$B14,Exterior!$K$19:$K$69),SUMIF(Exterior!$M$19:$M$69,$B14,Exterior!$N$19:$N$69),SUMIF(Exterior!$P$19:$P$69,$B14,Exterior!$Q$19:$Q$69),SUMIF(Exterior!$S$19:$S$69,$B14,Exterior!$T$19:$T$69),SUMIF(Exterior!$V$19:$V$69,$B14,Exterior!$W$19:$W$69))","v":0}]
[null,null,null,null,{"$f":"IF(ProjectMethod=SBS,SUM(SUMIF('Interior - Space-By-Space'!$M$16:OFFSET('Interior - Space-By-Space'!$M$56,-1,0),$B15,'Interior - Space-By-Space'!$O$16:OFFSET('Interior - Space-By-Space'!$O$56,-1,0)),SUMIF('Interior - Space-By-Space'!$Q$16:OFFSET('Interior - Space-By-Space'!$Q$56,-1,0),$B15,'Interior - Space-By-Space'!$S$16:OFFSET('Interior - Space-By-Space'!$S$56,-1,0)),SUMIF('Interior - Space-By-Space'!$U$16:OFFSET('Interior - Space-By-Space'!$U$56,-1,0),$B15,'Interior - Space-By-Space'!$W$16:OFFSET('Interior - Space-By-Space'!$W$56,-1,0)),SUMIF('Interior - Space-By-Space'!$Y$16:OFFSET('Interior - Space-By-Space'!$Y$56,-1,0),$B15,'Interior - Space-By-Space'!$AA$16:OFFSET('Interior - Space-By-Space'!$AA$56,-1,0)),SUMIF('Interior - Space-By-Space'!$AC$16:OFFSET('Interior - Space-By-Space'!$AC$56,-1,0),$B15,'Interior - Space-By-Space'!$AE$16:OFFSET('Interior - Space-By-Space'!$AE$56,-1,0)),SUMIF('Interior - Space-By-Space'!$AG$16:OFFSET('Interior - Space-By-Space'!$AG$56,-1,0),$B15,'Interior - Space-By-Space'!$AI$16:OFFSET('Interior - Space-By-Space'!$AI$56,-1,0)),SUMIF('Interior - Space-By-Space'!$AK$16:OFFSET('Interior - Space-By-Space'!$AK$56,-1,0),$B15,'Interior - Space-By-Space'!$AM$16:OFFSET('Interior - Space-By-Space'!$AM$56,-1,0)),SUMIF('Interior - Space-By-Space'!$AO$16:OFFSET('Interior - Space-By-Space'!$AO$56,-1,0),$B15,'Interior - Space-By-Space'!$AQ$16:OFFSET('Interior - Space-By-Space'!$AQ$56,-1,0))),IF(ProjectMethod=BAM,SUM('Interior - Building Area Method'!$C26,'Interior - Building Area Method'!$E26,'Interior - Building Area Method'!$G26,'Interior - Building Area Method'!$I26,'Interior - Building Area Method'!$K26),0))+SUM(SUMIF(Exterior!$J$19:$J$69,$B15,Exterior!$K$19:$K$69),SUMIF(Exterior!$M$19:$M$69,$B15,Exterior!$N$19:$N$69),SUMIF(Exterior!$P$19:$P$69,$B15,Exterior!$Q$19:$Q$69),SUMIF(Exterior!$S$19:$S$69,$B15,Exterior!$T$19:$T$69),SUMIF(Exterior!$V$19:$V$69,$B15,Exterior!$W$19:$W$69))","v":0}]
[null,null,null,null,{"$f":"IF(ProjectMethod=SBS,SUM(SUMIF('Interior - Space-By-Space'!$M$16:OFFSET('Interior - Space-By-Space'!$M$56,-1,0),$B16,'Interior - Space-By-Space'!$O$16:OFFSET('Interior - Space-By-Space'!$O$56,-1,0)),SUMIF('Interior - Space-By-Space'!$Q$16:OFFSET('Interior - Space-By-Space'!$Q$56,-1,0),$B16,'Interior - Space-By-Space'!$S$16:OFFSET('Interior - Space-By-Space'!$S$56,-1,0)),SUMIF('Interior - Space-By-Space'!$U$16:OFFSET('Interior - Space-By-Space'!$U$56,-1,0),$B16,'Interior - Space-By-Space'!$W$16:OFFSET('Interior - Space-By-Space'!$W$56,-1,0)),SUMIF('Interior - Space-By-Space'!$Y$16:OFFSET('Interior - Space-By-Space'!$Y$56,-1,0),$B16,'Interior - Space-By-Space'!$AA$16:OFFSET('Interior - Space-By-Space'!$AA$56,-1,0)),SUMIF('Interior - Space-By-Space'!$AC$16:OFFSET('Interior - Space-By-Space'!$AC$56,-1,0),$B16,'Interior - Space-By-Space'!$AE$16:OFFSET('Interior - Space-By-Space'!$AE$56,-1,0)),SUMIF('Interior - Space-By-Space'!$AG$16:OFFSET('Interior - Space-By-Space'!$AG$56,-1,0),$B16,'Interior - Space-By-Space'!$AI$16:OFFSET('Interior - Space-By-Space'!$AI$56,-1,0)),SUMIF('Interior - Space-By-Space'!$AK$16:OFFSET('Interior - Space-By-Space'!$AK$56,-1,0),$B16,'Interior - Space-By-Space'!$AM$16:OFFSET('Interior - Space-By-Space'!$AM$56,-1,0)),SUMIF('Interior - Space-By-Space'!$AO$16:OFFSET('Interior - Space-By-Space'!$AO$56,-1,0),$B16,'Interior - Space-By-Space'!$AQ$16:OFFSET('Interior - Space-By-Space'!$AQ$56,-1,0))),IF(ProjectMethod=BAM,SUM('Interior - Building Area Method'!$C27,'Interior - Building Area Method'!$E27,'Interior - Building Area Method'!$G27,'Interior - Building Area Method'!$I27,'Interior - Building Area Method'!$K27),0))+SUM(SUMIF(Exterior!$J$19:$J$69,$B16,Exterior!$K$19:$K$69),SUMIF(Exterior!$M$19:$M$69,$B16,Exterior!$N$19:$N$69),SUMIF(Exterior!$P$19:$P$69,$B16,Exterior!$Q$19:$Q$69),SUMIF(Exterior!$S$19:$S$69,$B16,Exterior!$T$19:$T$69),SUMIF(Exterior!$V$19:$V$69,$B16,Exterior!$W$19:$W$69))","v":0}]
[null,null,null,null,{"$f":"IF(ProjectMethod=SBS,SUM(SUMIF('Interior - Space-By-Space'!$M$16:OFFSET('Interior - Space-By-Space'!$M$56,-1,0),$B17,'Interior - Space-By-Space'!$O$16:OFFSET('Interior - Space-By-Space'!$O$56,-1,0)),SUMIF('Interior - Space-By-Space'!$Q$16:OFFSET('Interior - Space-By-Space'!$Q$56,-1,0),$B17,'Interior - Space-By-Space'!$S$16:OFFSET('Interior - Space-By-Space'!$S$56,-1,0)),SUMIF('Interior - Space-By-Space'!$U$16:OFFSET('Interior - Space-By-Space'!$U$56,-1,0),$B17,'Interior - Space-By-Space'!$W$16:OFFSET('Interior - Space-By-Space'!$W$56,-1,0)),SUMIF('Interior - Space-By-Space'!$Y$16:OFFSET('Interior - Space-By-Space'!$Y$56,-1,0),$B17,'Interior - Space-By-Space'!$AA$16:OFFSET('Interior - Space-By-Space'!$AA$56,-1,0)),SUMIF('Interior - Space-By-Space'!$AC$16:OFFSET('Interior - Space-By-Space'!$AC$56,-1,0),$B17,'Interior - Space-By-Space'!$AE$16:OFFSET('Interior - Space-By-Space'!$AE$56,-1,0)),SUMIF('Interior - Space-By-Space'!$AG$16:OFFSET('Interior - Space-By-Space'!$AG$56,-1,0),$B17,'Interior - Space-By-Space'!$AI$16:OFFSET('Interior - Space-By-Space'!$AI$56,-1,0)),SUMIF('Interior - Space-By-Space'!$AK$16:OFFSET('Interior - Space-By-Space'!$AK$56,-1,0),$B17,'Interior - Space-By-Space'!$AM$16:OFFSET('Interior - Space-By-Space'!$AM$56,-1,0)),SUMIF('Interior - Space-By-Space'!$AO$16:OFFSET('Interior - Space-By-Space'!$AO$56,-1,0),$B17,'Interior - Space-By-Space'!$AQ$16:OFFSET('Interior - Space-By-Space'!$AQ$56,-1,0))),IF(ProjectMethod=BAM,SUM('Interior - Building Area Method'!$C28,'Interior - Building Area Method'!$E28,'Interior - Building Area Method'!$G28,'Interior - Building Area Method'!$I28,'Interior - Building Area Method'!$K28),0))+SUM(SUMIF(Exterior!$J$19:$J$69,$B17,Exterior!$K$19:$K$69),SUMIF(Exterior!$M$19:$M$69,$B17,Exterior!$N$19:$N$69),SUMIF(Exterior!$P$19:$P$69,$B17,Exterior!$Q$19:$Q$69),SUMIF(Exterior!$S$19:$S$69,$B17,Exterior!$T$19:$T$69),SUMIF(Exterior!$V$19:$V$69,$B17,Exterior!$W$19:$W$69))","v":0}]
[null,null,null,null,{"$f":"IF(ProjectMethod=SBS,SUM(SUMIF('Interior - Space-By-Space'!$M$16:OFFSET('Interior - Space-By-Space'!$M$56,-1,0),$B18,'Interior - Space-By-Space'!$O$16:OFFSET('Interior - Space-By-Space'!$O$56,-1,0)),SUMIF('Interior - Space-By-Space'!$Q$16:OFFSET('Interior - Space-By-Space'!$Q$56,-1,0),$B18,'Interior - Space-By-Space'!$S$16:OFFSET('Interior - Space-By-Space'!$S$56,-1,0)),SUMIF('Interior - Space-By-Space'!$U$16:OFFSET('Interior - Space-By-Space'!$U$56,-1,0),$B18,'Interior - Space-By-Space'!$W$16:OFFSET('Interior - Space-By-Space'!$W$56,-1,0)),SUMIF('Interior - Space-By-Space'!$Y$16:OFFSET('Interior - Space-By-Space'!$Y$56,-1,0),$B18,'Interior - Space-By-Space'!$AA$16:OFFSET('Interior - Space-By-Space'!$AA$56,-1,0)),SUMIF('Interior - Space-By-Space'!$AC$16:OFFSET('Interior - Space-By-Space'!$AC$56,-1,0),$B18,'Interior - Space-By-Space'!$AE$16:OFFSET('Interior - Space-By-Space'!$AE$56,-1,0)),SUMIF('Interior - Space-By-Space'!$AG$16:OFFSET('Interior - Space-By-Space'!$AG$56,-1,0),$B18,'Interior - Space-By-Space'!$AI$16:OFFSET('Interior - Space-By-Space'!$AI$56,-1,0)),SUMIF('Interior - Space-By-Space'!$AK$16:OFFSET('Interior - Space-By-Space'!$AK$56,-1,0),$B18,'Interior - Space-By-Space'!$AM$16:OFFSET('Interior - Space-By-Space'!$AM$56,-1,0)),SUMIF('Interior - Space-By-Space'!$AO$16:OFFSET('Interior - Space-By-Space'!$AO$56,-1,0),$B18,'Interior - Space-By-Space'!$AQ$16:OFFSET('Interior - Space-By-Space'!$AQ$56,-1,0))),IF(ProjectMethod=BAM,SUM('Interior - Building Area Method'!$C29,'Interior - Building Area Method'!$E29,'Interior - Building Area Method'!$G29,'Interior - Building Area Method'!$I29,'Interior - Building Area Method'!$K29),0))+SUM(SUMIF(Exterior!$J$19:$J$69,$B18,Exterior!$K$19:$K$69),SUMIF(Exterior!$M$19:$M$69,$B18,Exterior!$N$19:$N$69),SUMIF(Exterior!$P$19:$P$69,$B18,Exterior!$Q$19:$Q$69),SUMIF(Exterior!$S$19:$S$69,$B18,Exterior!$T$19:$T$69),SUMIF(Exterior!$V$19:$V$69,$B18,Exterior!$W$19:$W$69))","v":0}]
[null,null,null,null,{"$f":"IF(ProjectMethod=SBS,SUM(SUMIF('Interior - Space-By-Space'!$M$16:OFFSET('Interior - Space-By-Space'!$M$56,-1,0),$B19,'Interior - Space-By-Space'!$O$16:OFFSET('Interior - Space-By-Space'!$O$56,-1,0)),SUMIF('Interior - Space-By-Space'!$Q$16:OFFSET('Interior - Space-By-Space'!$Q$56,-1,0),$B19,'Interior - Space-By-Space'!$S$16:OFFSET('Interior - Space-By-Space'!$S$56,-1,0)),SUMIF('Interior - Space-By-Space'!$U$16:OFFSET('Interior - Space-By-Space'!$U$56,-1,0),$B19,'Interior - Space-By-Space'!$W$16:OFFSET('Interior - Space-By-Space'!$W$56,-1,0)),SUMIF('Interior - Space-By-Space'!$Y$16:OFFSET('Interior - Space-By-Space'!$Y$56,-1,0),$B19,'Interior - Space-By-Space'!$AA$16:OFFSET('Interior - Space-By-Space'!$AA$56,-1,0)),SUMIF('Interior - Space-By-Space'!$AC$16:OFFSET('Interior - Space-By-Space'!$AC$56,-1,0),$B19,'Interior - Space-By-Space'!$AE$16:OFFSET('Interior - Space-By-Space'!$AE$56,-1,0)),SUMIF('Interior - Space-By-Space'!$AG$16:OFFSET('Interior - Space-By-Space'!$AG$56,-1,0),$B19,'Interior - Space-By-Space'!$AI$16:OFFSET('Interior - Space-By-Space'!$AI$56,-1,0)),SUMIF('Interior - Space-By-Space'!$AK$16:OFFSET('Interior - Space-By-Space'!$AK$56,-1,0),$B19,'Interior - Space-By-Space'!$AM$16:OFFSET('Interior - Space-By-Space'!$AM$56,-1,0)),SUMIF('Interior - Space-By-Space'!$AO$16:OFFSET('Interior - Space-By-Space'!$AO$56,-1,0),$B19,'Interior - Space-By-Space'!$AQ$16:OFFSET('Interior - Space-By-Space'!$AQ$56,-1,0))),IF(ProjectMethod=BAM,SUM('Interior - Building Area Method'!$C30,'Interior - Building Area Method'!$E30,'Interior - Building Area Method'!$G30,'Interior - Building Area Method'!$I30,'Interior - Building Area Method'!$K30),0))+SUM(SUMIF(Exterior!$J$19:$J$69,$B19,Exterior!$K$19:$K$69),SUMIF(Exterior!$M$19:$M$69,$B19,Exterior!$N$19:$N$69),SUMIF(Exterior!$P$19:$P$69,$B19,Exterior!$Q$19:$Q$69),SUMIF(Exterior!$S$19:$S$69,$B19,Exterior!$T$19:$T$69),SUMIF(Exterior!$V$19:$V$69,$B19,Exterior!$W$19:$W$69))","v":0}]
[null,null,null,null,{"$f":"IF(ProjectMethod=SBS,SUM(SUMIF('Interior - Space-By-Space'!$M$16:OFFSET('Interior - Space-By-Space'!$M$56,-1,0),$B20,'Interior - Space-By-Space'!$O$16:OFFSET('Interior - Space-By-Space'!$O$56,-1,0)),SUMIF('Interior - Space-By-Space'!$Q$16:OFFSET('Interior - Space-By-Space'!$Q$56,-1,0),$B20,'Interior - Space-By-Space'!$S$16:OFFSET('Interior - Space-By-Space'!$S$56,-1,0)),SUMIF('Interior - Space-By-Space'!$U$16:OFFSET('Interior - Space-By-Space'!$U$56,-1,0),$B20,'Interior - Space-By-Space'!$W$16:OFFSET('Interior - Space-By-Space'!$W$56,-1,0)),SUMIF('Interior - Space-By-Space'!$Y$16:OFFSET('Interior - Space-By-Space'!$Y$56,-1,0),$B20,'Interior - Space-By-Space'!$AA$16:OFFSET('Interior - Space-By-Space'!$AA$56,-1,0)),SUMIF('Interior - Space-By-Space'!$AC$16:OFFSET('Interior - Space-By-Space'!$AC$56,-1,0),$B20,'Interior - Space-By-Space'!$AE$16:OFFSET('Interior - Space-By-Space'!$AE$56,-1,0)),SUMIF('Interior - Space-By-Space'!$AG$16:OFFSET('Interior - Space-By-Space'!$AG$56,-1,0),$B20,'Interior - Space-By-Space'!$AI$16:OFFSET('Interior - Space-By-Space'!$AI$56,-1,0)),SUMIF('Interior - Space-By-Space'!$AK$16:OFFSET('Interior - Space-By-Space'!$AK$56,-1,0),$B20,'Interior - Space-By-Space'!$AM$16:OFFSET('Interior - Space-By-Space'!$AM$56,-1,0)),SUMIF('Interior - Space-By-Space'!$AO$16:OFFSET('Interior - Space-By-Space'!$AO$56,-1,0),$B20,'Interior - Space-By-Space'!$AQ$16:OFFSET('Interior - Space-By-Space'!$AQ$56,-1,0))),IF(ProjectMethod=BAM,SUM('Interior - Building Area Method'!$C31,'Interior - Building Area Method'!$E31,'Interior - Building Area Method'!$G31,'Interior - Building Area Method'!$I31,'Interior - Building Area Method'!$K31),0))+SUM(SUMIF(Exterior!$J$19:$J$69,$B20,Exterior!$K$19:$K$69),SUMIF(Exterior!$M$19:$M$69,$B20,Exterior!$N$19:$N$69),SUMIF(Exterior!$P$19:$P$69,$B20,Exterior!$Q$19:$Q$69),SUMIF(Exterior!$S$19:$S$69,$B20,Exterior!$T$19:$T$69),SUMIF(Exterior!$V$19:$V$69,$B20,Exterior!$W$19:$W$69))","v":0}]
[null,null,null,null,{"$f":"IF(ProjectMethod=SBS,SUM(SUMIF('Interior - Space-By-Space'!$M$16:OFFSET('Interior - Space-By-Space'!$M$56,-1,0),$B21,'Interior - Space-By-Space'!$O$16:OFFSET('Interior - Space-By-Space'!$O$56,-1,0)),SUMIF('Interior - Space-By-Space'!$Q$16:OFFSET('Interior - Space-By-Space'!$Q$56,-1,0),$B21,'Interior - Space-By-Space'!$S$16:OFFSET('Interior - Space-By-Space'!$S$56,-1,0)),SUMIF('Interior - Space-By-Space'!$U$16:OFFSET('Interior - Space-By-Space'!$U$56,-1,0),$B21,'Interior - Space-By-Space'!$W$16:OFFSET('Interior - Space-By-Space'!$W$56,-1,0)),SUMIF('Interior - Space-By-Space'!$Y$16:OFFSET('Interior - Space-By-Space'!$Y$56,-1,0),$B21,'Interior - Space-By-Space'!$AA$16:OFFSET('Interior - Space-By-Space'!$AA$56,-1,0)),SUMIF('Interior - Space-By-Space'!$AC$16:OFFSET('Interior - Space-By-Space'!$AC$56,-1,0),$B21,'Interior - Space-By-Space'!$AE$16:OFFSET('Interior - Space-By-Space'!$AE$56,-1,0)),SUMIF('Interior - Space-By-Space'!$AG$16:OFFSET('Interior - Space-By-Space'!$AG$56,-1,0),$B21,'Interior - Space-By-Space'!$AI$16:OFFSET('Interior - Space-By-Space'!$AI$56,-1,0)),SUMIF('Interior - Space-By-Space'!$AK$16:OFFSET('Interior - Space-By-Space'!$AK$56,-1,0),$B21,'Interior - Space-By-Space'!$AM$16:OFFSET('Interior - Space-By-Space'!$AM$56,-1,0)),SUMIF('Interior - Space-By-Space'!$AO$16:OFFSET('Interior - Space-By-Space'!$AO$56,-1,0),$B21,'Interior - Space-By-Space'!$AQ$16:OFFSET('Interior - Space-By-Space'!$AQ$56,-1,0))),IF(ProjectMethod=BAM,SUM('Interior - Building Area Method'!$C32,'Interior - Building Area Method'!$E32,'Interior - Building Area Method'!$G32,'Interior - Building Area Method'!$I32,'Interior - Building Area Method'!$K32),0))+SUM(SUMIF(Exterior!$J$19:$J$69,$B21,Exterior!$K$19:$K$69),SUMIF(Exterior!$M$19:$M$69,$B21,Exterior!$N$19:$N$69),SUMIF(Exterior!$P$19:$P$69,$B21,Exterior!$Q$19:$Q$69),SUMIF(Exterior!$S$19:$S$69,$B21,Exterior!$T$19:$T$69),SUMIF(Exterior!$V$19:$V$69,$B21,Exterior!$W$19:$W$69))","v":0}]
[null,null,null,null,{"$f":"IF(ProjectMethod=SBS,SUM(SUMIF('Interior - Space-By-Space'!$M$16:OFFSET('Interior - Space-By-Space'!$M$56,-1,0),$B22,'Interior - Space-By-Space'!$O$16:OFFSET('Interior - Space-By-Space'!$O$56,-1,0)),SUMIF('Interior - Space-By-Space'!$Q$16:OFFSET('Interior - Space-By-Space'!$Q$56,-1,0),$B22,'Interior - Space-By-Space'!$S$16:OFFSET('Interior - Space-By-Space'!$S$56,-1,0)),SUMIF('Interior - Space-By-Space'!$U$16:OFFSET('Interior - Space-By-Space'!$U$56,-1,0),$B22,'Interior - Space-By-Space'!$W$16:OFFSET('Interior - Space-By-Space'!$W$56,-1,0)),SUMIF('Interior - Space-By-Space'!$Y$16:OFFSET('Interior - Space-By-Space'!$Y$56,-1,0),$B22,'Interior - Space-By-Space'!$AA$16:OFFSET('Interior - Space-By-Space'!$AA$56,-1,0)),SUMIF('Interior - Space-By-Space'!$AC$16:OFFSET('Interior - Space-By-Space'!$AC$56,-1,0),$B22,'Interior - Space-By-Space'!$AE$16:OFFSET('Interior - Space-By-Space'!$AE$56,-1,0)),SUMIF('Interior - Space-By-Space'!$AG$16:OFFSET('Interior - Space-By-Space'!$AG$56,-1,0),$B22,'Interior - Space-By-Space'!$AI$16:OFFSET('Interior - Space-By-Space'!$AI$56,-1,0)),SUMIF('Interior - Space-By-Space'!$AK$16:OFFSET('Interior - Space-By-Space'!$AK$56,-1,0),$B22,'Interior - Space-By-Space'!$AM$16:OFFSET('Interior - Space-By-Space'!$AM$56,-1,0)),SUMIF('Interior - Space-By-Space'!$AO$16:OFFSET('Interior - Space-By-Space'!$AO$56,-1,0),$B22,'Interior - Space-By-Space'!$AQ$16:OFFSET('Interior - Space-By-Space'!$AQ$56,-1,0))),IF(ProjectMethod=BAM,SUM('Interior - Building Area Method'!$C33,'Interior - Building Area Method'!$E33,'Interior - Building Area Method'!$G33,'Interior - Building Area Method'!$I33,'Interior - Building Area Method'!$K33),0))+SUM(SUMIF(Exterior!$J$19:$J$69,$B22,Exterior!$K$19:$K$69),SUMIF(Exterior!$M$19:$M$69,$B22,Exterior!$N$19:$N$69),SUMIF(Exterior!$P$19:$P$69,$B22,Exterior!$Q$19:$Q$69),SUMIF(Exterior!$S$19:$S$69,$B22,Exterior!$T$19:$T$69),SUMIF(Exterior!$V$19:$V$69,$B22,Exterior!$W$19:$W$69))","v":0}]
[null,null,null,null,{"$f":"IF(ProjectMethod=SBS,SUM(SUMIF('Interior - Space-By-Space'!$M$16:OFFSET('Interior - Space-By-Space'!$M$56,-1,0),$B23,'Interior - Space-By-Space'!$O$16:OFFSET('Interior - Space-By-Space'!$O$56,-1,0)),SUMIF('Interior - Space-By-Space'!$Q$16:OFFSET('Interior - Space-By-Space'!$Q$56,-1,0),$B23,'Interior - Space-By-Space'!$S$16:OFFSET('Interior - Space-By-Space'!$S$56,-1,0)),SUMIF('Interior - Space-By-Space'!$U$16:OFFSET('Interior - Space-By-Space'!$U$56,-1,0),$B23,'Interior - Space-By-Space'!$W$16:OFFSET('Interior - Space-By-Space'!$W$56,-1,0)),SUMIF('Interior - Space-By-Space'!$Y$16:OFFSET('Interior - Space-By-Space'!$Y$56,-1,0),$B23,'Interior - Space-By-Space'!$AA$16:OFFSET('Interior - Space-By-Space'!$AA$56,-1,0)),SUMIF('Interior - Space-By-Space'!$AC$16:OFFSET('Interior - Space-By-Space'!$AC$56,-1,0),$B23,'Interior - Space-By-Space'!$AE$16:OFFSET('Interior - Space-By-Space'!$AE$56,-1,0)),SUMIF('Interior - Space-By-Space'!$AG$16:OFFSET('Interior - Space-By-Space'!$AG$56,-1,0),$B23,'Interior - Space-By-Space'!$AI$16:OFFSET('Interior - Space-By-Space'!$AI$56,-1,0)),SUMIF('Interior - Space-By-Space'!$AK$16:OFFSET('Interior - Space-By-Space'!$AK$56,-1,0),$B23,'Interior - Space-By-Space'!$AM$16:OFFSET('Interior - Space-By-Space'!$AM$56,-1,0)),SUMIF('Interior - Space-By-Space'!$AO$16:OFFSET('Interior - Space-By-Space'!$AO$56,-1,0),$B23,'Interior - Space-By-Space'!$AQ$16:OFFSET('Interior - Space-By-Space'!$AQ$56,-1,0))),IF(ProjectMethod=BAM,SUM('Interior - Building Area Method'!$C34,'Interior - Building Area Method'!$E34,'Interior - Building Area Method'!$G34,'Interior - Building Area Method'!$I34,'Interior - Building Area Method'!$K34),0))+SUM(SUMIF(Exterior!$J$19:$J$69,$B23,Exterior!$K$19:$K$69),SUMIF(Exterior!$M$19:$M$69,$B23,Exterior!$N$19:$N$69),SUMIF(Exterior!$P$19:$P$69,$B23,Exterior!$Q$19:$Q$69),SUMIF(Exterior!$S$19:$S$69,$B23,Exterior!$T$19:$T$69),SUMIF(Exterior!$V$19:$V$69,$B23,Exterior!$W$19:$W$69))","v":0}]
[null,null,null,null,{"$f":"IF(ProjectMethod=SBS,SUM(SUMIF('Interior - Space-By-Space'!$M$16:OFFSET('Interior - Space-By-Space'!$M$56,-1,0),$B24,'Interior - Space-By-Space'!$O$16:OFFSET('Interior - Space-By-Space'!$O$56,-1,0)),SUMIF('Interior - Space-By-Space'!$Q$16:OFFSET('Interior - Space-By-Space'!$Q$56,-1,0),$B24,'Interior - Space-By-Space'!$S$16:OFFSET('Interior - Space-By-Space'!$S$56,-1,0)),SUMIF('Interior - Space-By-Space'!$U$16:OFFSET('Interior - Space-By-Space'!$U$56,-1,0),$B24,'Interior - Space-By-Space'!$W$16:OFFSET('Interior - Space-By-Space'!$W$56,-1,0)),SUMIF('Interior - Space-By-Space'!$Y$16:OFFSET('Interior - Space-By-Space'!$Y$56,-1,0),$B24,'Interior - Space-By-Space'!$AA$16:OFFSET('Interior - Space-By-Space'!$AA$56,-1,0)),SUMIF('Interior - Space-By-Space'!$AC$16:OFFSET('Interior - Space-By-Space'!$AC$56,-1,0),$B24,'Interior - Space-By-Space'!$AE$16:OFFSET('Interior - Space-By-Space'!$AE$56,-1,0)),SUMIF('Interior - Space-By-Space'!$AG$16:OFFSET('Interior - Space-By-Space'!$AG$56,-1,0),$B24,'Interior - Space-By-Space'!$AI$16:OFFSET('Interior - Space-By-Space'!$AI$56,-1,0)),SUMIF('Interior - Space-By-Space'!$AK$16:OFFSET('Interior - Space-By-Space'!$AK$56,-1,0),$B24,'Interior - Space-By-Space'!$AM$16:OFFSET('Interior - Space-By-Space'!$AM$56,-1,0)),SUMIF('Interior - Space-By-Space'!$AO$16:OFFSET('Interior - Space-By-Space'!$AO$56,-1,0),$B24,'Interior - Space-By-Space'!$AQ$16:OFFSET('Interior - Space-By-Space'!$AQ$56,-1,0))),IF(ProjectMethod=BAM,SUM('Interior - Building Area Method'!$C35,'Interior - Building Area Method'!$E35,'Interior - Building Area Method'!$G35,'Interior - Building Area Method'!$I35,'Interior - Building Area Method'!$K35),0))+SUM(SUMIF(Exterior!$J$19:$J$69,$B24,Exterior!$K$19:$K$69),SUMIF(Exterior!$M$19:$M$69,$B24,Exterior!$N$19:$N$69),SUMIF(Exterior!$P$19:$P$69,$B24,Exterior!$Q$19:$Q$69),SUMIF(Exterior!$S$19:$S$69,$B24,Exterior!$T$19:$T$69),SUMIF(Exterior!$V$19:$V$69,$B24,Exterior!$W$19:$W$69))","v":0}]
[null,null,null,null,{"$f":"IF(ProjectMethod=SBS,SUM(SUMIF('Interior - Space-By-Space'!$M$16:OFFSET('Interior - Space-By-Space'!$M$56,-1,0),$B25,'Interior - Space-By-Space'!$O$16:OFFSET('Interior - Space-By-Space'!$O$56,-1,0)),SUMIF('Interior - Space-By-Space'!$Q$16:OFFSET('Interior - Space-By-Space'!$Q$56,-1,0),$B25,'Interior - Space-By-Space'!$S$16:OFFSET('Interior - Space-By-Space'!$S$56,-1,0)),SUMIF('Interior - Space-By-Space'!$U$16:OFFSET('Interior - Space-By-Space'!$U$56,-1,0),$B25,'Interior - Space-By-Space'!$W$16:OFFSET('Interior - Space-By-Space'!$W$56,-1,0)),SUMIF('Interior - Space-By-Space'!$Y$16:OFFSET('Interior - Space-By-Space'!$Y$56,-1,0),$B25,'Interior - Space-By-Space'!$AA$16:OFFSET('Interior - Space-By-Space'!$AA$56,-1,0)),SUMIF('Interior - Space-By-Space'!$AC$16:OFFSET('Interior - Space-By-Space'!$AC$56,-1,0),$B25,'Interior - Space-By-Space'!$AE$16:OFFSET('Interior - Space-By-Space'!$AE$56,-1,0)),SUMIF('Interior - Space-By-Space'!$AG$16:OFFSET('Interior - Space-By-Space'!$AG$56,-1,0),$B25,'Interior - Space-By-Space'!$AI$16:OFFSET('Interior - Space-By-Space'!$AI$56,-1,0)),SUMIF('Interior - Space-By-Space'!$AK$16:OFFSET('Interior - Space-By-Space'!$AK$56,-1,0),$B25,'Interior - Space-By-Space'!$AM$16:OFFSET('Interior - Space-By-Space'!$AM$56,-1,0)),SUMIF('Interior - Space-By-Space'!$AO$16:OFFSET('Interior - Space-By-Space'!$AO$56,-1,0),$B25,'Interior - Space-By-Space'!$AQ$16:OFFSET('Interior - Space-By-Space'!$AQ$56,-1,0))),IF(ProjectMethod=BAM,SUM('Interior - Building Area Method'!$C36,'Interior - Building Area Method'!$E36,'Interior - Building Area Method'!$G36,'Interior - Building Area Method'!$I36,'Interior - Building Area Method'!$K36),0))+SUM(SUMIF(Exterior!$J$19:$J$69,$B25,Exterior!$K$19:$K$69),SUMIF(Exterior!$M$19:$M$69,$B25,Exterior!$N$19:$N$69),SUMIF(Exterior!$P$19:$P$69,$B25,Exterior!$Q$19:$Q$69),SUMIF(Exterior!$S$19:$S$69,$B25,Exterior!$T$19:$T$69),SUMIF(Exterior!$V$19:$V$69,$B25,Exterior!$W$19:$W$69))","v":0}]
[null,null,null,null,{"$f":"IF(ProjectMethod=SBS,SUM(SUMIF('Interior - Space-By-Space'!$M$16:OFFSET('Interior - Space-By-Space'!$M$56,-1,0),$B26,'Interior - Space-By-Space'!$O$16:OFFSET('Interior - Space-By-Space'!$O$56,-1,0)),SUMIF('Interior - Space-By-Space'!$Q$16:OFFSET('Interior - Space-By-Space'!$Q$56,-1,0),$B26,'Interior - Space-By-Space'!$S$16:OFFSET('Interior - Space-By-Space'!$S$56,-1,0)),SUMIF('Interior - Space-By-Space'!$U$16:OFFSET('Interior - Space-By-Space'!$U$56,-1,0),$B26,'Interior - Space-By-Space'!$W$16:OFFSET('Interior - Space-By-Space'!$W$56,-1,0)),SUMIF('Interior - Space-By-Space'!$Y$16:OFFSET('Interior - Space-By-Space'!$Y$56,-1,0),$B26,'Interior - Space-By-Space'!$AA$16:OFFSET('Interior - Space-By-Space'!$AA$56,-1,0)),SUMIF('Interior - Space-By-Space'!$AC$16:OFFSET('Interior - Space-By-Space'!$AC$56,-1,0),$B26,'Interior - Space-By-Space'!$AE$16:OFFSET('Interior - Space-By-Space'!$AE$56,-1,0)),SUMIF('Interior - Space-By-Space'!$AG$16:OFFSET('Interior - Space-By-Space'!$AG$56,-1,0),$B26,'Interior - Space-By-Space'!$AI$16:OFFSET('Interior - Space-By-Space'!$AI$56,-1,0)),SUMIF('Interior - Space-By-Space'!$AK$16:OFFSET('Interior - Space-By-Space'!$AK$56,-1,0),$B26,'Interior - Space-By-Space'!$AM$16:OFFSET('Interior - Space-By-Space'!$AM$56,-1,0)),SUMIF('Interior - Space-By-Space'!$AO$16:OFFSET('Interior - Space-By-Space'!$AO$56,-1,0),$B26,'Interior - Space-By-Space'!$AQ$16:OFFSET('Interior - Space-By-Space'!$AQ$56,-1,0))),IF(ProjectMethod=BAM,SUM('Interior - Building Area Method'!$C37,'Interior - Building Area Method'!$E37,'Interior - Building Area Method'!$G37,'Interior - Building Area Method'!$I37,'Interior - Building Area Method'!$K37),0))+SUM(SUMIF(Exterior!$J$19:$J$69,$B26,Exterior!$K$19:$K$69),SUMIF(Exterior!$M$19:$M$69,$B26,Exterior!$N$19:$N$69),SUMIF(Exterior!$P$19:$P$69,$B26,Exterior!$Q$19:$Q$69),SUMIF(Exterior!$S$19:$S$69,$B26,Exterior!$T$19:$T$69),SUMIF(Exterior!$V$19:$V$69,$B26,Exterior!$W$19:$W$69))","v":0}]
[null,null,null,null,{"$f":"IF(ProjectMethod=SBS,SUM(SUMIF('Interior - Space-By-Space'!$M$16:OFFSET('Interior - Space-By-Space'!$M$56,-1,0),$B27,'Interior - Space-By-Space'!$O$16:OFFSET('Interior - Space-By-Space'!$O$56,-1,0)),SUMIF('Interior - Space-By-Space'!$Q$16:OFFSET('Interior - Space-By-Space'!$Q$56,-1,0),$B27,'Interior - Space-By-Space'!$S$16:OFFSET('Interior - Space-By-Space'!$S$56,-1,0)),SUMIF('Interior - Space-By-Space'!$U$16:OFFSET('Interior - Space-By-Space'!$U$56,-1,0),$B27,'Interior - Space-By-Space'!$W$16:OFFSET('Interior - Space-By-Space'!$W$56,-1,0)),SUMIF('Interior - Space-By-Space'!$Y$16:OFFSET('Interior - Space-By-Space'!$Y$56,-1,0),$B27,'Interior - Space-By-Space'!$AA$16:OFFSET('Interior - Space-By-Space'!$AA$56,-1,0)),SUMIF('Interior - Space-By-Space'!$AC$16:OFFSET('Interior - Space-By-Space'!$AC$56,-1,0),$B27,'Interior - Space-By-Space'!$AE$16:OFFSET('Interior - Space-By-Space'!$AE$56,-1,0)),SUMIF('Interior - Space-By-Space'!$AG$16:OFFSET('Interior - Space-By-Space'!$AG$56,-1,0),$B27,'Interior - Space-By-Space'!$AI$16:OFFSET('Interior - Space-By-Space'!$AI$56,-1,0)),SUMIF('Interior - Space-By-Space'!$AK$16:OFFSET('Interior - Space-By-Space'!$AK$56,-1,0),$B27,'Interior - Space-By-Space'!$AM$16:OFFSET('Interior - Space-By-Space'!$AM$56,-1,0)),SUMIF('Interior - Space-By-Space'!$AO$16:OFFSET('Interior - Space-By-Space'!$AO$56,-1,0),$B27,'Interior - Space-By-Space'!$AQ$16:OFFSET('Interior - Space-By-Space'!$AQ$56,-1,0))),IF(ProjectMethod=BAM,SUM('Interior - Building Area Method'!$C38,'Interior - Building Area Method'!$E38,'Interior - Building Area Method'!$G38,'Interior - Building Area Method'!$I38,'Interior - Building Area Method'!$K38),0))+SUM(SUMIF(Exterior!$J$19:$J$69,$B27,Exterior!$K$19:$K$69),SUMIF(Exterior!$M$19:$M$69,$B27,Exterior!$N$19:$N$69),SUMIF(Exterior!$P$19:$P$69,$B27,Exterior!$Q$19:$Q$69),SUMIF(Exterior!$S$19:$S$69,$B27,Exterior!$T$19:$T$69),SUMIF(Exterior!$V$19:$V$69,$B27,Exterior!$W$19:$W$69))","v":0}]
[null,null,null,null,{"$f":"IF(ProjectMethod=SBS,SUM(SUMIF('Interior - Space-By-Space'!$M$16:OFFSET('Interior - Space-By-Space'!$M$56,-1,0),$B28,'Interior - Space-By-Space'!$O$16:OFFSET('Interior - Space-By-Space'!$O$56,-1,0)),SUMIF('Interior - Space-By-Space'!$Q$16:OFFSET('Interior - Space-By-Space'!$Q$56,-1,0),$B28,'Interior - Space-By-Space'!$S$16:OFFSET('Interior - Space-By-Space'!$S$56,-1,0)),SUMIF('Interior - Space-By-Space'!$U$16:OFFSET('Interior - Space-By-Space'!$U$56,-1,0),$B28,'Interior - Space-By-Space'!$W$16:OFFSET('Interior - Space-By-Space'!$W$56,-1,0)),SUMIF('Interior - Space-By-Space'!$Y$16:OFFSET('Interior - Space-By-Space'!$Y$56,-1,0),$B28,'Interior - Space-By-Space'!$AA$16:OFFSET('Interior - Space-By-Space'!$AA$56,-1,0)),SUMIF('Interior - Space-By-Space'!$AC$16:OFFSET('Interior - Space-By-Space'!$AC$56,-1,0),$B28,'Interior - Space-By-Space'!$AE$16:OFFSET('Interior - Space-By-Space'!$AE$56,-1,0)),SUMIF('Interior - Space-By-Space'!$AG$16:OFFSET('Interior - Space-By-Space'!$AG$56,-1,0),$B28,'Interior - Space-By-Space'!$AI$16:OFFSET('Interior - Space-By-Space'!$AI$56,-1,0)),SUMIF('Interior - Space-By-Space'!$AK$16:OFFSET('Interior - Space-By-Space'!$AK$56,-1,0),$B28,'Interior - Space-By-Space'!$AM$16:OFFSET('Interior - Space-By-Space'!$AM$56,-1,0)),SUMIF('Interior - Space-By-Space'!$AO$16:OFFSET('Interior - Space-By-Space'!$AO$56,-1,0),$B28,'Interior - Space-By-Space'!$AQ$16:OFFSET('Interior - Space-By-Space'!$AQ$56,-1,0))),IF(ProjectMethod=BAM,SUM('Interior - Building Area Method'!$C39,'Interior - Building Area Method'!$E39,'Interior - Building Area Method'!$G39,'Interior - Building Area Method'!$I39,'Interior - Building Area Method'!$K39),0))+SUM(SUMIF(Exterior!$J$19:$J$69,$B28,Exterior!$K$19:$K$69),SUMIF(Exterior!$M$19:$M$69,$B28,Exterior!$N$19:$N$69),SUMIF(Exterior!$P$19:$P$69,$B28,Exterior!$Q$19:$Q$69),SUMIF(Exterior!$S$19:$S$69,$B28,Exterior!$T$19:$T$69),SUMIF(Exterior!$V$19:$V$69,$B28,Exterior!$W$19:$W$69))","v":0}]
[null,null,null,null,{"$f":"IF(ProjectMethod=SBS,SUM(SUMIF('Interior - Space-By-Space'!$M$16:OFFSET('Interior - Space-By-Space'!$M$56,-1,0),$B29,'Interior - Space-By-Space'!$O$16:OFFSET('Interior - Space-By-Space'!$O$56,-1,0)),SUMIF('Interior - Space-By-Space'!$Q$16:OFFSET('Interior - Space-By-Space'!$Q$56,-1,0),$B29,'Interior - Space-By-Space'!$S$16:OFFSET('Interior - Space-By-Space'!$S$56,-1,0)),SUMIF('Interior - Space-By-Space'!$U$16:OFFSET('Interior - Space-By-Space'!$U$56,-1,0),$B29,'Interior - Space-By-Space'!$W$16:OFFSET('Interior - Space-By-Space'!$W$56,-1,0)),SUMIF('Interior - Space-By-Space'!$Y$16:OFFSET('Interior - Space-By-Space'!$Y$56,-1,0),$B29,'Interior - Space-By-Space'!$AA$16:OFFSET('Interior - Space-By-Space'!$AA$56,-1,0)),SUMIF('Interior - Space-By-Space'!$AC$16:OFFSET('Interior - Space-By-Space'!$AC$56,-1,0),$B29,'Interior - Space-By-Space'!$AE$16:OFFSET('Interior - Space-By-Space'!$AE$56,-1,0)),SUMIF('Interior - Space-By-Space'!$AG$16:OFFSET('Interior - Space-By-Space'!$AG$56,-1,0),$B29,'Interior - Space-By-Space'!$AI$16:OFFSET('Interior - Space-By-Space'!$AI$56,-1,0)),SUMIF('Interior - Space-By-Space'!$AK$16:OFFSET('Interior - Space-By-Space'!$AK$56,-1,0),$B29,'Interior - Space-By-Space'!$AM$16:OFFSET('Interior - Space-By-Space'!$AM$56,-1,0)),SUMIF('Interior - Space-By-Space'!$AO$16:OFFSET('Interior - Space-By-Space'!$AO$56,-1,0),$B29,'Interior - Space-By-Space'!$AQ$16:OFFSET('Interior - Space-By-Space'!$AQ$56,-1,0))),IF(ProjectMethod=BAM,SUM('Interior - Building Area Method'!$C40,'Interior - Building Area Method'!$E40,'Interior - Building Area Method'!$G40,'Interior - Building Area Method'!$I40,'Interior - Building Area Method'!$K40),0))+SUM(SUMIF(Exterior!$J$19:$J$69,$B29,Exterior!$K$19:$K$69),SUMIF(Exterior!$M$19:$M$69,$B29,Exterior!$N$19:$N$69),SUMIF(Exterior!$P$19:$P$69,$B29,Exterior!$Q$19:$Q$69),SUMIF(Exterior!$S$19:$S$69,$B29,Exterior!$T$19:$T$69),SUMIF(Exterior!$V$19:$V$69,$B29,Exterior!$W$19:$W$69))","v":0}]
[null,null,null,null,{"$f":"IF(ProjectMethod=SBS,SUM(SUMIF('Interior - Space-By-Space'!$M$16:OFFSET('Interior - Space-By-Space'!$M$56,-1,0),$B30,'Interior - Space-By-Space'!$O$16:OFFSET('Interior - Space-By-Space'!$O$56,-1,0)),SUMIF('Interior - Space-By-Space'!$Q$16:OFFSET('Interior - Space-By-Space'!$Q$56,-1,0),$B30,'Interior - Space-By-Space'!$S$16:OFFSET('Interior - Space-By-Space'!$S$56,-1,0)),SUMIF('Interior - Space-By-Space'!$U$16:OFFSET('Interior - Space-By-Space'!$U$56,-1,0),$B30,'Interior - Space-By-Space'!$W$16:OFFSET('Interior - Space-By-Space'!$W$56,-1,0)),SUMIF('Interior - Space-By-Space'!$Y$16:OFFSET('Interior - Space-By-Space'!$Y$56,-1,0),$B30,'Interior - Space-By-Space'!$AA$16:OFFSET('Interior - Space-By-Space'!$AA$56,-1,0)),SUMIF('Interior - Space-By-Space'!$AC$16:OFFSET('Interior - Space-By-Space'!$AC$56,-1,0),$B30,'Interior - Space-By-Space'!$AE$16:OFFSET('Interior - Space-By-Space'!$AE$56,-1,0)),SUMIF('Interior - Space-By-Space'!$AG$16:OFFSET('Interior - Space-By-Space'!$AG$56,-1,0),$B30,'Interior - Space-By-Space'!$AI$16:OFFSET('Interior - Space-By-Space'!$AI$56,-1,0)),SUMIF('Interior - Space-By-Space'!$AK$16:OFFSET('Interior - Space-By-Space'!$AK$56,-1,0),$B30,'Interior - Space-By-Space'!$AM$16:OFFSET('Interior - Space-By-Space'!$AM$56,-1,0)),SUMIF('Interior - Space-By-Space'!$AO$16:OFFSET('Interior - Space-By-Space'!$AO$56,-1,0),$B30,'Interior - Space-By-Space'!$AQ$16:OFFSET('Interior - Space-By-Space'!$AQ$56,-1,0))),IF(ProjectMethod=BAM,SUM('Interior - Building Area Method'!$C41,'Interior - Building Area Method'!$E41,'Interior - Building Area Method'!$G41,'Interior - Building Area Method'!$I41,'Interior - Building Area Method'!$K41),0))+SUM(SUMIF(Exterior!$J$19:$J$69,$B30,Exterior!$K$19:$K$69),SUMIF(Exterior!$M$19:$M$69,$B30,Exterior!$N$19:$N$69),SUMIF(Exterior!$P$19:$P$69,$B30,Exterior!$Q$19:$Q$69),SUMIF(Exterior!$S$19:$S$69,$B30,Exterior!$T$19:$T$69),SUMIF(Exterior!$V$19:$V$69,$B30,Exterior!$W$19:$W$69))","v":0}]
[null,null,null,null,{"$f":"IF(ProjectMethod=SBS,SUM(SUMIF('Interior - Space-By-Space'!$M$16:OFFSET('Interior - Space-By-Space'!$M$56,-1,0),$B31,'Interior - Space-By-Space'!$O$16:OFFSET('Interior - Space-By-Space'!$O$56,-1,0)),SUMIF('Interior - Space-By-Space'!$Q$16:OFFSET('Interior - Space-By-Space'!$Q$56,-1,0),$B31,'Interior - Space-By-Space'!$S$16:OFFSET('Interior - Space-By-Space'!$S$56,-1,0)),SUMIF('Interior - Space-By-Space'!$U$16:OFFSET('Interior - Space-By-Space'!$U$56,-1,0),$B31,'Interior - Space-By-Space'!$W$16:OFFSET('Interior - Space-By-Space'!$W$56,-1,0)),SUMIF('Interior - Space-By-Space'!$Y$16:OFFSET('Interior - Space-By-Space'!$Y$56,-1,0),$B31,'Interior - Space-By-Space'!$AA$16:OFFSET('Interior - Space-By-Space'!$AA$56,-1,0)),SUMIF('Interior - Space-By-Space'!$AC$16:OFFSET('Interior - Space-By-Space'!$AC$56,-1,0),$B31,'Interior - Space-By-Space'!$AE$16:OFFSET('Interior - Space-By-Space'!$AE$56,-1,0)),SUMIF('Interior - Space-By-Space'!$AG$16:OFFSET('Interior - Space-By-Space'!$AG$56,-1,0),$B31,'Interior - Space-By-Space'!$AI$16:OFFSET('Interior - Space-By-Space'!$AI$56,-1,0)),SUMIF('Interior - Space-By-Space'!$AK$16:OFFSET('Interior - Space-By-Space'!$AK$56,-1,0),$B31,'Interior - Space-By-Space'!$AM$16:OFFSET('Interior - Space-By-Space'!$AM$56,-1,0)),SUMIF('Interior - Space-By-Space'!$AO$16:OFFSET('Interior - Space-By-Space'!$AO$56,-1,0),$B31,'Interior - Space-By-Space'!$AQ$16:OFFSET('Interior - Space-By-Space'!$AQ$56,-1,0))),IF(ProjectMethod=BAM,SUM('Interior - Building Area Method'!$C42,'Interior - Building Area Method'!$E42,'Interior - Building Area Method'!$G42,'Interior - Building Area Method'!$I42,'Interior - Building Area Method'!$K42),0))+SUM(SUMIF(Exterior!$J$19:$J$69,$B31,Exterior!$K$19:$K$69),SUMIF(Exterior!$M$19:$M$69,$B31,Exterior!$N$19:$N$69),SUMIF(Exterior!$P$19:$P$69,$B31,Exterior!$Q$19:$Q$69),SUMIF(Exterior!$S$19:$S$69,$B31,Exterior!$T$19:$T$69),SUMIF(Exterior!$V$19:$V$69,$B31,Exterior!$W$19:$W$69))","v":0}]
[null,null,null,null,{"$f":"IF(ProjectMethod=SBS,SUM(SUMIF('Interior - Space-By-Space'!$M$16:OFFSET('Interior - Space-By-Space'!$M$56,-1,0),$B32,'Interior - Space-By-Space'!$O$16:OFFSET('Interior - Space-By-Space'!$O$56,-1,0)),SUMIF('Interior - Space-By-Space'!$Q$16:OFFSET('Interior - Space-By-Space'!$Q$56,-1,0),$B32,'Interior - Space-By-Space'!$S$16:OFFSET('Interior - Space-By-Space'!$S$56,-1,0)),SUMIF('Interior - Space-By-Space'!$U$16:OFFSET('Interior - Space-By-Space'!$U$56,-1,0),$B32,'Interior - Space-By-Space'!$W$16:OFFSET('Interior - Space-By-Space'!$W$56,-1,0)),SUMIF('Interior - Space-By-Space'!$Y$16:OFFSET('Interior - Space-By-Space'!$Y$56,-1,0),$B32,'Interior - Space-By-Space'!$AA$16:OFFSET('Interior - Space-By-Space'!$AA$56,-1,0)),SUMIF('Interior - Space-By-Space'!$AC$16:OFFSET('Interior - Space-By-Space'!$AC$56,-1,0),$B32,'Interior - Space-By-Space'!$AE$16:OFFSET('Interior - Space-By-Space'!$AE$56,-1,0)),SUMIF('Interior - Space-By-Space'!$AG$16:OFFSET('Interior - Space-By-Space'!$AG$56,-1,0),$B32,'Interior - Space-By-Space'!$AI$16:OFFSET('Interior - Space-By-Space'!$AI$56,-1,0)),SUMIF('Interior - Space-By-Space'!$AK$16:OFFSET('Interior - Space-By-Space'!$AK$56,-1,0),$B32,'Interior - Space-By-Space'!$AM$16:OFFSET('Interior - Space-By-Space'!$AM$56,-1,0)),SUMIF('Interior - Space-By-Space'!$AO$16:OFFSET('Interior - Space-By-Space'!$AO$56,-1,0),$B32,'Interior - Space-By-Space'!$AQ$16:OFFSET('Interior - Space-By-Space'!$AQ$56,-1,0))),IF(ProjectMethod=BAM,SUM('Interior - Building Area Method'!$C43,'Interior - Building Area Method'!$E43,'Interior - Building Area Method'!$G43,'Interior - Building Area Method'!$I43,'Interior - Building Area Method'!$K43),0))+SUM(SUMIF(Exterior!$J$19:$J$69,$B32,Exterior!$K$19:$K$69),SUMIF(Exterior!$M$19:$M$69,$B32,Exterior!$N$19:$N$69),SUMIF(Exterior!$P$19:$P$69,$B32,Exterior!$Q$19:$Q$69),SUMIF(Exterior!$S$19:$S$69,$B32,Exterior!$T$19:$T$69),SUMIF(Exterior!$V$19:$V$69,$B32,Exterior!$W$19:$W$69))","v":0}]
[null,null,null,null,{"$f":"IF(ProjectMethod=SBS,SUM(SUMIF('Interior - Space-By-Space'!$M$16:OFFSET('Interior - Space-By-Space'!$M$56,-1,0),$B33,'Interior - Space-By-Space'!$O$16:OFFSET('Interior - Space-By-Space'!$O$56,-1,0)),SUMIF('Interior - Space-By-Space'!$Q$16:OFFSET('Interior - Space-By-Space'!$Q$56,-1,0),$B33,'Interior - Space-By-Space'!$S$16:OFFSET('Interior - Space-By-Space'!$S$56,-1,0)),SUMIF('Interior - Space-By-Space'!$U$16:OFFSET('Interior - Space-By-Space'!$U$56,-1,0),$B33,'Interior - Space-By-Space'!$W$16:OFFSET('Interior - Space-By-Space'!$W$56,-1,0)),SUMIF('Interior - Space-By-Space'!$Y$16:OFFSET('Interior - Space-By-Space'!$Y$56,-1,0),$B33,'Interior - Space-By-Space'!$AA$16:OFFSET('Interior - Space-By-Space'!$AA$56,-1,0)),SUMIF('Interior - Space-By-Space'!$AC$16:OFFSET('Interior - Space-By-Space'!$AC$56,-1,0),$B33,'Interior - Space-By-Space'!$AE$16:OFFSET('Interior - Space-By-Space'!$AE$56,-1,0)),SUMIF('Interior - Space-By-Space'!$AG$16:OFFSET('Interior - Space-By-Space'!$AG$56,-1,0),$B33,'Interior - Space-By-Space'!$AI$16:OFFSET('Interior - Space-By-Space'!$AI$56,-1,0)),SUMIF('Interior - Space-By-Space'!$AK$16:OFFSET('Interior - Space-By-Space'!$AK$56,-1,0),$B33,'Interior - Space-By-Space'!$AM$16:OFFSET('Interior - Space-By-Space'!$AM$56,-1,0)),SUMIF('Interior - Space-By-Space'!$AO$16:OFFSET('Interior - Space-By-Space'!$AO$56,-1,0),$B33,'Interior - Space-By-Space'!$AQ$16:OFFSET('Interior - Space-By-Space'!$AQ$56,-1,0))),IF(ProjectMethod=BAM,SUM('Interior - Building Area Method'!$C44,'Interior - Building Area Method'!$E44,'Interior - Building Area Method'!$G44,'Interior - Building Area Method'!$I44,'Interior - Building Area Method'!$K44),0))+SUM(SUMIF(Exterior!$J$19:$J$69,$B33,Exterior!$K$19:$K$69),SUMIF(Exterior!$M$19:$M$69,$B33,Exterior!$N$19:$N$69),SUMIF(Exterior!$P$19:$P$69,$B33,Exterior!$Q$19:$Q$69),SUMIF(Exterior!$S$19:$S$69,$B33,Exterior!$T$19:$T$69),SUMIF(Exterior!$V$19:$V$69,$B33,Exterior!$W$19:$W$69))","v":0}]
[null,null,null,null,{"$f":"IF(ProjectMethod=SBS,SUM(SUMIF('Interior - Space-By-Space'!$M$16:OFFSET('Interior - Space-By-Space'!$M$56,-1,0),$B34,'Interior - Space-By-Space'!$O$16:OFFSET('Interior - Space-By-Space'!$O$56,-1,0)),SUMIF('Interior - Space-By-Space'!$Q$16:OFFSET('Interior - Space-By-Space'!$Q$56,-1,0),$B34,'Interior - Space-By-Space'!$S$16:OFFSET('Interior - Space-By-Space'!$S$56,-1,0)),SUMIF('Interior - Space-By-Space'!$U$16:OFFSET('Interior - Space-By-Space'!$U$56,-1,0),$B34,'Interior - Space-By-Space'!$W$16:OFFSET('Interior - Space-By-Space'!$W$56,-1,0)),SUMIF('Interior - Space-By-Space'!$Y$16:OFFSET('Interior - Space-By-Space'!$Y$56,-1,0),$B34,'Interior - Space-By-Space'!$AA$16:OFFSET('Interior - Space-By-Space'!$AA$56,-1,0)),SUMIF('Interior - Space-By-Space'!$AC$16:OFFSET('Interior - Space-By-Space'!$AC$56,-1,0),$B34,'Interior - Space-By-Space'!$AE$16:OFFSET('Interior - Space-By-Space'!$AE$56,-1,0)),SUMIF('Interior - Space-By-Space'!$AG$16:OFFSET('Interior - Space-By-Space'!$AG$56,-1,0),$B34,'Interior - Space-By-Space'!$AI$16:OFFSET('Interior - Space-By-Space'!$AI$56,-1,0)),SUMIF('Interior - Space-By-Space'!$AK$16:OFFSET('Interior - Space-By-Space'!$AK$56,-1,0),$B34,'Interior - Space-By-Space'!$AM$16:OFFSET('Interior - Space-By-Space'!$AM$56,-1,0)),SUMIF('Interior - Space-By-Space'!$AO$16:OFFSET('Interior - Space-By-Space'!$AO$56,-1,0),$B34,'Interior - Space-By-Space'!$AQ$16:OFFSET('Interior - Space-By-Space'!$AQ$56,-1,0))),IF(ProjectMethod=BAM,SUM('Interior - Building Area Method'!$C45,'Interior - Building Area Method'!$E45,'Interior - Building Area Method'!$G45,'Interior - Building Area Method'!$I45,'Interior - Building Area Method'!$K45),0))+SUM(SUMIF(Exterior!$J$19:$J$69,$B34,Exterior!$K$19:$K$69),SUMIF(Exterior!$M$19:$M$69,$B34,Exterior!$N$19:$N$69),SUMIF(Exterior!$P$19:$P$69,$B34,Exterior!$Q$19:$Q$69),SUMIF(Exterior!$S$19:$S$69,$B34,Exterior!$T$19:$T$69),SUMIF(Exterior!$V$19:$V$69,$B34,Exterior!$W$19:$W$69))","v":0}]
[null,null,null,null,{"$f":"IF(ProjectMethod=SBS,SUM(SUMIF('Interior - Space-By-Space'!$M$16:OFFSET('Interior - Space-By-Space'!$M$56,-1,0),$B35,'Interior - Space-By-Space'!$O$16:OFFSET('Interior - Space-By-Space'!$O$56,-1,0)),SUMIF('Interior - Space-By-Space'!$Q$16:OFFSET('Interior - Space-By-Space'!$Q$56,-1,0),$B35,'Interior - Space-By-Space'!$S$16:OFFSET('Interior - Space-By-Space'!$S$56,-1,0)),SUMIF('Interior - Space-By-Space'!$U$16:OFFSET('Interior - Space-By-Space'!$U$56,-1,0),$B35,'Interior - Space-By-Space'!$W$16:OFFSET('Interior - Space-By-Space'!$W$56,-1,0)),SUMIF('Interior - Space-By-Space'!$Y$16:OFFSET('Interior - Space-By-Space'!$Y$56,-1,0),$B35,'Interior - Space-By-Space'!$AA$16:OFFSET('Interior - Space-By-Space'!$AA$56,-1,0)),SUMIF('Interior - Space-By-Space'!$AC$16:OFFSET('Interior - Space-By-Space'!$AC$56,-1,0),$B35,'Interior - Space-By-Space'!$AE$16:OFFSET('Interior - Space-By-Space'!$AE$56,-1,0)),SUMIF('Interior - Space-By-Space'!$AG$16:OFFSET('Interior - Space-By-Space'!$AG$56,-1,0),$B35,'Interior - Space-By-Space'!$AI$16:OFFSET('Interior - Space-By-Space'!$AI$56,-1,0)),SUMIF('Interior - Space-By-Space'!$AK$16:OFFSET('Interior - Space-By-Space'!$AK$56,-1,0),$B35,'Interior - Space-By-Space'!$AM$16:OFFSET('Interior - Space-By-Space'!$AM$56,-1,0)),SUMIF('Interior - Space-By-Space'!$AO$16:OFFSET('Interior - Space-By-Space'!$AO$56,-1,0),$B35,'Interior - Space-By-Space'!$AQ$16:OFFSET('Interior - Space-By-Space'!$AQ$56,-1,0))),IF(ProjectMethod=BAM,SUM('Interior - Building Area Method'!$C46,'Interior - Building Area Method'!$E46,'Interior - Building Area Method'!$G46,'Interior - Building Area Method'!$I46,'Interior - Building Area Method'!$K46),0))+SUM(SUMIF(Exterior!$J$19:$J$69,$B35,Exterior!$K$19:$K$69),SUMIF(Exterior!$M$19:$M$69,$B35,Exterior!$N$19:$N$69),SUMIF(Exterior!$P$19:$P$69,$B35,Exterior!$Q$19:$Q$69),SUMIF(Exterior!$S$19:$S$69,$B35,Exterior!$T$19:$T$69),SUMIF(Exterior!$V$19:$V$69,$B35,Exterior!$W$19:$W$69))","v":0}]
[null,null,null,null,{"$f":"IF(ProjectMethod=SBS,SUM(SUMIF('Interior - Space-By-Space'!$M$16:OFFSET('Interior - Space-By-Space'!$M$56,-1,0),$B36,'Interior - Space-By-Space'!$O$16:OFFSET('Interior - Space-By-Space'!$O$56,-1,0)),SUMIF('Interior - Space-By-Space'!$Q$16:OFFSET('Interior - Space-By-Space'!$Q$56,-1,0),$B36,'Interior - Space-By-Space'!$S$16:OFFSET('Interior - Space-By-Space'!$S$56,-1,0)),SUMIF('Interior - Space-By-Space'!$U$16:OFFSET('Interior - Space-By-Space'!$U$56,-1,0),$B36,'Interior - Space-By-Space'!$W$16:OFFSET('Interior - Space-By-Space'!$W$56,-1,0)),SUMIF('Interior - Space-By-Space'!$Y$16:OFFSET('Interior - Space-By-Space'!$Y$56,-1,0),$B36,'Interior - Space-By-Space'!$AA$16:OFFSET('Interior - Space-By-Space'!$AA$56,-1,0)),SUMIF('Interior - Space-By-Space'!$AC$16:OFFSET('Interior - Space-By-Space'!$AC$56,-1,0),$B36,'Interior - Space-By-Space'!$AE$16:OFFSET('Interior - Space-By-Space'!$AE$56,-1,0)),SUMIF('Interior - Space-By-Space'!$AG$16:OFFSET('Interior - Space-By-Space'!$AG$56,-1,0),$B36,'Interior - Space-By-Space'!$AI$16:OFFSET('Interior - Space-By-Space'!$AI$56,-1,0)),SUMIF('Interior - Space-By-Space'!$AK$16:OFFSET('Interior - Space-By-Space'!$AK$56,-1,0),$B36,'Interior - Space-By-Space'!$AM$16:OFFSET('Interior - Space-By-Space'!$AM$56,-1,0)),SUMIF('Interior - Space-By-Space'!$AO$16:OFFSET('Interior - Space-By-Space'!$AO$56,-1,0),$B36,'Interior - Space-By-Space'!$AQ$16:OFFSET('Interior - Space-By-Space'!$AQ$56,-1,0))),IF(ProjectMethod=BAM,SUM('Interior - Building Area Method'!$C47,'Interior - Building Area Method'!$E47,'Interior - Building Area Method'!$G47,'Interior - Building Area Method'!$I47,'Interior - Building Area Method'!$K47),0))+SUM(SUMIF(Exterior!$J$19:$J$69,$B36,Exterior!$K$19:$K$69),SUMIF(Exterior!$M$19:$M$69,$B36,Exterior!$N$19:$N$69),SUMIF(Exterior!$P$19:$P$69,$B36,Exterior!$Q$19:$Q$69),SUMIF(Exterior!$S$19:$S$69,$B36,Exterior!$T$19:$T$69),SUMIF(Exterior!$V$19:$V$69,$B36,Exterior!$W$19:$W$69))","v":0}]
[null,null,null,null,{"$f":"IF(ProjectMethod=SBS,SUM(SUMIF('Interior - Space-By-Space'!$M$16:OFFSET('Interior - Space-By-Space'!$M$56,-1,0),$B37,'Interior - Space-By-Space'!$O$16:OFFSET('Interior - Space-By-Space'!$O$56,-1,0)),SUMIF('Interior - Space-By-Space'!$Q$16:OFFSET('Interior - Space-By-Space'!$Q$56,-1,0),$B37,'Interior - Space-By-Space'!$S$16:OFFSET('Interior - Space-By-Space'!$S$56,-1,0)),SUMIF('Interior - Space-By-Space'!$U$16:OFFSET('Interior - Space-By-Space'!$U$56,-1,0),$B37,'Interior - Space-By-Space'!$W$16:OFFSET('Interior - Space-By-Space'!$W$56,-1,0)),SUMIF('Interior - Space-By-Space'!$Y$16:OFFSET('Interior - Space-By-Space'!$Y$56,-1,0),$B37,'Interior - Space-By-Space'!$AA$16:OFFSET('Interior - Space-By-Space'!$AA$56,-1,0)),SUMIF('Interior - Space-By-Space'!$AC$16:OFFSET('Interior - Space-By-Space'!$AC$56,-1,0),$B37,'Interior - Space-By-Space'!$AE$16:OFFSET('Interior - Space-By-Space'!$AE$56,-1,0)),SUMIF('Interior - Space-By-Space'!$AG$16:OFFSET('Interior - Space-By-Space'!$AG$56,-1,0),$B37,'Interior - Space-By-Space'!$AI$16:OFFSET('Interior - Space-By-Space'!$AI$56,-1,0)),SUMIF('Interior - Space-By-Space'!$AK$16:OFFSET('Interior - Space-By-Space'!$AK$56,-1,0),$B37,'Interior - Space-By-Space'!$AM$16:OFFSET('Interior - Space-By-Space'!$AM$56,-1,0)),SUMIF('Interior - Space-By-Space'!$AO$16:OFFSET('Interior - Space-By-Space'!$AO$56,-1,0),$B37,'Interior - Space-By-Space'!$AQ$16:OFFSET('Interior - Space-By-Space'!$AQ$56,-1,0))),IF(ProjectMethod=BAM,SUM('Interior - Building Area Method'!$C48,'Interior - Building Area Method'!$E48,'Interior - Building Area Method'!$G48,'Interior - Building Area Method'!$I48,'Interior - Building Area Method'!$K48),0))+SUM(SUMIF(Exterior!$J$19:$J$69,$B37,Exterior!$K$19:$K$69),SUMIF(Exterior!$M$19:$M$69,$B37,Exterior!$N$19:$N$69),SUMIF(Exterior!$P$19:$P$69,$B37,Exterior!$Q$19:$Q$69),SUMIF(Exterior!$S$19:$S$69,$B37,Exterior!$T$19:$T$69),SUMIF(Exterior!$V$19:$V$69,$B37,Exterior!$W$19:$W$69))","v":0}]
[null,null,null,null,{"$f":"IF(ProjectMethod=SBS,SUM(SUMIF('Interior - Space-By-Space'!$M$16:OFFSET('Interior - Space-By-Space'!$M$56,-1,0),$B38,'Interior - Space-By-Space'!$O$16:OFFSET('Interior - Space-By-Space'!$O$56,-1,0)),SUMIF('Interior - Space-By-Space'!$Q$16:OFFSET('Interior - Space-By-Space'!$Q$56,-1,0),$B38,'Interior - Space-By-Space'!$S$16:OFFSET('Interior - Space-By-Space'!$S$56,-1,0)),SUMIF('Interior - Space-By-Space'!$U$16:OFFSET('Interior - Space-By-Space'!$U$56,-1,0),$B38,'Interior - Space-By-Space'!$W$16:OFFSET('Interior - Space-By-Space'!$W$56,-1,0)),SUMIF('Interior - Space-By-Space'!$Y$16:OFFSET('Interior - Space-By-Space'!$Y$56,-1,0),$B38,'Interior - Space-By-Space'!$AA$16:OFFSET('Interior - Space-By-Space'!$AA$56,-1,0)),SUMIF('Interior - Space-By-Space'!$AC$16:OFFSET('Interior - Space-By-Space'!$AC$56,-1,0),$B38,'Interior - Space-By-Space'!$AE$16:OFFSET('Interior - Space-By-Space'!$AE$56,-1,0)),SUMIF('Interior - Space-By-Space'!$AG$16:OFFSET('Interior - Space-By-Space'!$AG$56,-1,0),$B38,'Interior - Space-By-Space'!$AI$16:OFFSET('Interior - Space-By-Space'!$AI$56,-1,0)),SUMIF('Interior - Space-By-Space'!$AK$16:OFFSET('Interior - Space-By-Space'!$AK$56,-1,0),$B38,'Interior - Space-By-Space'!$AM$16:OFFSET('Interior - Space-By-Space'!$AM$56,-1,0)),SUMIF('Interior - Space-By-Space'!$AO$16:OFFSET('Interior - Space-By-Space'!$AO$56,-1,0),$B38,'Interior - Space-By-Space'!$AQ$16:OFFSET('Interior - Space-By-Space'!$AQ$56,-1,0))),IF(ProjectMethod=BAM,SUM('Interior - Building Area Method'!$C49,'Interior - Building Area Method'!$E49,'Interior - Building Area Method'!$G49,'Interior - Building Area Method'!$I49,'Interior - Building Area Method'!$K49),0))+SUM(SUMIF(Exterior!$J$19:$J$69,$B38,Exterior!$K$19:$K$69),SUMIF(Exterior!$M$19:$M$69,$B38,Exterior!$N$19:$N$69),SUMIF(Exterior!$P$19:$P$69,$B38,Exterior!$Q$19:$Q$69),SUMIF(Exterior!$S$19:$S$69,$B38,Exterior!$T$19:$T$69),SUMIF(Exterior!$V$19:$V$69,$B38,Exterior!$W$19:$W$69))","v":0}]
[null,null,null,null,{"$f":"IF(ProjectMethod=SBS,SUM(SUMIF('Interior - Space-By-Space'!$M$16:OFFSET('Interior - Space-By-Space'!$M$56,-1,0),$B39,'Interior - Space-By-Space'!$O$16:OFFSET('Interior - Space-By-Space'!$O$56,-1,0)),SUMIF('Interior - Space-By-Space'!$Q$16:OFFSET('Interior - Space-By-Space'!$Q$56,-1,0),$B39,'Interior - Space-By-Space'!$S$16:OFFSET('Interior - Space-By-Space'!$S$56,-1,0)),SUMIF('Interior - Space-By-Space'!$U$16:OFFSET('Interior - Space-By-Space'!$U$56,-1,0),$B39,'Interior - Space-By-Space'!$W$16:OFFSET('Interior - Space-By-Space'!$W$56,-1,0)),SUMIF('Interior - Space-By-Space'!$Y$16:OFFSET('Interior - Space-By-Space'!$Y$56,-1,0),$B39,'Interior - Space-By-Space'!$AA$16:OFFSET('Interior - Space-By-Space'!$AA$56,-1,0)),SUMIF('Interior - Space-By-Space'!$AC$16:OFFSET('Interior - Space-By-Space'!$AC$56,-1,0),$B39,'Interior - Space-By-Space'!$AE$16:OFFSET('Interior - Space-By-Space'!$AE$56,-1,0)),SUMIF('Interior - Space-By-Space'!$AG$16:OFFSET('Interior - Space-By-Space'!$AG$56,-1,0),$B39,'Interior - Space-By-Space'!$AI$16:OFFSET('Interior - Space-By-Space'!$AI$56,-1,0)),SUMIF('Interior - Space-By-Space'!$AK$16:OFFSET('Interior - Space-By-Space'!$AK$56,-1,0),$B39,'Interior - Space-By-Space'!$AM$16:OFFSET('Interior - Space-By-Space'!$AM$56,-1,0)),SUMIF('Interior - Space-By-Space'!$AO$16:OFFSET('Interior - Space-By-Space'!$AO$56,-1,0),$B39,'Interior - Space-By-Space'!$AQ$16:OFFSET('Interior - Space-By-Space'!$AQ$56,-1,0))),IF(ProjectMethod=BAM,SUM('Interior - Building Area Method'!$C50,'Interior - Building Area Method'!$E50,'Interior - Building Area Method'!$G50,'Interior - Building Area Method'!$I50,'Interior - Building Area Method'!$K50),0))+SUM(SUMIF(Exterior!$J$19:$J$69,$B39,Exterior!$K$19:$K$69),SUMIF(Exterior!$M$19:$M$69,$B39,Exterior!$N$19:$N$69),SUMIF(Exterior!$P$19:$P$69,$B39,Exterior!$Q$19:$Q$69),SUMIF(Exterior!$S$19:$S$69,$B39,Exterior!$T$19:$T$69),SUMIF(Exterior!$V$19:$V$69,$B39,Exterior!$W$19:$W$69))","v":0}]
[null,null,null,null,{"$f":"IF(ProjectMethod=SBS,SUM(SUMIF('Interior - Space-By-Space'!$M$16:OFFSET('Interior - Space-By-Space'!$M$56,-1,0),$B40,'Interior - Space-By-Space'!$O$16:OFFSET('Interior - Space-By-Space'!$O$56,-1,0)),SUMIF('Interior - Space-By-Space'!$Q$16:OFFSET('Interior - Space-By-Space'!$Q$56,-1,0),$B40,'Interior - Space-By-Space'!$S$16:OFFSET('Interior - Space-By-Space'!$S$56,-1,0)),SUMIF('Interior - Space-By-Space'!$U$16:OFFSET('Interior - Space-By-Space'!$U$56,-1,0),$B40,'Interior - Space-By-Space'!$W$16:OFFSET('Interior - Space-By-Space'!$W$56,-1,0)),SUMIF('Interior - Space-By-Space'!$Y$16:OFFSET('Interior - Space-By-Space'!$Y$56,-1,0),$B40,'Interior - Space-By-Space'!$AA$16:OFFSET('Interior - Space-By-Space'!$AA$56,-1,0)),SUMIF('Interior - Space-By-Space'!$AC$16:OFFSET('Interior - Space-By-Space'!$AC$56,-1,0),$B40,'Interior - Space-By-Space'!$AE$16:OFFSET('Interior - Space-By-Space'!$AE$56,-1,0)),SUMIF('Interior - Space-By-Space'!$AG$16:OFFSET('Interior - Space-By-Space'!$AG$56,-1,0),$B40,'Interior - Space-By-Space'!$AI$16:OFFSET('Interior - Space-By-Space'!$AI$56,-1,0)),SUMIF('Interior - Space-By-Space'!$AK$16:OFFSET('Interior - Space-By-Space'!$AK$56,-1,0),$B40,'Interior - Space-By-Space'!$AM$16:OFFSET('Interior - Space-By-Space'!$AM$56,-1,0)),SUMIF('Interior - Space-By-Space'!$AO$16:OFFSET('Interior - Space-By-Space'!$AO$56,-1,0),$B40,'Interior - Space-By-Space'!$AQ$16:OFFSET('Interior - Space-By-Space'!$AQ$56,-1,0))),IF(ProjectMethod=BAM,SUM('Interior - Building Area Method'!$C51,'Interior - Building Area Method'!$E51,'Interior - Building Area Method'!$G51,'Interior - Building Area Method'!$I51,'Interior - Building Area Method'!$K51),0))+SUM(SUMIF(Exterior!$J$19:$J$69,$B40,Exterior!$K$19:$K$69),SUMIF(Exterior!$M$19:$M$69,$B40,Exterior!$N$19:$N$69),SUMIF(Exterior!$P$19:$P$69,$B40,Exterior!$Q$19:$Q$69),SUMIF(Exterior!$S$19:$S$69,$B40,Exterior!$T$19:$T$69),SUMIF(Exterior!$V$19:$V$69,$B40,Exterior!$W$19:$W$69))","v":0}]
[null,null,null,null,{"$f":"IF(ProjectMethod=SBS,SUM(SUMIF('Interior - Space-By-Space'!$M$16:OFFSET('Interior - Space-By-Space'!$M$56,-1,0),$B41,'Interior - Space-By-Space'!$O$16:OFFSET('Interior - Space-By-Space'!$O$56,-1,0)),SUMIF('Interior - Space-By-Space'!$Q$16:OFFSET('Interior - Space-By-Space'!$Q$56,-1,0),$B41,'Interior - Space-By-Space'!$S$16:OFFSET('Interior - Space-By-Space'!$S$56,-1,0)),SUMIF('Interior - Space-By-Space'!$U$16:OFFSET('Interior - Space-By-Space'!$U$56,-1,0),$B41,'Interior - Space-By-Space'!$W$16:OFFSET('Interior - Space-By-Space'!$W$56,-1,0)),SUMIF('Interior - Space-By-Space'!$Y$16:OFFSET('Interior - Space-By-Space'!$Y$56,-1,0),$B41,'Interior - Space-By-Space'!$AA$16:OFFSET('Interior - Space-By-Space'!$AA$56,-1,0)),SUMIF('Interior - Space-By-Space'!$AC$16:OFFSET('Interior - Space-By-Space'!$AC$56,-1,0),$B41,'Interior - Space-By-Space'!$AE$16:OFFSET('Interior - Space-By-Space'!$AE$56,-1,0)),SUMIF('Interior - Space-By-Space'!$AG$16:OFFSET('Interior - Space-By-Space'!$AG$56,-1,0),$B41,'Interior - Space-By-Space'!$AI$16:OFFSET('Interior - Space-By-Space'!$AI$56,-1,0)),SUMIF('Interior - Space-By-Space'!$AK$16:OFFSET('Interior - Space-By-Space'!$AK$56,-1,0),$B41,'Interior - Space-By-Space'!$AM$16:OFFSET('Interior - Space-By-Space'!$AM$56,-1,0)),SUMIF('Interior - Space-By-Space'!$AO$16:OFFSET('Interior - Space-By-Space'!$AO$56,-1,0),$B41,'Interior - Space-By-Space'!$AQ$16:OFFSET('Interior - Space-By-Space'!$AQ$56,-1,0))),IF(ProjectMethod=BAM,SUM('Interior - Building Area Method'!$C52,'Interior - Building Area Method'!$E52,'Interior - Building Area Method'!$G52,'Interior - Building Area Method'!$I52,'Interior - Building Area Method'!$K52),0))+SUM(SUMIF(Exterior!$J$19:$J$69,$B41,Exterior!$K$19:$K$69),SUMIF(Exterior!$M$19:$M$69,$B41,Exterior!$N$19:$N$69),SUMIF(Exterior!$P$19:$P$69,$B41,Exterior!$Q$19:$Q$69),SUMIF(Exterior!$S$19:$S$69,$B41,Exterior!$T$19:$T$69),SUMIF(Exterior!$V$19:$V$69,$B41,Exterior!$W$19:$W$69))","v":0}]
[null,null,null,null,{"$f":"IF(ProjectMethod=SBS,SUM(SUMIF('Interior - Space-By-Space'!$M$16:OFFSET('Interior - Space-By-Space'!$M$56,-1,0),$B42,'Interior - Space-By-Space'!$O$16:OFFSET('Interior - Space-By-Space'!$O$56,-1,0)),SUMIF('Interior - Space-By-Space'!$Q$16:OFFSET('Interior - Space-By-Space'!$Q$56,-1,0),$B42,'Interior - Space-By-Space'!$S$16:OFFSET('Interior - Space-By-Space'!$S$56,-1,0)),SUMIF('Interior - Space-By-Space'!$U$16:OFFSET('Interior - Space-By-Space'!$U$56,-1,0),$B42,'Interior - Space-By-Space'!$W$16:OFFSET('Interior - Space-By-Space'!$W$56,-1,0)),SUMIF('Interior - Space-By-Space'!$Y$16:OFFSET('Interior - Space-By-Space'!$Y$56,-1,0),$B42,'Interior - Space-By-Space'!$AA$16:OFFSET('Interior - Space-By-Space'!$AA$56,-1,0)),SUMIF('Interior - Space-By-Space'!$AC$16:OFFSET('Interior - Space-By-Space'!$AC$56,-1,0),$B42,'Interior - Space-By-Space'!$AE$16:OFFSET('Interior - Space-By-Space'!$AE$56,-1,0)),SUMIF('Interior - Space-By-Space'!$AG$16:OFFSET('Interior - Space-By-Space'!$AG$56,-1,0),$B42,'Interior - Space-By-Space'!$AI$16:OFFSET('Interior - Space-By-Space'!$AI$56,-1,0)),SUMIF('Interior - Space-By-Space'!$AK$16:OFFSET('Interior - Space-By-Space'!$AK$56,-1,0),$B42,'Interior - Space-By-Space'!$AM$16:OFFSET('Interior - Space-By-Space'!$AM$56,-1,0)),SUMIF('Interior - Space-By-Space'!$AO$16:OFFSET('Interior - Space-By-Space'!$AO$56,-1,0),$B42,'Interior - Space-By-Space'!$AQ$16:OFFSET('Interior - Space-By-Space'!$AQ$56,-1,0))),IF(ProjectMethod=BAM,SUM('Interior - Building Area Method'!$C53,'Interior - Building Area Method'!$E53,'Interior - Building Area Method'!$G53,'Interior - Building Area Method'!$I53,'Interior - Building Area Method'!$K53),0))+SUM(SUMIF(Exterior!$J$19:$J$69,$B42,Exterior!$K$19:$K$69),SUMIF(Exterior!$M$19:$M$69,$B42,Exterior!$N$19:$N$69),SUMIF(Exterior!$P$19:$P$69,$B42,Exterior!$Q$19:$Q$69),SUMIF(Exterior!$S$19:$S$69,$B42,Exterior!$T$19:$T$69),SUMIF(Exterior!$V$19:$V$69,$B42,Exterior!$W$19:$W$69))","v":0}]
[null,null,null,null,{"$f":"IF(ProjectMethod=SBS,SUM(SUMIF('Interior - Space-By-Space'!$M$16:OFFSET('Interior - Space-By-Space'!$M$56,-1,0),$B43,'Interior - Space-By-Space'!$O$16:OFFSET('Interior - Space-By-Space'!$O$56,-1,0)),SUMIF('Interior - Space-By-Space'!$Q$16:OFFSET('Interior - Space-By-Space'!$Q$56,-1,0),$B43,'Interior - Space-By-Space'!$S$16:OFFSET('Interior - Space-By-Space'!$S$56,-1,0)),SUMIF('Interior - Space-By-Space'!$U$16:OFFSET('Interior - Space-By-Space'!$U$56,-1,0),$B43,'Interior - Space-By-Space'!$W$16:OFFSET('Interior - Space-By-Space'!$W$56,-1,0)),SUMIF('Interior - Space-By-Space'!$Y$16:OFFSET('Interior - Space-By-Space'!$Y$56,-1,0),$B43,'Interior - Space-By-Space'!$AA$16:OFFSET('Interior - Space-By-Space'!$AA$56,-1,0)),SUMIF('Interior - Space-By-Space'!$AC$16:OFFSET('Interior - Space-By-Space'!$AC$56,-1,0),$B43,'Interior - Space-By-Space'!$AE$16:OFFSET('Interior - Space-By-Space'!$AE$56,-1,0)),SUMIF('Interior - Space-By-Space'!$AG$16:OFFSET('Interior - Space-By-Space'!$AG$56,-1,0),$B43,'Interior - Space-By-Space'!$AI$16:OFFSET('Interior - Space-By-Space'!$AI$56,-1,0)),SUMIF('Interior - Space-By-Space'!$AK$16:OFFSET('Interior - Space-By-Space'!$AK$56,-1,0),$B43,'Interior - Space-By-Space'!$AM$16:OFFSET('Interior - Space-By-Space'!$AM$56,-1,0)),SUMIF('Interior - Space-By-Space'!$AO$16:OFFSET('Interior - Space-By-Space'!$AO$56,-1,0),$B43,'Interior - Space-By-Space'!$AQ$16:OFFSET('Interior - Space-By-Space'!$AQ$56,-1,0))),IF(ProjectMethod=BAM,SUM('Interior - Building Area Method'!$C54,'Interior - Building Area Method'!$E54,'Interior - Building Area Method'!$G54,'Interior - Building Area Method'!$I54,'Interior - Building Area Method'!$K54),0))+SUM(SUMIF(Exterior!$J$19:$J$69,$B43,Exterior!$K$19:$K$69),SUMIF(Exterior!$M$19:$M$69,$B43,Exterior!$N$19:$N$69),SUMIF(Exterior!$P$19:$P$69,$B43,Exterior!$Q$19:$Q$69),SUMIF(Exterior!$S$19:$S$69,$B43,Exterior!$T$19:$T$69),SUMIF(Exterior!$V$19:$V$69,$B43,Exterior!$W$19:$W$69))","v":0}]
[null,null,null,null,{"$f":"IF(ProjectMethod=SBS,SUM(SUMIF('Interior - Space-By-Space'!$M$16:OFFSET('Interior - Space-By-Space'!$M$56,-1,0),$B44,'Interior - Space-By-Space'!$O$16:OFFSET('Interior - Space-By-Space'!$O$56,-1,0)),SUMIF('Interior - Space-By-Space'!$Q$16:OFFSET('Interior - Space-By-Space'!$Q$56,-1,0),$B44,'Interior - Space-By-Space'!$S$16:OFFSET('Interior - Space-By-Space'!$S$56,-1,0)),SUMIF('Interior - Space-By-Space'!$U$16:OFFSET('Interior - Space-By-Space'!$U$56,-1,0),$B44,'Interior - Space-By-Space'!$W$16:OFFSET('Interior - Space-By-Space'!$W$56,-1,0)),SUMIF('Interior - Space-By-Space'!$Y$16:OFFSET('Interior - Space-By-Space'!$Y$56,-1,0),$B44,'Interior - Space-By-Space'!$AA$16:OFFSET('Interior - Space-By-Space'!$AA$56,-1,0)),SUMIF('Interior - Space-By-Space'!$AC$16:OFFSET('Interior - Space-By-Space'!$AC$56,-1,0),$B44,'Interior - Space-By-Space'!$AE$16:OFFSET('Interior - Space-By-Space'!$AE$56,-1,0)),SUMIF('Interior - Space-By-Space'!$AG$16:OFFSET('Interior - Space-By-Space'!$AG$56,-1,0),$B44,'Interior - Space-By-Space'!$AI$16:OFFSET('Interior - Space-By-Space'!$AI$56,-1,0)),SUMIF('Interior - Space-By-Space'!$AK$16:OFFSET('Interior - Space-By-Space'!$AK$56,-1,0),$B44,'Interior - Space-By-Space'!$AM$16:OFFSET('Interior - Space-By-Space'!$AM$56,-1,0)),SUMIF('Interior - Space-By-Space'!$AO$16:OFFSET('Interior - Space-By-Space'!$AO$56,-1,0),$B44,'Interior - Space-By-Space'!$AQ$16:OFFSET('Interior - Space-By-Space'!$AQ$56,-1,0))),IF(ProjectMethod=BAM,SUM('Interior - Building Area Method'!$C55,'Interior - Building Area Method'!$E55,'Interior - Building Area Method'!$G55,'Interior - Building Area Method'!$I55,'Interior - Building Area Method'!$K55),0))+SUM(SUMIF(Exterior!$J$19:$J$69,$B44,Exterior!$K$19:$K$69),SUMIF(Exterior!$M$19:$M$69,$B44,Exterior!$N$19:$N$69),SUMIF(Exterior!$P$19:$P$69,$B44,Exterior!$Q$19:$Q$69),SUMIF(Exterior!$S$19:$S$69,$B44,Exterior!$T$19:$T$69),SUMIF(Exterior!$V$19:$V$69,$B44,Exterior!$W$19:$W$69))","v":0}]
[null,null,null,null,{"$f":"IF(ProjectMethod=SBS,SUM(SUMIF('Interior - Space-By-Space'!$M$16:OFFSET('Interior - Space-By-Space'!$M$56,-1,0),$B45,'Interior - Space-By-Space'!$O$16:OFFSET('Interior - Space-By-Space'!$O$56,-1,0)),SUMIF('Interior - Space-By-Space'!$Q$16:OFFSET('Interior - Space-By-Space'!$Q$56,-1,0),$B45,'Interior - Space-By-Space'!$S$16:OFFSET('Interior - Space-By-Space'!$S$56,-1,0)),SUMIF('Interior - Space-By-Space'!$U$16:OFFSET('Interior - Space-By-Space'!$U$56,-1,0),$B45,'Interior - Space-By-Space'!$W$16:OFFSET('Interior - Space-By-Space'!$W$56,-1,0)),SUMIF('Interior - Space-By-Space'!$Y$16:OFFSET('Interior - Space-By-Space'!$Y$56,-1,0),$B45,'Interior - Space-By-Space'!$AA$16:OFFSET('Interior - Space-By-Space'!$AA$56,-1,0)),SUMIF('Interior - Space-By-Space'!$AC$16:OFFSET('Interior - Space-By-Space'!$AC$56,-1,0),$B45,'Interior - Space-By-Space'!$AE$16:OFFSET('Interior - Space-By-Space'!$AE$56,-1,0)),SUMIF('Interior - Space-By-Space'!$AG$16:OFFSET('Interior - Space-By-Space'!$AG$56,-1,0),$B45,'Interior - Space-By-Space'!$AI$16:OFFSET('Interior - Space-By-Space'!$AI$56,-1,0)),SUMIF('Interior - Space-By-Space'!$AK$16:OFFSET('Interior - Space-By-Space'!$AK$56,-1,0),$B45,'Interior - Space-By-Space'!$AM$16:OFFSET('Interior - Space-By-Space'!$AM$56,-1,0)),SUMIF('Interior - Space-By-Space'!$AO$16:OFFSET('Interior - Space-By-Space'!$AO$56,-1,0),$B45,'Interior - Space-By-Space'!$AQ$16:OFFSET('Interior - Space-By-Space'!$AQ$56,-1,0))),IF(ProjectMethod=BAM,SUM('Interior - Building Area Method'!$C56,'Interior - Building Area Method'!$E56,'Interior - Building Area Method'!$G56,'Interior - Building Area Method'!$I56,'Interior - Building Area Method'!$K56),0))+SUM(SUMIF(Exterior!$J$19:$J$69,$B45,Exterior!$K$19:$K$69),SUMIF(Exterior!$M$19:$M$69,$B45,Exterior!$N$19:$N$69),SUMIF(Exterior!$P$19:$P$69,$B45,Exterior!$Q$19:$Q$69),SUMIF(Exterior!$S$19:$S$69,$B45,Exterior!$T$19:$T$69),SUMIF(Exterior!$V$19:$V$69,$B45,Exterior!$W$19:$W$69))","v":0}]
[null,null,null,null,{"$f":"IF(ProjectMethod=SBS,SUM(SUMIF('Interior - Space-By-Space'!$M$16:OFFSET('Interior - Space-By-Space'!$M$56,-1,0),$B46,'Interior - Space-By-Space'!$O$16:OFFSET('Interior - Space-By-Space'!$O$56,-1,0)),SUMIF('Interior - Space-By-Space'!$Q$16:OFFSET('Interior - Space-By-Space'!$Q$56,-1,0),$B46,'Interior - Space-By-Space'!$S$16:OFFSET('Interior - Space-By-Space'!$S$56,-1,0)),SUMIF('Interior - Space-By-Space'!$U$16:OFFSET('Interior - Space-By-Space'!$U$56,-1,0),$B46,'Interior - Space-By-Space'!$W$16:OFFSET('Interior - Space-By-Space'!$W$56,-1,0)),SUMIF('Interior - Space-By-Space'!$Y$16:OFFSET('Interior - Space-By-Space'!$Y$56,-1,0),$B46,'Interior - Space-By-Space'!$AA$16:OFFSET('Interior - Space-By-Space'!$AA$56,-1,0)),SUMIF('Interior - Space-By-Space'!$AC$16:OFFSET('Interior - Space-By-Space'!$AC$56,-1,0),$B46,'Interior - Space-By-Space'!$AE$16:OFFSET('Interior - Space-By-Space'!$AE$56,-1,0)),SUMIF('Interior - Space-By-Space'!$AG$16:OFFSET('Interior - Space-By-Space'!$AG$56,-1,0),$B46,'Interior - Space-By-Space'!$AI$16:OFFSET('Interior - Space-By-Space'!$AI$56,-1,0)),SUMIF('Interior - Space-By-Space'!$AK$16:OFFSET('Interior - Space-By-Space'!$AK$56,-1,0),$B46,'Interior - Space-By-Space'!$AM$16:OFFSET('Interior - Space-By-Space'!$AM$56,-1,0)),SUMIF('Interior - Space-By-Space'!$AO$16:OFFSET('Interior - Space-By-Space'!$AO$56,-1,0),$B46,'Interior - Space-By-Space'!$AQ$16:OFFSET('Interior - Space-By-Space'!$AQ$56,-1,0))),IF(ProjectMethod=BAM,SUM('Interior - Building Area Method'!$C57,'Interior - Building Area Method'!$E57,'Interior - Building Area Method'!$G57,'Interior - Building Area Method'!$I57,'Interior - Building Area Method'!$K57),0))+SUM(SUMIF(Exterior!$J$19:$J$69,$B46,Exterior!$K$19:$K$69),SUMIF(Exterior!$M$19:$M$69,$B46,Exterior!$N$19:$N$69),SUMIF(Exterior!$P$19:$P$69,$B46,Exterior!$Q$19:$Q$69),SUMIF(Exterior!$S$19:$S$69,$B46,Exterior!$T$19:$T$69),SUMIF(Exterior!$V$19:$V$69,$B46,Exterior!$W$19:$W$69))","v":0}]
[null,null,null,null,{"$f":"IF(ProjectMethod=SBS,SUM(SUMIF('Interior - Space-By-Space'!$M$16:OFFSET('Interior - Space-By-Space'!$M$56,-1,0),$B47,'Interior - Space-By-Space'!$O$16:OFFSET('Interior - Space-By-Space'!$O$56,-1,0)),SUMIF('Interior - Space-By-Space'!$Q$16:OFFSET('Interior - Space-By-Space'!$Q$56,-1,0),$B47,'Interior - Space-By-Space'!$S$16:OFFSET('Interior - Space-By-Space'!$S$56,-1,0)),SUMIF('Interior - Space-By-Space'!$U$16:OFFSET('Interior - Space-By-Space'!$U$56,-1,0),$B47,'Interior - Space-By-Space'!$W$16:OFFSET('Interior - Space-By-Space'!$W$56,-1,0)),SUMIF('Interior - Space-By-Space'!$Y$16:OFFSET('Interior - Space-By-Space'!$Y$56,-1,0),$B47,'Interior - Space-By-Space'!$AA$16:OFFSET('Interior - Space-By-Space'!$AA$56,-1,0)),SUMIF('Interior - Space-By-Space'!$AC$16:OFFSET('Interior - Space-By-Space'!$AC$56,-1,0),$B47,'Interior - Space-By-Space'!$AE$16:OFFSET('Interior - Space-By-Space'!$AE$56,-1,0)),SUMIF('Interior - Space-By-Space'!$AG$16:OFFSET('Interior - Space-By-Space'!$AG$56,-1,0),$B47,'Interior - Space-By-Space'!$AI$16:OFFSET('Interior - Space-By-Space'!$AI$56,-1,0)),SUMIF('Interior - Space-By-Space'!$AK$16:OFFSET('Interior - Space-By-Space'!$AK$56,-1,0),$B47,'Interior - Space-By-Space'!$AM$16:OFFSET('Interior - Space-By-Space'!$AM$56,-1,0)),SUMIF('Interior - Space-By-Space'!$AO$16:OFFSET('Interior - Space-By-Space'!$AO$56,-1,0),$B47,'Interior - Space-By-Space'!$AQ$16:OFFSET('Interior - Space-By-Space'!$AQ$56,-1,0))),IF(ProjectMethod=BAM,SUM('Interior - Building Area Method'!$C58,'Interior - Building Area Method'!$E58,'Interior - Building Area Method'!$G58,'Interior - Building Area Method'!$I58,'Interior - Building Area Method'!$K58),0))+SUM(SUMIF(Exterior!$J$19:$J$69,$B47,Exterior!$K$19:$K$69),SUMIF(Exterior!$M$19:$M$69,$B47,Exterior!$N$19:$N$69),SUMIF(Exterior!$P$19:$P$69,$B47,Exterior!$Q$19:$Q$69),SUMIF(Exterior!$S$19:$S$69,$B47,Exterior!$T$19:$T$69),SUMIF(Exterior!$V$19:$V$69,$B47,Exterior!$W$19:$W$69))","v":0}]
[null,null,null,null,{"$f":"IF(ProjectMethod=SBS,SUM(SUMIF('Interior - Space-By-Space'!$M$16:OFFSET('Interior - Space-By-Space'!$M$56,-1,0),$B48,'Interior - Space-By-Space'!$O$16:OFFSET('Interior - Space-By-Space'!$O$56,-1,0)),SUMIF('Interior - Space-By-Space'!$Q$16:OFFSET('Interior - Space-By-Space'!$Q$56,-1,0),$B48,'Interior - Space-By-Space'!$S$16:OFFSET('Interior - Space-By-Space'!$S$56,-1,0)),SUMIF('Interior - Space-By-Space'!$U$16:OFFSET('Interior - Space-By-Space'!$U$56,-1,0),$B48,'Interior - Space-By-Space'!$W$16:OFFSET('Interior - Space-By-Space'!$W$56,-1,0)),SUMIF('Interior - Space-By-Space'!$Y$16:OFFSET('Interior - Space-By-Space'!$Y$56,-1,0),$B48,'Interior - Space-By-Space'!$AA$16:OFFSET('Interior - Space-By-Space'!$AA$56,-1,0)),SUMIF('Interior - Space-By-Space'!$AC$16:OFFSET('Interior - Space-By-Space'!$AC$56,-1,0),$B48,'Interior - Space-By-Space'!$AE$16:OFFSET('Interior - Space-By-Space'!$AE$56,-1,0)),SUMIF('Interior - Space-By-Space'!$AG$16:OFFSET('Interior - Space-By-Space'!$AG$56,-1,0),$B48,'Interior - Space-By-Space'!$AI$16:OFFSET('Interior - Space-By-Space'!$AI$56,-1,0)),SUMIF('Interior - Space-By-Space'!$AK$16:OFFSET('Interior - Space-By-Space'!$AK$56,-1,0),$B48,'Interior - Space-By-Space'!$AM$16:OFFSET('Interior - Space-By-Space'!$AM$56,-1,0)),SUMIF('Interior - Space-By-Space'!$AO$16:OFFSET('Interior - Space-By-Space'!$AO$56,-1,0),$B48,'Interior - Space-By-Space'!$AQ$16:OFFSET('Interior - Space-By-Space'!$AQ$56,-1,0))),IF(ProjectMethod=BAM,SUM('Interior - Building Area Method'!$C59,'Interior - Building Area Method'!$E59,'Interior - Building Area Method'!$G59,'Interior - Building Area Method'!$I59,'Interior - Building Area Method'!$K59),0))+SUM(SUMIF(Exterior!$J$19:$J$69,$B48,Exterior!$K$19:$K$69),SUMIF(Exterior!$M$19:$M$69,$B48,Exterior!$N$19:$N$69),SUMIF(Exterior!$P$19:$P$69,$B48,Exterior!$Q$19:$Q$69),SUMIF(Exterior!$S$19:$S$69,$B48,Exterior!$T$19:$T$69),SUMIF(Exterior!$V$19:$V$69,$B48,Exterior!$W$19:$W$69))","v":0}]
[null,null,null,null,{"$f":"IF(ProjectMethod=SBS,SUM(SUMIF('Interior - Space-By-Space'!$M$16:OFFSET('Interior - Space-By-Space'!$M$56,-1,0),$B49,'Interior - Space-By-Space'!$O$16:OFFSET('Interior - Space-By-Space'!$O$56,-1,0)),SUMIF('Interior - Space-By-Space'!$Q$16:OFFSET('Interior - Space-By-Space'!$Q$56,-1,0),$B49,'Interior - Space-By-Space'!$S$16:OFFSET('Interior - Space-By-Space'!$S$56,-1,0)),SUMIF('Interior - Space-By-Space'!$U$16:OFFSET('Interior - Space-By-Space'!$U$56,-1,0),$B49,'Interior - Space-By-Space'!$W$16:OFFSET('Interior - Space-By-Space'!$W$56,-1,0)),SUMIF('Interior - Space-By-Space'!$Y$16:OFFSET('Interior - Space-By-Space'!$Y$56,-1,0),$B49,'Interior - Space-By-Space'!$AA$16:OFFSET('Interior - Space-By-Space'!$AA$56,-1,0)),SUMIF('Interior - Space-By-Space'!$AC$16:OFFSET('Interior - Space-By-Space'!$AC$56,-1,0),$B49,'Interior - Space-By-Space'!$AE$16:OFFSET('Interior - Space-By-Space'!$AE$56,-1,0)),SUMIF('Interior - Space-By-Space'!$AG$16:OFFSET('Interior - Space-By-Space'!$AG$56,-1,0),$B49,'Interior - Space-By-Space'!$AI$16:OFFSET('Interior - Space-By-Space'!$AI$56,-1,0)),SUMIF('Interior - Space-By-Space'!$AK$16:OFFSET('Interior - Space-By-Space'!$AK$56,-1,0),$B49,'Interior - Space-By-Space'!$AM$16:OFFSET('Interior - Space-By-Space'!$AM$56,-1,0)),SUMIF('Interior - Space-By-Space'!$AO$16:OFFSET('Interior - Space-By-Space'!$AO$56,-1,0),$B49,'Interior - Space-By-Space'!$AQ$16:OFFSET('Interior - Space-By-Space'!$AQ$56,-1,0))),IF(ProjectMethod=BAM,SUM('Interior - Building Area Method'!$C60,'Interior - Building Area Method'!$E60,'Interior - Building Area Method'!$G60,'Interior - Building Area Method'!$I60,'Interior - Building Area Method'!$K60),0))+SUM(SUMIF(Exterior!$J$19:$J$69,$B49,Exterior!$K$19:$K$69),SUMIF(Exterior!$M$19:$M$69,$B49,Exterior!$N$19:$N$69),SUMIF(Exterior!$P$19:$P$69,$B49,Exterior!$Q$19:$Q$69),SUMIF(Exterior!$S$19:$S$69,$B49,Exterior!$T$19:$T$69),SUMIF(Exterior!$V$19:$V$69,$B49,Exterior!$W$19:$W$69))","v":0}]
[null,null,null,null,{"$f":"IF(ProjectMethod=SBS,SUM(SUMIF('Interior - Space-By-Space'!$M$16:OFFSET('Interior - Space-By-Space'!$M$56,-1,0),$B50,'Interior - Space-By-Space'!$O$16:OFFSET('Interior - Space-By-Space'!$O$56,-1,0)),SUMIF('Interior - Space-By-Space'!$Q$16:OFFSET('Interior - Space-By-Space'!$Q$56,-1,0),$B50,'Interior - Space-By-Space'!$S$16:OFFSET('Interior - Space-By-Space'!$S$56,-1,0)),SUMIF('Interior - Space-By-Space'!$U$16:OFFSET('Interior - Space-By-Space'!$U$56,-1,0),$B50,'Interior - Space-By-Space'!$W$16:OFFSET('Interior - Space-By-Space'!$W$56,-1,0)),SUMIF('Interior - Space-By-Space'!$Y$16:OFFSET('Interior - Space-By-Space'!$Y$56,-1,0),$B50,'Interior - Space-By-Space'!$AA$16:OFFSET('Interior - Space-By-Space'!$AA$56,-1,0)),SUMIF('Interior - Space-By-Space'!$AC$16:OFFSET('Interior - Space-By-Space'!$AC$56,-1,0),$B50,'Interior - Space-By-Space'!$AE$16:OFFSET('Interior - Space-By-Space'!$AE$56,-1,0)),SUMIF('Interior - Space-By-Space'!$AG$16:OFFSET('Interior - Space-By-Space'!$AG$56,-1,0),$B50,'Interior - Space-By-Space'!$AI$16:OFFSET('Interior - Space-By-Space'!$AI$56,-1,0)),SUMIF('Interior - Space-By-Space'!$AK$16:OFFSET('Interior - Space-By-Space'!$AK$56,-1,0),$B50,'Interior - Space-By-Space'!$AM$16:OFFSET('Interior - Space-By-Space'!$AM$56,-1,0)),SUMIF('Interior - Space-By-Space'!$AO$16:OFFSET('Interior - Space-By-Space'!$AO$56,-1,0),$B50,'Interior - Space-By-Space'!$AQ$16:OFFSET('Interior - Space-By-Space'!$AQ$56,-1,0))),IF(ProjectMethod=BAM,SUM('Interior - Building Area Method'!$C61,'Interior - Building Area Method'!$E61,'Interior - Building Area Method'!$G61,'Interior - Building Area Method'!$I61,'Interior - Building Area Method'!$K61),0))+SUM(SUMIF(Exterior!$J$19:$J$69,$B50,Exterior!$K$19:$K$69),SUMIF(Exterior!$M$19:$M$69,$B50,Exterior!$N$19:$N$69),SUMIF(Exterior!$P$19:$P$69,$B50,Exterior!$Q$19:$Q$69),SUMIF(Exterior!$S$19:$S$69,$B50,Exterior!$T$19:$T$69),SUMIF(Exterior!$V$19:$V$69,$B50,Exterior!$W$19:$W$69))","v":0}]
[null,null,null,null,{"$f":"IF(ProjectMethod=SBS,SUM(SUMIF('Interior - Space-By-Space'!$M$16:OFFSET('Interior - Space-By-Space'!$M$56,-1,0),$B51,'Interior - Space-By-Space'!$O$16:OFFSET('Interior - Space-By-Space'!$O$56,-1,0)),SUMIF('Interior - Space-By-Space'!$Q$16:OFFSET('Interior - Space-By-Space'!$Q$56,-1,0),$B51,'Interior - Space-By-Space'!$S$16:OFFSET('Interior - Space-By-Space'!$S$56,-1,0)),SUMIF('Interior - Space-By-Space'!$U$16:OFFSET('Interior - Space-By-Space'!$U$56,-1,0),$B51,'Interior - Space-By-Space'!$W$16:OFFSET('Interior - Space-By-Space'!$W$56,-1,0)),SUMIF('Interior - Space-By-Space'!$Y$16:OFFSET('Interior - Space-By-Space'!$Y$56,-1,0),$B51,'Interior - Space-By-Space'!$AA$16:OFFSET('Interior - Space-By-Space'!$AA$56,-1,0)),SUMIF('Interior - Space-By-Space'!$AC$16:OFFSET('Interior - Space-By-Space'!$AC$56,-1,0),$B51,'Interior - Space-By-Space'!$AE$16:OFFSET('Interior - Space-By-Space'!$AE$56,-1,0)),SUMIF('Interior - Space-By-Space'!$AG$16:OFFSET('Interior - Space-By-Space'!$AG$56,-1,0),$B51,'Interior - Space-By-Space'!$AI$16:OFFSET('Interior - Space-By-Space'!$AI$56,-1,0)),SUMIF('Interior - Space-By-Space'!$AK$16:OFFSET('Interior - Space-By-Space'!$AK$56,-1,0),$B51,'Interior - Space-By-Space'!$AM$16:OFFSET('Interior - Space-By-Space'!$AM$56,-1,0)),SUMIF('Interior - Space-By-Space'!$AO$16:OFFSET('Interior - Space-By-Space'!$AO$56,-1,0),$B51,'Interior - Space-By-Space'!$AQ$16:OFFSET('Interior - Space-By-Space'!$AQ$56,-1,0))),IF(ProjectMethod=BAM,SUM('Interior - Building Area Method'!$C62,'Interior - Building Area Method'!$E62,'Interior - Building Area Method'!$G62,'Interior - Building Area Method'!$I62,'Interior - Building Area Method'!$K62),0))+SUM(SUMIF(Exterior!$J$19:$J$69,$B51,Exterior!$K$19:$K$69),SUMIF(Exterior!$M$19:$M$69,$B51,Exterior!$N$19:$N$69),SUMIF(Exterior!$P$19:$P$69,$B51,Exterior!$Q$19:$Q$69),SUMIF(Exterior!$S$19:$S$69,$B51,Exterior!$T$19:$T$69),SUMIF(Exterior!$V$19:$V$69,$B51,Exterior!$W$19:$W$69))","v":0}]
[null,null,null,null,{"$f":"IF(ProjectMethod=SBS,SUM(SUMIF('Interior - Space-By-Space'!$M$16:OFFSET('Interior - Space-By-Space'!$M$56,-1,0),$B52,'Interior - Space-By-Space'!$O$16:OFFSET('Interior - Space-By-Space'!$O$56,-1,0)),SUMIF('Interior - Space-By-Space'!$Q$16:OFFSET('Interior - Space-By-Space'!$Q$56,-1,0),$B52,'Interior - Space-By-Space'!$S$16:OFFSET('Interior - Space-By-Space'!$S$56,-1,0)),SUMIF('Interior - Space-By-Space'!$U$16:OFFSET('Interior - Space-By-Space'!$U$56,-1,0),$B52,'Interior - Space-By-Space'!$W$16:OFFSET('Interior - Space-By-Space'!$W$56,-1,0)),SUMIF('Interior - Space-By-Space'!$Y$16:OFFSET('Interior - Space-By-Space'!$Y$56,-1,0),$B52,'Interior - Space-By-Space'!$AA$16:OFFSET('Interior - Space-By-Space'!$AA$56,-1,0)),SUMIF('Interior - Space-By-Space'!$AC$16:OFFSET('Interior - Space-By-Space'!$AC$56,-1,0),$B52,'Interior - Space-By-Space'!$AE$16:OFFSET('Interior - Space-By-Space'!$AE$56,-1,0)),SUMIF('Interior - Space-By-Space'!$AG$16:OFFSET('Interior - Space-By-Space'!$AG$56,-1,0),$B52,'Interior - Space-By-Space'!$AI$16:OFFSET('Interior - Space-By-Space'!$AI$56,-1,0)),SUMIF('Interior - Space-By-Space'!$AK$16:OFFSET('Interior - Space-By-Space'!$AK$56,-1,0),$B52,'Interior - Space-By-Space'!$AM$16:OFFSET('Interior - Space-By-Space'!$AM$56,-1,0)),SUMIF('Interior - Space-By-Space'!$AO$16:OFFSET('Interior - Space-By-Space'!$AO$56,-1,0),$B52,'Interior - Space-By-Space'!$AQ$16:OFFSET('Interior - Space-By-Space'!$AQ$56,-1,0))),IF(ProjectMethod=BAM,SUM('Interior - Building Area Method'!$C63,'Interior - Building Area Method'!$E63,'Interior - Building Area Method'!$G63,'Interior - Building Area Method'!$I63,'Interior - Building Area Method'!$K63),0))+SUM(SUMIF(Exterior!$J$19:$J$69,$B52,Exterior!$K$19:$K$69),SUMIF(Exterior!$M$19:$M$69,$B52,Exterior!$N$19:$N$69),SUMIF(Exterior!$P$19:$P$69,$B52,Exterior!$Q$19:$Q$69),SUMIF(Exterior!$S$19:$S$69,$B52,Exterior!$T$19:$T$69),SUMIF(Exterior!$V$19:$V$69,$B52,Exterior!$W$19:$W$69))","v":0}]
[null,null,null,null,{"$f":"IF(ProjectMethod=SBS,SUM(SUMIF('Interior - Space-By-Space'!$M$16:OFFSET('Interior - Space-By-Space'!$M$56,-1,0),$B53,'Interior - Space-By-Space'!$O$16:OFFSET('Interior - Space-By-Space'!$O$56,-1,0)),SUMIF('Interior - Space-By-Space'!$Q$16:OFFSET('Interior - Space-By-Space'!$Q$56,-1,0),$B53,'Interior - Space-By-Space'!$S$16:OFFSET('Interior - Space-By-Space'!$S$56,-1,0)),SUMIF('Interior - Space-By-Space'!$U$16:OFFSET('Interior - Space-By-Space'!$U$56,-1,0),$B53,'Interior - Space-By-Space'!$W$16:OFFSET('Interior - Space-By-Space'!$W$56,-1,0)),SUMIF('Interior - Space-By-Space'!$Y$16:OFFSET('Interior - Space-By-Space'!$Y$56,-1,0),$B53,'Interior - Space-By-Space'!$AA$16:OFFSET('Interior - Space-By-Space'!$AA$56,-1,0)),SUMIF('Interior - Space-By-Space'!$AC$16:OFFSET('Interior - Space-By-Space'!$AC$56,-1,0),$B53,'Interior - Space-By-Space'!$AE$16:OFFSET('Interior - Space-By-Space'!$AE$56,-1,0)),SUMIF('Interior - Space-By-Space'!$AG$16:OFFSET('Interior - Space-By-Space'!$AG$56,-1,0),$B53,'Interior - Space-By-Space'!$AI$16:OFFSET('Interior - Space-By-Space'!$AI$56,-1,0)),SUMIF('Interior - Space-By-Space'!$AK$16:OFFSET('Interior - Space-By-Space'!$AK$56,-1,0),$B53,'Interior - Space-By-Space'!$AM$16:OFFSET('Interior - Space-By-Space'!$AM$56,-1,0)),SUMIF('Interior - Space-By-Space'!$AO$16:OFFSET('Interior - Space-By-Space'!$AO$56,-1,0),$B53,'Interior - Space-By-Space'!$AQ$16:OFFSET('Interior - Space-By-Space'!$AQ$56,-1,0))),IF(ProjectMethod=BAM,SUM('Interior - Building Area Method'!$C64,'Interior - Building Area Method'!$E64,'Interior - Building Area Method'!$G64,'Interior - Building Area Method'!$I64,'Interior - Building Area Method'!$K64),0))+SUM(SUMIF(Exterior!$J$19:$J$69,$B53,Exterior!$K$19:$K$69),SUMIF(Exterior!$M$19:$M$69,$B53,Exterior!$N$19:$N$69),SUMIF(Exterior!$P$19:$P$69,$B53,Exterior!$Q$19:$Q$69),SUMIF(Exterior!$S$19:$S$69,$B53,Exterior!$T$19:$T$69),SUMIF(Exterior!$V$19:$V$69,$B53,Exterior!$W$19:$W$69))","v":0}]
[null,null,null,null,{"$f":"IF(ProjectMethod=SBS,SUM(SUMIF('Interior - Space-By-Space'!$M$16:OFFSET('Interior - Space-By-Space'!$M$56,-1,0),$B54,'Interior - Space-By-Space'!$O$16:OFFSET('Interior - Space-By-Space'!$O$56,-1,0)),SUMIF('Interior - Space-By-Space'!$Q$16:OFFSET('Interior - Space-By-Space'!$Q$56,-1,0),$B54,'Interior - Space-By-Space'!$S$16:OFFSET('Interior - Space-By-Space'!$S$56,-1,0)),SUMIF('Interior - Space-By-Space'!$U$16:OFFSET('Interior - Space-By-Space'!$U$56,-1,0),$B54,'Interior - Space-By-Space'!$W$16:OFFSET('Interior - Space-By-Space'!$W$56,-1,0)),SUMIF('Interior - Space-By-Space'!$Y$16:OFFSET('Interior - Space-By-Space'!$Y$56,-1,0),$B54,'Interior - Space-By-Space'!$AA$16:OFFSET('Interior - Space-By-Space'!$AA$56,-1,0)),SUMIF('Interior - Space-By-Space'!$AC$16:OFFSET('Interior - Space-By-Space'!$AC$56,-1,0),$B54,'Interior - Space-By-Space'!$AE$16:OFFSET('Interior - Space-By-Space'!$AE$56,-1,0)),SUMIF('Interior - Space-By-Space'!$AG$16:OFFSET('Interior - Space-By-Space'!$AG$56,-1,0),$B54,'Interior - Space-By-Space'!$AI$16:OFFSET('Interior - Space-By-Space'!$AI$56,-1,0)),SUMIF('Interior - Space-By-Space'!$AK$16:OFFSET('Interior - Space-By-Space'!$AK$56,-1,0),$B54,'Interior - Space-By-Space'!$AM$16:OFFSET('Interior - Space-By-Space'!$AM$56,-1,0)),SUMIF('Interior - Space-By-Space'!$AO$16:OFFSET('Interior - Space-By-Space'!$AO$56,-1,0),$B54,'Interior - Space-By-Space'!$AQ$16:OFFSET('Interior - Space-By-Space'!$AQ$56,-1,0))),IF(ProjectMethod=BAM,SUM('Interior - Building Area Method'!$C65,'Interior - Building Area Method'!$E65,'Interior - Building Area Method'!$G65,'Interior - Building Area Method'!$I65,'Interior - Building Area Method'!$K65),0))+SUM(SUMIF(Exterior!$J$19:$J$69,$B54,Exterior!$K$19:$K$69),SUMIF(Exterior!$M$19:$M$69,$B54,Exterior!$N$19:$N$69),SUMIF(Exterior!$P$19:$P$69,$B54,Exterior!$Q$19:$Q$69),SUMIF(Exterior!$S$19:$S$69,$B54,Exterior!$T$19:$T$69),SUMIF(Exterior!$V$19:$V$69,$B54,Exterior!$W$19:$W$69))","v":0}]
[null,null,null,null,{"$f":"IF(ProjectMethod=SBS,SUM(SUMIF('Interior - Space-By-Space'!$M$16:OFFSET('Interior - Space-By-Space'!$M$56,-1,0),$B55,'Interior - Space-By-Space'!$O$16:OFFSET('Interior - Space-By-Space'!$O$56,-1,0)),SUMIF('Interior - Space-By-Space'!$Q$16:OFFSET('Interior - Space-By-Space'!$Q$56,-1,0),$B55,'Interior - Space-By-Space'!$S$16:OFFSET('Interior - Space-By-Space'!$S$56,-1,0)),SUMIF('Interior - Space-By-Space'!$U$16:OFFSET('Interior - Space-By-Space'!$U$56,-1,0),$B55,'Interior - Space-By-Space'!$W$16:OFFSET('Interior - Space-By-Space'!$W$56,-1,0)),SUMIF('Interior - Space-By-Space'!$Y$16:OFFSET('Interior - Space-By-Space'!$Y$56,-1,0),$B55,'Interior - Space-By-Space'!$AA$16:OFFSET('Interior - Space-By-Space'!$AA$56,-1,0)),SUMIF('Interior - Space-By-Space'!$AC$16:OFFSET('Interior - Space-By-Space'!$AC$56,-1,0),$B55,'Interior - Space-By-Space'!$AE$16:OFFSET('Interior - Space-By-Space'!$AE$56,-1,0)),SUMIF('Interior - Space-By-Space'!$AG$16:OFFSET('Interior - Space-By-Space'!$AG$56,-1,0),$B55,'Interior - Space-By-Space'!$AI$16:OFFSET('Interior - Space-By-Space'!$AI$56,-1,0)),SUMIF('Interior - Space-By-Space'!$AK$16:OFFSET('Interior - Space-By-Space'!$AK$56,-1,0),$B55,'Interior - Space-By-Space'!$AM$16:OFFSET('Interior - Space-By-Space'!$AM$56,-1,0)),SUMIF('Interior - Space-By-Space'!$AO$16:OFFSET('Interior - Space-By-Space'!$AO$56,-1,0),$B55,'Interior - Space-By-Space'!$AQ$16:OFFSET('Interior - Space-By-Space'!$AQ$56,-1,0))),IF(ProjectMethod=BAM,SUM('Interior - Building Area Method'!$C66,'Interior - Building Area Method'!$E66,'Interior - Building Area Method'!$G66,'Interior - Building Area Method'!$I66,'Interior - Building Area Method'!$K66),0))+SUM(SUMIF(Exterior!$J$19:$J$69,$B55,Exterior!$K$19:$K$69),SUMIF(Exterior!$M$19:$M$69,$B55,Exterior!$N$19:$N$69),SUMIF(Exterior!$P$19:$P$69,$B55,Exterior!$Q$19:$Q$69),SUMIF(Exterior!$S$19:$S$69,$B55,Exterior!$T$19:$T$69),SUMIF(Exterior!$V$19:$V$69,$B55,Exterior!$W$19:$W$69))","v":0}]
[null,null,null,null,{"$f":"IF(ProjectMethod=SBS,SUM(SUMIF('Interior - Space-By-Space'!$M$16:OFFSET('Interior - Space-By-Space'!$M$56,-1,0),$B56,'Interior - Space-By-Space'!$O$16:OFFSET('Interior - Space-By-Space'!$O$56,-1,0)),SUMIF('Interior - Space-By-Space'!$Q$16:OFFSET('Interior - Space-By-Space'!$Q$56,-1,0),$B56,'Interior - Space-By-Space'!$S$16:OFFSET('Interior - Space-By-Space'!$S$56,-1,0)),SUMIF('Interior - Space-By-Space'!$U$16:OFFSET('Interior - Space-By-Space'!$U$56,-1,0),$B56,'Interior - Space-By-Space'!$W$16:OFFSET('Interior - Space-By-Space'!$W$56,-1,0)),SUMIF('Interior - Space-By-Space'!$Y$16:OFFSET('Interior - Space-By-Space'!$Y$56,-1,0),$B56,'Interior - Space-By-Space'!$AA$16:OFFSET('Interior - Space-By-Space'!$AA$56,-1,0)),SUMIF('Interior - Space-By-Space'!$AC$16:OFFSET('Interior - Space-By-Space'!$AC$56,-1,0),$B56,'Interior - Space-By-Space'!$AE$16:OFFSET('Interior - Space-By-Space'!$AE$56,-1,0)),SUMIF('Interior - Space-By-Space'!$AG$16:OFFSET('Interior - Space-By-Space'!$AG$56,-1,0),$B56,'Interior - Space-By-Space'!$AI$16:OFFSET('Interior - Space-By-Space'!$AI$56,-1,0)),SUMIF('Interior - Space-By-Space'!$AK$16:OFFSET('Interior - Space-By-Space'!$AK$56,-1,0),$B56,'Interior - Space-By-Space'!$AM$16:OFFSET('Interior - Space-By-Space'!$AM$56,-1,0)),SUMIF('Interior - Space-By-Space'!$AO$16:OFFSET('Interior - Space-By-Space'!$AO$56,-1,0),$B56,'Interior - Space-By-Space'!$AQ$16:OFFSET('Interior - Space-By-Space'!$AQ$56,-1,0))),IF(ProjectMethod=BAM,SUM('Interior - Building Area Method'!$C67,'Interior - Building Area Method'!$E67,'Interior - Building Area Method'!$G67,'Interior - Building Area Method'!$I67,'Interior - Building Area Method'!$K67),0))+SUM(SUMIF(Exterior!$J$19:$J$69,$B56,Exterior!$K$19:$K$69),SUMIF(Exterior!$M$19:$M$69,$B56,Exterior!$N$19:$N$69),SUMIF(Exterior!$P$19:$P$69,$B56,Exterior!$Q$19:$Q$69),SUMIF(Exterior!$S$19:$S$69,$B56,Exterior!$T$19:$T$69),SUMIF(Exterior!$V$19:$V$69,$B56,Exterior!$W$19:$W$69))","v":0}]
[null,null,null,null,{"$f":"IF(ProjectMethod=SBS,SUM(SUMIF('Interior - Space-By-Space'!$M$16:OFFSET('Interior - Space-By-Space'!$M$56,-1,0),$B57,'Interior - Space-By-Space'!$O$16:OFFSET('Interior - Space-By-Space'!$O$56,-1,0)),SUMIF('Interior - Space-By-Space'!$Q$16:OFFSET('Interior - Space-By-Space'!$Q$56,-1,0),$B57,'Interior - Space-By-Space'!$S$16:OFFSET('Interior - Space-By-Space'!$S$56,-1,0)),SUMIF('Interior - Space-By-Space'!$U$16:OFFSET('Interior - Space-By-Space'!$U$56,-1,0),$B57,'Interior - Space-By-Space'!$W$16:OFFSET('Interior - Space-By-Space'!$W$56,-1,0)),SUMIF('Interior - Space-By-Space'!$Y$16:OFFSET('Interior - Space-By-Space'!$Y$56,-1,0),$B57,'Interior - Space-By-Space'!$AA$16:OFFSET('Interior - Space-By-Space'!$AA$56,-1,0)),SUMIF('Interior - Space-By-Space'!$AC$16:OFFSET('Interior - Space-By-Space'!$AC$56,-1,0),$B57,'Interior - Space-By-Space'!$AE$16:OFFSET('Interior - Space-By-Space'!$AE$56,-1,0)),SUMIF('Interior - Space-By-Space'!$AG$16:OFFSET('Interior - Space-By-Space'!$AG$56,-1,0),$B57,'Interior - Space-By-Space'!$AI$16:OFFSET('Interior - Space-By-Space'!$AI$56,-1,0)),SUMIF('Interior - Space-By-Space'!$AK$16:OFFSET('Interior - Space-By-Space'!$AK$56,-1,0),$B57,'Interior - Space-By-Space'!$AM$16:OFFSET('Interior - Space-By-Space'!$AM$56,-1,0)),SUMIF('Interior - Space-By-Space'!$AO$16:OFFSET('Interior - Space-By-Space'!$AO$56,-1,0),$B57,'Interior - Space-By-Space'!$AQ$16:OFFSET('Interior - Space-By-Space'!$AQ$56,-1,0))),IF(ProjectMethod=BAM,SUM('Interior - Building Area Method'!$C68,'Interior - Building Area Method'!$E68,'Interior - Building Area Method'!$G68,'Interior - Building Area Method'!$I68,'Interior - Building Area Method'!$K68),0))+SUM(SUMIF(Exterior!$J$19:$J$69,$B57,Exterior!$K$19:$K$69),SUMIF(Exterior!$M$19:$M$69,$B57,Exterior!$N$19:$N$69),SUMIF(Exterior!$P$19:$P$69,$B57,Exterior!$Q$19:$Q$69),SUMIF(Exterior!$S$19:$S$69,$B57,Exterior!$T$19:$T$69),SUMIF(Exterior!$V$19:$V$69,$B57,Exterior!$W$19:$W$69))","v":0}]
[null,null,null,null,{"$f":"IF(ProjectMethod=SBS,SUM(SUMIF('Interior - Space-By-Space'!$M$16:OFFSET('Interior - Space-By-Space'!$M$56,-1,0),$B58,'Interior - Space-By-Space'!$O$16:OFFSET('Interior - Space-By-Space'!$O$56,-1,0)),SUMIF('Interior - Space-By-Space'!$Q$16:OFFSET('Interior - Space-By-Space'!$Q$56,-1,0),$B58,'Interior - Space-By-Space'!$S$16:OFFSET('Interior - Space-By-Space'!$S$56,-1,0)),SUMIF('Interior - Space-By-Space'!$U$16:OFFSET('Interior - Space-By-Space'!$U$56,-1,0),$B58,'Interior - Space-By-Space'!$W$16:OFFSET('Interior - Space-By-Space'!$W$56,-1,0)),SUMIF('Interior - Space-By-Space'!$Y$16:OFFSET('Interior - Space-By-Space'!$Y$56,-1,0),$B58,'Interior - Space-By-Space'!$AA$16:OFFSET('Interior - Space-By-Space'!$AA$56,-1,0)),SUMIF('Interior - Space-By-Space'!$AC$16:OFFSET('Interior - Space-By-Space'!$AC$56,-1,0),$B58,'Interior - Space-By-Space'!$AE$16:OFFSET('Interior - Space-By-Space'!$AE$56,-1,0)),SUMIF('Interior - Space-By-Space'!$AG$16:OFFSET('Interior - Space-By-Space'!$AG$56,-1,0),$B58,'Interior - Space-By-Space'!$AI$16:OFFSET('Interior - Space-By-Space'!$AI$56,-1,0)),SUMIF('Interior - Space-By-Space'!$AK$16:OFFSET('Interior - Space-By-Space'!$AK$56,-1,0),$B58,'Interior - Space-By-Space'!$AM$16:OFFSET('Interior - Space-By-Space'!$AM$56,-1,0)),SUMIF('Interior - Space-By-Space'!$AO$16:OFFSET('Interior - Space-By-Space'!$AO$56,-1,0),$B58,'Interior - Space-By-Space'!$AQ$16:OFFSET('Interior - Space-By-Space'!$AQ$56,-1,0))),IF(ProjectMethod=BAM,SUM('Interior - Building Area Method'!$C69,'Interior - Building Area Method'!$E69,'Interior - Building Area Method'!$G69,'Interior - Building Area Method'!$I69,'Interior - Building Area Method'!$K69),0))+SUM(SUMIF(Exterior!$J$19:$J$69,$B58,Exterior!$K$19:$K$69),SUMIF(Exterior!$M$19:$M$69,$B58,Exterior!$N$19:$N$69),SUMIF(Exterior!$P$19:$P$69,$B58,Exterior!$Q$19:$Q$69),SUMIF(Exterior!$S$19:$S$69,$B58,Exterior!$T$19:$T$69),SUMIF(Exterior!$V$19:$V$69,$B58,Exterior!$W$19:$W$69))","v":0}]
[null,null,null,null,{"$f":"IF(ProjectMethod=SBS,SUM(SUMIF('Interior - Space-By-Space'!$M$16:OFFSET('Interior - Space-By-Space'!$M$56,-1,0),$B59,'Interior - Space-By-Space'!$O$16:OFFSET('Interior - Space-By-Space'!$O$56,-1,0)),SUMIF('Interior - Space-By-Space'!$Q$16:OFFSET('Interior - Space-By-Space'!$Q$56,-1,0),$B59,'Interior - Space-By-Space'!$S$16:OFFSET('Interior - Space-By-Space'!$S$56,-1,0)),SUMIF('Interior - Space-By-Space'!$U$16:OFFSET('Interior - Space-By-Space'!$U$56,-1,0),$B59,'Interior - Space-By-Space'!$W$16:OFFSET('Interior - Space-By-Space'!$W$56,-1,0)),SUMIF('Interior - Space-By-Space'!$Y$16:OFFSET('Interior - Space-By-Space'!$Y$56,-1,0),$B59,'Interior - Space-By-Space'!$AA$16:OFFSET('Interior - Space-By-Space'!$AA$56,-1,0)),SUMIF('Interior - Space-By-Space'!$AC$16:OFFSET('Interior - Space-By-Space'!$AC$56,-1,0),$B59,'Interior - Space-By-Space'!$AE$16:OFFSET('Interior - Space-By-Space'!$AE$56,-1,0)),SUMIF('Interior - Space-By-Space'!$AG$16:OFFSET('Interior - Space-By-Space'!$AG$56,-1,0),$B59,'Interior - Space-By-Space'!$AI$16:OFFSET('Interior - Space-By-Space'!$AI$56,-1,0)),SUMIF('Interior - Space-By-Space'!$AK$16:OFFSET('Interior - Space-By-Space'!$AK$56,-1,0),$B59,'Interior - Space-By-Space'!$AM$16:OFFSET('Interior - Space-By-Space'!$AM$56,-1,0)),SUMIF('Interior - Space-By-Space'!$AO$16:OFFSET('Interior - Space-By-Space'!$AO$56,-1,0),$B59,'Interior - Space-By-Space'!$AQ$16:OFFSET('Interior - Space-By-Space'!$AQ$56,-1,0))),IF(ProjectMethod=BAM,SUM('Interior - Building Area Method'!$C70,'Interior - Building Area Method'!$E70,'Interior - Building Area Method'!$G70,'Interior - Building Area Method'!$I70,'Interior - Building Area Method'!$K70),0))+SUM(SUMIF(Exterior!$J$19:$J$69,$B59,Exterior!$K$19:$K$69),SUMIF(Exterior!$M$19:$M$69,$B59,Exterior!$N$19:$N$69),SUMIF(Exterior!$P$19:$P$69,$B59,Exterior!$Q$19:$Q$69),SUMIF(Exterior!$S$19:$S$69,$B59,Exterior!$T$19:$T$69),SUMIF(Exterior!$V$19:$V$69,$B59,Exterior!$W$19:$W$69))","v":0}]
[null,null,null,null,{"$f":"IF(ProjectMethod=SBS,SUM(SUMIF('Interior - Space-By-Space'!$M$16:OFFSET('Interior - Space-By-Space'!$M$56,-1,0),$B60,'Interior - Space-By-Space'!$O$16:OFFSET('Interior - Space-By-Space'!$O$56,-1,0)),SUMIF('Interior - Space-By-Space'!$Q$16:OFFSET('Interior - Space-By-Space'!$Q$56,-1,0),$B60,'Interior - Space-By-Space'!$S$16:OFFSET('Interior - Space-By-Space'!$S$56,-1,0)),SUMIF('Interior - Space-By-Space'!$U$16:OFFSET('Interior - Space-By-Space'!$U$56,-1,0),$B60,'Interior - Space-By-Space'!$W$16:OFFSET('Interior - Space-By-Space'!$W$56,-1,0)),SUMIF('Interior - Space-By-Space'!$Y$16:OFFSET('Interior - Space-By-Space'!$Y$56,-1,0),$B60,'Interior - Space-By-Space'!$AA$16:OFFSET('Interior - Space-By-Space'!$AA$56,-1,0)),SUMIF('Interior - Space-By-Space'!$AC$16:OFFSET('Interior - Space-By-Space'!$AC$56,-1,0),$B60,'Interior - Space-By-Space'!$AE$16:OFFSET('Interior - Space-By-Space'!$AE$56,-1,0)),SUMIF('Interior - Space-By-Space'!$AG$16:OFFSET('Interior - Space-By-Space'!$AG$56,-1,0),$B60,'Interior - Space-By-Space'!$AI$16:OFFSET('Interior - Space-By-Space'!$AI$56,-1,0)),SUMIF('Interior - Space-By-Space'!$AK$16:OFFSET('Interior - Space-By-Space'!$AK$56,-1,0),$B60,'Interior - Space-By-Space'!$AM$16:OFFSET('Interior - Space-By-Space'!$AM$56,-1,0)),SUMIF('Interior - Space-By-Space'!$AO$16:OFFSET('Interior - Space-By-Space'!$AO$56,-1,0),$B60,'Interior - Space-By-Space'!$AQ$16:OFFSET('Interior - Space-By-Space'!$AQ$56,-1,0))),IF(ProjectMethod=BAM,SUM('Interior - Building Area Method'!$C71,'Interior - Building Area Method'!$E71,'Interior - Building Area Method'!$G71,'Interior - Building Area Method'!$I71,'Interior - Building Area Method'!$K71),0))+SUM(SUMIF(Exterior!$J$19:$J$69,$B60,Exterior!$K$19:$K$69),SUMIF(Exterior!$M$19:$M$69,$B60,Exterior!$N$19:$N$69),SUMIF(Exterior!$P$19:$P$69,$B60,Exterior!$Q$19:$Q$69),SUMIF(Exterior!$S$19:$S$69,$B60,Exterior!$T$19:$T$69),SUMIF(Exterior!$V$19:$V$69,$B60,Exterior!$W$19:$W$69))","v":0}]
[null,null,null,null,{"$f":"IF(ProjectMethod=SBS,SUM(SUMIF('Interior - Space-By-Space'!$M$16:OFFSET('Interior - Space-By-Space'!$M$56,-1,0),$B61,'Interior - Space-By-Space'!$O$16:OFFSET('Interior - Space-By-Space'!$O$56,-1,0)),SUMIF('Interior - Space-By-Space'!$Q$16:OFFSET('Interior - Space-By-Space'!$Q$56,-1,0),$B61,'Interior - Space-By-Space'!$S$16:OFFSET('Interior - Space-By-Space'!$S$56,-1,0)),SUMIF('Interior - Space-By-Space'!$U$16:OFFSET('Interior - Space-By-Space'!$U$56,-1,0),$B61,'Interior - Space-By-Space'!$W$16:OFFSET('Interior - Space-By-Space'!$W$56,-1,0)),SUMIF('Interior - Space-By-Space'!$Y$16:OFFSET('Interior - Space-By-Space'!$Y$56,-1,0),$B61,'Interior - Space-By-Space'!$AA$16:OFFSET('Interior - Space-By-Space'!$AA$56,-1,0)),SUMIF('Interior - Space-By-Space'!$AC$16:OFFSET('Interior - Space-By-Space'!$AC$56,-1,0),$B61,'Interior - Space-By-Space'!$AE$16:OFFSET('Interior - Space-By-Space'!$AE$56,-1,0)),SUMIF('Interior - Space-By-Space'!$AG$16:OFFSET('Interior - Space-By-Space'!$AG$56,-1,0),$B61,'Interior - Space-By-Space'!$AI$16:OFFSET('Interior - Space-By-Space'!$AI$56,-1,0)),SUMIF('Interior - Space-By-Space'!$AK$16:OFFSET('Interior - Space-By-Space'!$AK$56,-1,0),$B61,'Interior - Space-By-Space'!$AM$16:OFFSET('Interior - Space-By-Space'!$AM$56,-1,0)),SUMIF('Interior - Space-By-Space'!$AO$16:OFFSET('Interior - Space-By-Space'!$AO$56,-1,0),$B61,'Interior - Space-By-Space'!$AQ$16:OFFSET('Interior - Space-By-Space'!$AQ$56,-1,0))),IF(ProjectMethod=BAM,SUM('Interior - Building Area Method'!$C72,'Interior - Building Area Method'!$E72,'Interior - Building Area Method'!$G72,'Interior - Building Area Method'!$I72,'Interior - Building Area Method'!$K72),0))+SUM(SUMIF(Exterior!$J$19:$J$69,$B61,Exterior!$K$19:$K$69),SUMIF(Exterior!$M$19:$M$69,$B61,Exterior!$N$19:$N$69),SUMIF(Exterior!$P$19:$P$69,$B61,Exterior!$Q$19:$Q$69),SUMIF(Exterior!$S$19:$S$69,$B61,Exterior!$T$19:$T$69),SUMIF(Exterior!$V$19:$V$69,$B61,Exterior!$W$19:$W$69))","v":0}]
[null,null,null,null,{"$f":"IF(ProjectMethod=SBS,SUM(SUMIF('Interior - Space-By-Space'!$M$16:OFFSET('Interior - Space-By-Space'!$M$56,-1,0),$B62,'Interior - Space-By-Space'!$O$16:OFFSET('Interior - Space-By-Space'!$O$56,-1,0)),SUMIF('Interior - Space-By-Space'!$Q$16:OFFSET('Interior - Space-By-Space'!$Q$56,-1,0),$B62,'Interior - Space-By-Space'!$S$16:OFFSET('Interior - Space-By-Space'!$S$56,-1,0)),SUMIF('Interior - Space-By-Space'!$U$16:OFFSET('Interior - Space-By-Space'!$U$56,-1,0),$B62,'Interior - Space-By-Space'!$W$16:OFFSET('Interior - Space-By-Space'!$W$56,-1,0)),SUMIF('Interior - Space-By-Space'!$Y$16:OFFSET('Interior - Space-By-Space'!$Y$56,-1,0),$B62,'Interior - Space-By-Space'!$AA$16:OFFSET('Interior - Space-By-Space'!$AA$56,-1,0)),SUMIF('Interior - Space-By-Space'!$AC$16:OFFSET('Interior - Space-By-Space'!$AC$56,-1,0),$B62,'Interior - Space-By-Space'!$AE$16:OFFSET('Interior - Space-By-Space'!$AE$56,-1,0)),SUMIF('Interior - Space-By-Space'!$AG$16:OFFSET('Interior - Space-By-Space'!$AG$56,-1,0),$B62,'Interior - Space-By-Space'!$AI$16:OFFSET('Interior - Space-By-Space'!$AI$56,-1,0)),SUMIF('Interior - Space-By-Space'!$AK$16:OFFSET('Interior - Space-By-Space'!$AK$56,-1,0),$B62,'Interior - Space-By-Space'!$AM$16:OFFSET('Interior - Space-By-Space'!$AM$56,-1,0)),SUMIF('Interior - Space-By-Space'!$AO$16:OFFSET('Interior - Space-By-Space'!$AO$56,-1,0),$B62,'Interior - Space-By-Space'!$AQ$16:OFFSET('Interior - Space-By-Space'!$AQ$56,-1,0))),IF(ProjectMethod=BAM,SUM('Interior - Building Area Method'!$C73,'Interior - Building Area Method'!$E73,'Interior - Building Area Method'!$G73,'Interior - Building Area Method'!$I73,'Interior - Building Area Method'!$K73),0))+SUM(SUMIF(Exterior!$J$19:$J$69,$B62,Exterior!$K$19:$K$69),SUMIF(Exterior!$M$19:$M$69,$B62,Exterior!$N$19:$N$69),SUMIF(Exterior!$P$19:$P$69,$B62,Exterior!$Q$19:$Q$69),SUMIF(Exterior!$S$19:$S$69,$B62,Exterior!$T$19:$T$69),SUMIF(Exterior!$V$19:$V$69,$B62,Exterior!$W$19:$W$69))","v":0}]
[null,null,null,null,{"$f":"IF(ProjectMethod=SBS,SUM(SUMIF('Interior - Space-By-Space'!$M$16:OFFSET('Interior - Space-By-Space'!$M$56,-1,0),$B63,'Interior - Space-By-Space'!$O$16:OFFSET('Interior - Space-By-Space'!$O$56,-1,0)),SUMIF('Interior - Space-By-Space'!$Q$16:OFFSET('Interior - Space-By-Space'!$Q$56,-1,0),$B63,'Interior - Space-By-Space'!$S$16:OFFSET('Interior - Space-By-Space'!$S$56,-1,0)),SUMIF('Interior - Space-By-Space'!$U$16:OFFSET('Interior - Space-By-Space'!$U$56,-1,0),$B63,'Interior - Space-By-Space'!$W$16:OFFSET('Interior - Space-By-Space'!$W$56,-1,0)),SUMIF('Interior - Space-By-Space'!$Y$16:OFFSET('Interior - Space-By-Space'!$Y$56,-1,0),$B63,'Interior - Space-By-Space'!$AA$16:OFFSET('Interior - Space-By-Space'!$AA$56,-1,0)),SUMIF('Interior - Space-By-Space'!$AC$16:OFFSET('Interior - Space-By-Space'!$AC$56,-1,0),$B63,'Interior - Space-By-Space'!$AE$16:OFFSET('Interior - Space-By-Space'!$AE$56,-1,0)),SUMIF('Interior - Space-By-Space'!$AG$16:OFFSET('Interior - Space-By-Space'!$AG$56,-1,0),$B63,'Interior - Space-By-Space'!$AI$16:OFFSET('Interior - Space-By-Space'!$AI$56,-1,0)),SUMIF('Interior - Space-By-Space'!$AK$16:OFFSET('Interior - Space-By-Space'!$AK$56,-1,0),$B63,'Interior - Space-By-Space'!$AM$16:OFFSET('Interior - Space-By-Space'!$AM$56,-1,0)),SUMIF('Interior - Space-By-Space'!$AO$16:OFFSET('Interior - Space-By-Space'!$AO$56,-1,0),$B63,'Interior - Space-By-Space'!$AQ$16:OFFSET('Interior - Space-By-Space'!$AQ$56,-1,0))),IF(ProjectMethod=BAM,SUM('Interior - Building Area Method'!$C74,'Interior - Building Area Method'!$E74,'Interior - Building Area Method'!$G74,'Interior - Building Area Method'!$I74,'Interior - Building Area Method'!$K74),0))+SUM(SUMIF(Exterior!$J$19:$J$69,$B63,Exterior!$K$19:$K$69),SUMIF(Exterior!$M$19:$M$69,$B63,Exterior!$N$19:$N$69),SUMIF(Exterior!$P$19:$P$69,$B63,Exterior!$Q$19:$Q$69),SUMIF(Exterior!$S$19:$S$69,$B63,Exterior!$T$19:$T$69),SUMIF(Exterior!$V$19:$V$69,$B63,Exterior!$W$19:$W$69))","v":0}]
[null,null,null,null,{"$f":"IF(ProjectMethod=SBS,SUM(SUMIF('Interior - Space-By-Space'!$M$16:OFFSET('Interior - Space-By-Space'!$M$56,-1,0),$B64,'Interior - Space-By-Space'!$O$16:OFFSET('Interior - Space-By-Space'!$O$56,-1,0)),SUMIF('Interior - Space-By-Space'!$Q$16:OFFSET('Interior - Space-By-Space'!$Q$56,-1,0),$B64,'Interior - Space-By-Space'!$S$16:OFFSET('Interior - Space-By-Space'!$S$56,-1,0)),SUMIF('Interior - Space-By-Space'!$U$16:OFFSET('Interior - Space-By-Space'!$U$56,-1,0),$B64,'Interior - Space-By-Space'!$W$16:OFFSET('Interior - Space-By-Space'!$W$56,-1,0)),SUMIF('Interior - Space-By-Space'!$Y$16:OFFSET('Interior - Space-By-Space'!$Y$56,-1,0),$B64,'Interior - Space-By-Space'!$AA$16:OFFSET('Interior - Space-By-Space'!$AA$56,-1,0)),SUMIF('Interior - Space-By-Space'!$AC$16:OFFSET('Interior - Space-By-Space'!$AC$56,-1,0),$B64,'Interior - Space-By-Space'!$AE$16:OFFSET('Interior - Space-By-Space'!$AE$56,-1,0)),SUMIF('Interior - Space-By-Space'!$AG$16:OFFSET('Interior - Space-By-Space'!$AG$56,-1,0),$B64,'Interior - Space-By-Space'!$AI$16:OFFSET('Interior - Space-By-Space'!$AI$56,-1,0)),SUMIF('Interior - Space-By-Space'!$AK$16:OFFSET('Interior - Space-By-Space'!$AK$56,-1,0),$B64,'Interior - Space-By-Space'!$AM$16:OFFSET('Interior - Space-By-Space'!$AM$56,-1,0)),SUMIF('Interior - Space-By-Space'!$AO$16:OFFSET('Interior - Space-By-Space'!$AO$56,-1,0),$B64,'Interior - Space-By-Space'!$AQ$16:OFFSET('Interior - Space-By-Space'!$AQ$56,-1,0))),IF(ProjectMethod=BAM,SUM('Interior - Building Area Method'!$C75,'Interior - Building Area Method'!$E75,'Interior - Building Area Method'!$G75,'Interior - Building Area Method'!$I75,'Interior - Building Area Method'!$K75),0))+SUM(SUMIF(Exterior!$J$19:$J$69,$B64,Exterior!$K$19:$K$69),SUMIF(Exterior!$M$19:$M$69,$B64,Exterior!$N$19:$N$69),SUMIF(Exterior!$P$19:$P$69,$B64,Exterior!$Q$19:$Q$69),SUMIF(Exterior!$S$19:$S$69,$B64,Exterior!$T$19:$T$69),SUMIF(Exterior!$V$19:$V$69,$B64,Exterior!$W$19:$W$69))","v":0}]
[null,null,null,null,{"$f":"IF(ProjectMethod=SBS,SUM(SUMIF('Interior - Space-By-Space'!$M$16:OFFSET('Interior - Space-By-Space'!$M$56,-1,0),$B65,'Interior - Space-By-Space'!$O$16:OFFSET('Interior - Space-By-Space'!$O$56,-1,0)),SUMIF('Interior - Space-By-Space'!$Q$16:OFFSET('Interior - Space-By-Space'!$Q$56,-1,0),$B65,'Interior - Space-By-Space'!$S$16:OFFSET('Interior - Space-By-Space'!$S$56,-1,0)),SUMIF('Interior - Space-By-Space'!$U$16:OFFSET('Interior - Space-By-Space'!$U$56,-1,0),$B65,'Interior - Space-By-Space'!$W$16:OFFSET('Interior - Space-By-Space'!$W$56,-1,0)),SUMIF('Interior - Space-By-Space'!$Y$16:OFFSET('Interior - Space-By-Space'!$Y$56,-1,0),$B65,'Interior - Space-By-Space'!$AA$16:OFFSET('Interior - Space-By-Space'!$AA$56,-1,0)),SUMIF('Interior - Space-By-Space'!$AC$16:OFFSET('Interior - Space-By-Space'!$AC$56,-1,0),$B65,'Interior - Space-By-Space'!$AE$16:OFFSET('Interior - Space-By-Space'!$AE$56,-1,0)),SUMIF('Interior - Space-By-Space'!$AG$16:OFFSET('Interior - Space-By-Space'!$AG$56,-1,0),$B65,'Interior - Space-By-Space'!$AI$16:OFFSET('Interior - Space-By-Space'!$AI$56,-1,0)),SUMIF('Interior - Space-By-Space'!$AK$16:OFFSET('Interior - Space-By-Space'!$AK$56,-1,0),$B65,'Interior - Space-By-Space'!$AM$16:OFFSET('Interior - Space-By-Space'!$AM$56,-1,0)),SUMIF('Interior - Space-By-Space'!$AO$16:OFFSET('Interior - Space-By-Space'!$AO$56,-1,0),$B65,'Interior - Space-By-Space'!$AQ$16:OFFSET('Interior - Space-By-Space'!$AQ$56,-1,0))),IF(ProjectMethod=BAM,SUM('Interior - Building Area Method'!$C76,'Interior - Building Area Method'!$E76,'Interior - Building Area Method'!$G76,'Interior - Building Area Method'!$I76,'Interior - Building Area Method'!$K76),0))+SUM(SUMIF(Exterior!$J$19:$J$69,$B65,Exterior!$K$19:$K$69),SUMIF(Exterior!$M$19:$M$69,$B65,Exterior!$N$19:$N$69),SUMIF(Exterior!$P$19:$P$69,$B65,Exterior!$Q$19:$Q$69),SUMIF(Exterior!$S$19:$S$69,$B65,Exterior!$T$19:$T$69),SUMIF(Exterior!$V$19:$V$69,$B65,Exterior!$W$19:$W$69))","v":0}]
[null,null,null,null,{"$f":"IF(ProjectMethod=SBS,SUM(SUMIF('Interior - Space-By-Space'!$M$16:OFFSET('Interior - Space-By-Space'!$M$56,-1,0),$B66,'Interior - Space-By-Space'!$O$16:OFFSET('Interior - Space-By-Space'!$O$56,-1,0)),SUMIF('Interior - Space-By-Space'!$Q$16:OFFSET('Interior - Space-By-Space'!$Q$56,-1,0),$B66,'Interior - Space-By-Space'!$S$16:OFFSET('Interior - Space-By-Space'!$S$56,-1,0)),SUMIF('Interior - Space-By-Space'!$U$16:OFFSET('Interior - Space-By-Space'!$U$56,-1,0),$B66,'Interior - Space-By-Space'!$W$16:OFFSET('Interior - Space-By-Space'!$W$56,-1,0)),SUMIF('Interior - Space-By-Space'!$Y$16:OFFSET('Interior - Space-By-Space'!$Y$56,-1,0),$B66,'Interior - Space-By-Space'!$AA$16:OFFSET('Interior - Space-By-Space'!$AA$56,-1,0)),SUMIF('Interior - Space-By-Space'!$AC$16:OFFSET('Interior - Space-By-Space'!$AC$56,-1,0),$B66,'Interior - Space-By-Space'!$AE$16:OFFSET('Interior - Space-By-Space'!$AE$56,-1,0)),SUMIF('Interior - Space-By-Space'!$AG$16:OFFSET('Interior - Space-By-Space'!$AG$56,-1,0),$B66,'Interior - Space-By-Space'!$AI$16:OFFSET('Interior - Space-By-Space'!$AI$56,-1,0)),SUMIF('Interior - Space-By-Space'!$AK$16:OFFSET('Interior - Space-By-Space'!$AK$56,-1,0),$B66,'Interior - Space-By-Space'!$AM$16:OFFSET('Interior - Space-By-Space'!$AM$56,-1,0)),SUMIF('Interior - Space-By-Space'!$AO$16:OFFSET('Interior - Space-By-Space'!$AO$56,-1,0),$B66,'Interior - Space-By-Space'!$AQ$16:OFFSET('Interior - Space-By-Space'!$AQ$56,-1,0))),IF(ProjectMethod=BAM,SUM('Interior - Building Area Method'!$C77,'Interior - Building Area Method'!$E77,'Interior - Building Area Method'!$G77,'Interior - Building Area Method'!$I77,'Interior - Building Area Method'!$K77),0))+SUM(SUMIF(Exterior!$J$19:$J$69,$B66,Exterior!$K$19:$K$69),SUMIF(Exterior!$M$19:$M$69,$B66,Exterior!$N$19:$N$69),SUMIF(Exterior!$P$19:$P$69,$B66,Exterior!$Q$19:$Q$69),SUMIF(Exterior!$S$19:$S$69,$B66,Exterior!$T$19:$T$69),SUMIF(Exterior!$V$19:$V$69,$B66,Exterior!$W$19:$W$69))","v":0}]
[null,null,null,null,{"$f":"IF(ProjectMethod=SBS,SUM(SUMIF('Interior - Space-By-Space'!$M$16:OFFSET('Interior - Space-By-Space'!$M$56,-1,0),$B67,'Interior - Space-By-Space'!$O$16:OFFSET('Interior - Space-By-Space'!$O$56,-1,0)),SUMIF('Interior - Space-By-Space'!$Q$16:OFFSET('Interior - Space-By-Space'!$Q$56,-1,0),$B67,'Interior - Space-By-Space'!$S$16:OFFSET('Interior - Space-By-Space'!$S$56,-1,0)),SUMIF('Interior - Space-By-Space'!$U$16:OFFSET('Interior - Space-By-Space'!$U$56,-1,0),$B67,'Interior - Space-By-Space'!$W$16:OFFSET('Interior - Space-By-Space'!$W$56,-1,0)),SUMIF('Interior - Space-By-Space'!$Y$16:OFFSET('Interior - Space-By-Space'!$Y$56,-1,0),$B67,'Interior - Space-By-Space'!$AA$16:OFFSET('Interior - Space-By-Space'!$AA$56,-1,0)),SUMIF('Interior - Space-By-Space'!$AC$16:OFFSET('Interior - Space-By-Space'!$AC$56,-1,0),$B67,'Interior - Space-By-Space'!$AE$16:OFFSET('Interior - Space-By-Space'!$AE$56,-1,0)),SUMIF('Interior - Space-By-Space'!$AG$16:OFFSET('Interior - Space-By-Space'!$AG$56,-1,0),$B67,'Interior - Space-By-Space'!$AI$16:OFFSET('Interior - Space-By-Space'!$AI$56,-1,0)),SUMIF('Interior - Space-By-Space'!$AK$16:OFFSET('Interior - Space-By-Space'!$AK$56,-1,0),$B67,'Interior - Space-By-Space'!$AM$16:OFFSET('Interior - Space-By-Space'!$AM$56,-1,0)),SUMIF('Interior - Space-By-Space'!$AO$16:OFFSET('Interior - Space-By-Space'!$AO$56,-1,0),$B67,'Interior - Space-By-Space'!$AQ$16:OFFSET('Interior - Space-By-Space'!$AQ$56,-1,0))),IF(ProjectMethod=BAM,SUM('Interior - Building Area Method'!$C78,'Interior - Building Area Method'!$E78,'Interior - Building Area Method'!$G78,'Interior - Building Area Method'!$I78,'Interior - Building Area Method'!$K78),0))+SUM(SUMIF(Exterior!$J$19:$J$69,$B67,Exterior!$K$19:$K$69),SUMIF(Exterior!$M$19:$M$69,$B67,Exterior!$N$19:$N$69),SUMIF(Exterior!$P$19:$P$69,$B67,Exterior!$Q$19:$Q$69),SUMIF(Exterior!$S$19:$S$69,$B67,Exterior!$T$19:$T$69),SUMIF(Exterior!$V$19:$V$69,$B67,Exterior!$W$19:$W$69))","v":0}]
[null,null,null,null,{"$f":"IF(ProjectMethod=SBS,SUM(SUMIF('Interior - Space-By-Space'!$M$16:OFFSET('Interior - Space-By-Space'!$M$56,-1,0),$B68,'Interior - Space-By-Space'!$O$16:OFFSET('Interior - Space-By-Space'!$O$56,-1,0)),SUMIF('Interior - Space-By-Space'!$Q$16:OFFSET('Interior - Space-By-Space'!$Q$56,-1,0),$B68,'Interior - Space-By-Space'!$S$16:OFFSET('Interior - Space-By-Space'!$S$56,-1,0)),SUMIF('Interior - Space-By-Space'!$U$16:OFFSET('Interior - Space-By-Space'!$U$56,-1,0),$B68,'Interior - Space-By-Space'!$W$16:OFFSET('Interior - Space-By-Space'!$W$56,-1,0)),SUMIF('Interior - Space-By-Space'!$Y$16:OFFSET('Interior - Space-By-Space'!$Y$56,-1,0),$B68,'Interior - Space-By-Space'!$AA$16:OFFSET('Interior - Space-By-Space'!$AA$56,-1,0)),SUMIF('Interior - Space-By-Space'!$AC$16:OFFSET('Interior - Space-By-Space'!$AC$56,-1,0),$B68,'Interior - Space-By-Space'!$AE$16:OFFSET('Interior - Space-By-Space'!$AE$56,-1,0)),SUMIF('Interior - Space-By-Space'!$AG$16:OFFSET('Interior - Space-By-Space'!$AG$56,-1,0),$B68,'Interior - Space-By-Space'!$AI$16:OFFSET('Interior - Space-By-Space'!$AI$56,-1,0)),SUMIF('Interior - Space-By-Space'!$AK$16:OFFSET('Interior - Space-By-Space'!$AK$56,-1,0),$B68,'Interior - Space-By-Space'!$AM$16:OFFSET('Interior - Space-By-Space'!$AM$56,-1,0)),SUMIF('Interior - Space-By-Space'!$AO$16:OFFSET('Interior - Space-By-Space'!$AO$56,-1,0),$B68,'Interior - Space-By-Space'!$AQ$16:OFFSET('Interior - Space-By-Space'!$AQ$56,-1,0))),IF(ProjectMethod=BAM,SUM('Interior - Building Area Method'!$C79,'Interior - Building Area Method'!$E79,'Interior - Building Area Method'!$G79,'Interior - Building Area Method'!$I79,'Interior - Building Area Method'!$K79),0))+SUM(SUMIF(Exterior!$J$19:$J$69,$B68,Exterior!$K$19:$K$69),SUMIF(Exterior!$M$19:$M$69,$B68,Exterior!$N$19:$N$69),SUMIF(Exterior!$P$19:$P$69,$B68,Exterior!$Q$19:$Q$69),SUMIF(Exterior!$S$19:$S$69,$B68,Exterior!$T$19:$T$69),SUMIF(Exterior!$V$19:$V$69,$B68,Exterior!$W$19:$W$69))","v":0}]
[null,null,null,null,{"$f":"IF(ProjectMethod=SBS,SUM(SUMIF('Interior - Space-By-Space'!$M$16:OFFSET('Interior - Space-By-Space'!$M$56,-1,0),$B69,'Interior - Space-By-Space'!$O$16:OFFSET('Interior - Space-By-Space'!$O$56,-1,0)),SUMIF('Interior - Space-By-Space'!$Q$16:OFFSET('Interior - Space-By-Space'!$Q$56,-1,0),$B69,'Interior - Space-By-Space'!$S$16:OFFSET('Interior - Space-By-Space'!$S$56,-1,0)),SUMIF('Interior - Space-By-Space'!$U$16:OFFSET('Interior - Space-By-Space'!$U$56,-1,0),$B69,'Interior - Space-By-Space'!$W$16:OFFSET('Interior - Space-By-Space'!$W$56,-1,0)),SUMIF('Interior - Space-By-Space'!$Y$16:OFFSET('Interior - Space-By-Space'!$Y$56,-1,0),$B69,'Interior - Space-By-Space'!$AA$16:OFFSET('Interior - Space-By-Space'!$AA$56,-1,0)),SUMIF('Interior - Space-By-Space'!$AC$16:OFFSET('Interior - Space-By-Space'!$AC$56,-1,0),$B69,'Interior - Space-By-Space'!$AE$16:OFFSET('Interior - Space-By-Space'!$AE$56,-1,0)),SUMIF('Interior - Space-By-Space'!$AG$16:OFFSET('Interior - Space-By-Space'!$AG$56,-1,0),$B69,'Interior - Space-By-Space'!$AI$16:OFFSET('Interior - Space-By-Space'!$AI$56,-1,0)),SUMIF('Interior - Space-By-Space'!$AK$16:OFFSET('Interior - Space-By-Space'!$AK$56,-1,0),$B69,'Interior - Space-By-Space'!$AM$16:OFFSET('Interior - Space-By-Space'!$AM$56,-1,0)),SUMIF('Interior - Space-By-Space'!$AO$16:OFFSET('Interior - Space-By-Space'!$AO$56,-1,0),$B69,'Interior - Space-By-Space'!$AQ$16:OFFSET('Interior - Space-By-Space'!$AQ$56,-1,0))),IF(ProjectMethod=BAM,SUM('Interior - Building Area Method'!$C80,'Interior - Building Area Method'!$E80,'Interior - Building Area Method'!$G80,'Interior - Building Area Method'!$I80,'Interior - Building Area Method'!$K80),0))+SUM(SUMIF(Exterior!$J$19:$J$69,$B69,Exterior!$K$19:$K$69),SUMIF(Exterior!$M$19:$M$69,$B69,Exterior!$N$19:$N$69),SUMIF(Exterior!$P$19:$P$69,$B69,Exterior!$Q$19:$Q$69),SUMIF(Exterior!$S$19:$S$69,$B69,Exterior!$T$19:$T$69),SUMIF(Exterior!$V$19:$V$69,$B69,Exterior!$W$19:$W$69))","v":0}]
[null,null,null,null,{"$f":"IF(ProjectMethod=SBS,SUM(SUMIF('Interior - Space-By-Space'!$M$16:OFFSET('Interior - Space-By-Space'!$M$56,-1,0),$B70,'Interior - Space-By-Space'!$O$16:OFFSET('Interior - Space-By-Space'!$O$56,-1,0)),SUMIF('Interior - Space-By-Space'!$Q$16:OFFSET('Interior - Space-By-Space'!$Q$56,-1,0),$B70,'Interior - Space-By-Space'!$S$16:OFFSET('Interior - Space-By-Space'!$S$56,-1,0)),SUMIF('Interior - Space-By-Space'!$U$16:OFFSET('Interior - Space-By-Space'!$U$56,-1,0),$B70,'Interior - Space-By-Space'!$W$16:OFFSET('Interior - Space-By-Space'!$W$56,-1,0)),SUMIF('Interior - Space-By-Space'!$Y$16:OFFSET('Interior - Space-By-Space'!$Y$56,-1,0),$B70,'Interior - Space-By-Space'!$AA$16:OFFSET('Interior - Space-By-Space'!$AA$56,-1,0)),SUMIF('Interior - Space-By-Space'!$AC$16:OFFSET('Interior - Space-By-Space'!$AC$56,-1,0),$B70,'Interior - Space-By-Space'!$AE$16:OFFSET('Interior - Space-By-Space'!$AE$56,-1,0)),SUMIF('Interior - Space-By-Space'!$AG$16:OFFSET('Interior - Space-By-Space'!$AG$56,-1,0),$B70,'Interior - Space-By-Space'!$AI$16:OFFSET('Interior - Space-By-Space'!$AI$56,-1,0)),SUMIF('Interior - Space-By-Space'!$AK$16:OFFSET('Interior - Space-By-Space'!$AK$56,-1,0),$B70,'Interior - Space-By-Space'!$AM$16:OFFSET('Interior - Space-By-Space'!$AM$56,-1,0)),SUMIF('Interior - Space-By-Space'!$AO$16:OFFSET('Interior - Space-By-Space'!$AO$56,-1,0),$B70,'Interior - Space-By-Space'!$AQ$16:OFFSET('Interior - Space-By-Space'!$AQ$56,-1,0))),IF(ProjectMethod=BAM,SUM('Interior - Building Area Method'!$C81,'Interior - Building Area Method'!$E81,'Interior - Building Area Method'!$G81,'Interior - Building Area Method'!$I81,'Interior - Building Area Method'!$K81),0))+SUM(SUMIF(Exterior!$J$19:$J$69,$B70,Exterior!$K$19:$K$69),SUMIF(Exterior!$M$19:$M$69,$B70,Exterior!$N$19:$N$69),SUMIF(Exterior!$P$19:$P$69,$B70,Exterior!$Q$19:$Q$69),SUMIF(Exterior!$S$19:$S$69,$B70,Exterior!$T$19:$T$69),SUMIF(Exterior!$V$19:$V$69,$B70,Exterior!$W$19:$W$69))","v":0}]
[null,null,null,null,{"$f":"IF(ProjectMethod=SBS,SUM(SUMIF('Interior - Space-By-Space'!$M$16:OFFSET('Interior - Space-By-Space'!$M$56,-1,0),$B71,'Interior - Space-By-Space'!$O$16:OFFSET('Interior - Space-By-Space'!$O$56,-1,0)),SUMIF('Interior - Space-By-Space'!$Q$16:OFFSET('Interior - Space-By-Space'!$Q$56,-1,0),$B71,'Interior - Space-By-Space'!$S$16:OFFSET('Interior - Space-By-Space'!$S$56,-1,0)),SUMIF('Interior - Space-By-Space'!$U$16:OFFSET('Interior - Space-By-Space'!$U$56,-1,0),$B71,'Interior - Space-By-Space'!$W$16:OFFSET('Interior - Space-By-Space'!$W$56,-1,0)),SUMIF('Interior - Space-By-Space'!$Y$16:OFFSET('Interior - Space-By-Space'!$Y$56,-1,0),$B71,'Interior - Space-By-Space'!$AA$16:OFFSET('Interior - Space-By-Space'!$AA$56,-1,0)),SUMIF('Interior - Space-By-Space'!$AC$16:OFFSET('Interior - Space-By-Space'!$AC$56,-1,0),$B71,'Interior - Space-By-Space'!$AE$16:OFFSET('Interior - Space-By-Space'!$AE$56,-1,0)),SUMIF('Interior - Space-By-Space'!$AG$16:OFFSET('Interior - Space-By-Space'!$AG$56,-1,0),$B71,'Interior - Space-By-Space'!$AI$16:OFFSET('Interior - Space-By-Space'!$AI$56,-1,0)),SUMIF('Interior - Space-By-Space'!$AK$16:OFFSET('Interior - Space-By-Space'!$AK$56,-1,0),$B71,'Interior - Space-By-Space'!$AM$16:OFFSET('Interior - Space-By-Space'!$AM$56,-1,0)),SUMIF('Interior - Space-By-Space'!$AO$16:OFFSET('Interior - Space-By-Space'!$AO$56,-1,0),$B71,'Interior - Space-By-Space'!$AQ$16:OFFSET('Interior - Space-By-Space'!$AQ$56,-1,0))),IF(ProjectMethod=BAM,SUM('Interior - Building Area Method'!$C82,'Interior - Building Area Method'!$E82,'Interior - Building Area Method'!$G82,'Interior - Building Area Method'!$I82,'Interior - Building Area Method'!$K82),0))+SUM(SUMIF(Exterior!$J$19:$J$69,$B71,Exterior!$K$19:$K$69),SUMIF(Exterior!$M$19:$M$69,$B71,Exterior!$N$19:$N$69),SUMIF(Exterior!$P$19:$P$69,$B71,Exterior!$Q$19:$Q$69),SUMIF(Exterior!$S$19:$S$69,$B71,Exterior!$T$19:$T$69),SUMIF(Exterior!$V$19:$V$69,$B71,Exterior!$W$19:$W$69))","v":0}]
[null,null,null,null,{"$f":"IF(ProjectMethod=SBS,SUM(SUMIF('Interior - Space-By-Space'!$M$16:OFFSET('Interior - Space-By-Space'!$M$56,-1,0),$B72,'Interior - Space-By-Space'!$O$16:OFFSET('Interior - Space-By-Space'!$O$56,-1,0)),SUMIF('Interior - Space-By-Space'!$Q$16:OFFSET('Interior - Space-By-Space'!$Q$56,-1,0),$B72,'Interior - Space-By-Space'!$S$16:OFFSET('Interior - Space-By-Space'!$S$56,-1,0)),SUMIF('Interior - Space-By-Space'!$U$16:OFFSET('Interior - Space-By-Space'!$U$56,-1,0),$B72,'Interior - Space-By-Space'!$W$16:OFFSET('Interior - Space-By-Space'!$W$56,-1,0)),SUMIF('Interior - Space-By-Space'!$Y$16:OFFSET('Interior - Space-By-Space'!$Y$56,-1,0),$B72,'Interior - Space-By-Space'!$AA$16:OFFSET('Interior - Space-By-Space'!$AA$56,-1,0)),SUMIF('Interior - Space-By-Space'!$AC$16:OFFSET('Interior - Space-By-Space'!$AC$56,-1,0),$B72,'Interior - Space-By-Space'!$AE$16:OFFSET('Interior - Space-By-Space'!$AE$56,-1,0)),SUMIF('Interior - Space-By-Space'!$AG$16:OFFSET('Interior - Space-By-Space'!$AG$56,-1,0),$B72,'Interior - Space-By-Space'!$AI$16:OFFSET('Interior - Space-By-Space'!$AI$56,-1,0)),SUMIF('Interior - Space-By-Space'!$AK$16:OFFSET('Interior - Space-By-Space'!$AK$56,-1,0),$B72,'Interior - Space-By-Space'!$AM$16:OFFSET('Interior - Space-By-Space'!$AM$56,-1,0)),SUMIF('Interior - Space-By-Space'!$AO$16:OFFSET('Interior - Space-By-Space'!$AO$56,-1,0),$B72,'Interior - Space-By-Space'!$AQ$16:OFFSET('Interior - Space-By-Space'!$AQ$56,-1,0))),IF(ProjectMethod=BAM,SUM('Interior - Building Area Method'!$C83,'Interior - Building Area Method'!$E83,'Interior - Building Area Method'!$G83,'Interior - Building Area Method'!$I83,'Interior - Building Area Method'!$K83),0))+SUM(SUMIF(Exterior!$J$19:$J$69,$B72,Exterior!$K$19:$K$69),SUMIF(Exterior!$M$19:$M$69,$B72,Exterior!$N$19:$N$69),SUMIF(Exterior!$P$19:$P$69,$B72,Exterior!$Q$19:$Q$69),SUMIF(Exterior!$S$19:$S$69,$B72,Exterior!$T$19:$T$69),SUMIF(Exterior!$V$19:$V$69,$B72,Exterior!$W$19:$W$69))","v":0}]
[null,null,null,null,{"$f":"IF(ProjectMethod=SBS,SUM(SUMIF('Interior - Space-By-Space'!$M$16:OFFSET('Interior - Space-By-Space'!$M$56,-1,0),$B73,'Interior - Space-By-Space'!$O$16:OFFSET('Interior - Space-By-Space'!$O$56,-1,0)),SUMIF('Interior - Space-By-Space'!$Q$16:OFFSET('Interior - Space-By-Space'!$Q$56,-1,0),$B73,'Interior - Space-By-Space'!$S$16:OFFSET('Interior - Space-By-Space'!$S$56,-1,0)),SUMIF('Interior - Space-By-Space'!$U$16:OFFSET('Interior - Space-By-Space'!$U$56,-1,0),$B73,'Interior - Space-By-Space'!$W$16:OFFSET('Interior - Space-By-Space'!$W$56,-1,0)),SUMIF('Interior - Space-By-Space'!$Y$16:OFFSET('Interior - Space-By-Space'!$Y$56,-1,0),$B73,'Interior - Space-By-Space'!$AA$16:OFFSET('Interior - Space-By-Space'!$AA$56,-1,0)),SUMIF('Interior - Space-By-Space'!$AC$16:OFFSET('Interior - Space-By-Space'!$AC$56,-1,0),$B73,'Interior - Space-By-Space'!$AE$16:OFFSET('Interior - Space-By-Space'!$AE$56,-1,0)),SUMIF('Interior - Space-By-Space'!$AG$16:OFFSET('Interior - Space-By-Space'!$AG$56,-1,0),$B73,'Interior - Space-By-Space'!$AI$16:OFFSET('Interior - Space-By-Space'!$AI$56,-1,0)),SUMIF('Interior - Space-By-Space'!$AK$16:OFFSET('Interior - Space-By-Space'!$AK$56,-1,0),$B73,'Interior - Space-By-Space'!$AM$16:OFFSET('Interior - Space-By-Space'!$AM$56,-1,0)),SUMIF('Interior - Space-By-Space'!$AO$16:OFFSET('Interior - Space-By-Space'!$AO$56,-1,0),$B73,'Interior - Space-By-Space'!$AQ$16:OFFSET('Interior - Space-By-Space'!$AQ$56,-1,0))),IF(ProjectMethod=BAM,SUM('Interior - Building Area Method'!$C84,'Interior - Building Area Method'!$E84,'Interior - Building Area Method'!$G84,'Interior - Building Area Method'!$I84,'Interior - Building Area Method'!$K84),0))+SUM(SUMIF(Exterior!$J$19:$J$69,$B73,Exterior!$K$19:$K$69),SUMIF(Exterior!$M$19:$M$69,$B73,Exterior!$N$19:$N$69),SUMIF(Exterior!$P$19:$P$69,$B73,Exterior!$Q$19:$Q$69),SUMIF(Exterior!$S$19:$S$69,$B73,Exterior!$T$19:$T$69),SUMIF(Exterior!$V$19:$V$69,$B73,Exterior!$W$19:$W$69))","v":0}]
[null,null,null,null,{"$f":"IF(ProjectMethod=SBS,SUM(SUMIF('Interior - Space-By-Space'!$M$16:OFFSET('Interior - Space-By-Space'!$M$56,-1,0),$B74,'Interior - Space-By-Space'!$O$16:OFFSET('Interior - Space-By-Space'!$O$56,-1,0)),SUMIF('Interior - Space-By-Space'!$Q$16:OFFSET('Interior - Space-By-Space'!$Q$56,-1,0),$B74,'Interior - Space-By-Space'!$S$16:OFFSET('Interior - Space-By-Space'!$S$56,-1,0)),SUMIF('Interior - Space-By-Space'!$U$16:OFFSET('Interior - Space-By-Space'!$U$56,-1,0),$B74,'Interior - Space-By-Space'!$W$16:OFFSET('Interior - Space-By-Space'!$W$56,-1,0)),SUMIF('Interior - Space-By-Space'!$Y$16:OFFSET('Interior - Space-By-Space'!$Y$56,-1,0),$B74,'Interior - Space-By-Space'!$AA$16:OFFSET('Interior - Space-By-Space'!$AA$56,-1,0)),SUMIF('Interior - Space-By-Space'!$AC$16:OFFSET('Interior - Space-By-Space'!$AC$56,-1,0),$B74,'Interior - Space-By-Space'!$AE$16:OFFSET('Interior - Space-By-Space'!$AE$56,-1,0)),SUMIF('Interior - Space-By-Space'!$AG$16:OFFSET('Interior - Space-By-Space'!$AG$56,-1,0),$B74,'Interior - Space-By-Space'!$AI$16:OFFSET('Interior - Space-By-Space'!$AI$56,-1,0)),SUMIF('Interior - Space-By-Space'!$AK$16:OFFSET('Interior - Space-By-Space'!$AK$56,-1,0),$B74,'Interior - Space-By-Space'!$AM$16:OFFSET('Interior - Space-By-Space'!$AM$56,-1,0)),SUMIF('Interior - Space-By-Space'!$AO$16:OFFSET('Interior - Space-By-Space'!$AO$56,-1,0),$B74,'Interior - Space-By-Space'!$AQ$16:OFFSET('Interior - Space-By-Space'!$AQ$56,-1,0))),IF(ProjectMethod=BAM,SUM('Interior - Building Area Method'!$C85,'Interior - Building Area Method'!$E85,'Interior - Building Area Method'!$G85,'Interior - Building Area Method'!$I85,'Interior - Building Area Method'!$K85),0))+SUM(SUMIF(Exterior!$J$19:$J$69,$B74,Exterior!$K$19:$K$69),SUMIF(Exterior!$M$19:$M$69,$B74,Exterior!$N$19:$N$69),SUMIF(Exterior!$P$19:$P$69,$B74,Exterior!$Q$19:$Q$69),SUMIF(Exterior!$S$19:$S$69,$B74,Exterior!$T$19:$T$69),SUMIF(Exterior!$V$19:$V$69,$B74,Exterior!$W$19:$W$69))","v":0}]
[null,null,null,null,{"$f":"IF(ProjectMethod=SBS,SUM(SUMIF('Interior - Space-By-Space'!$M$16:OFFSET('Interior - Space-By-Space'!$M$56,-1,0),$B75,'Interior - Space-By-Space'!$O$16:OFFSET('Interior - Space-By-Space'!$O$56,-1,0)),SUMIF('Interior - Space-By-Space'!$Q$16:OFFSET('Interior - Space-By-Space'!$Q$56,-1,0),$B75,'Interior - Space-By-Space'!$S$16:OFFSET('Interior - Space-By-Space'!$S$56,-1,0)),SUMIF('Interior - Space-By-Space'!$U$16:OFFSET('Interior - Space-By-Space'!$U$56,-1,0),$B75,'Interior - Space-By-Space'!$W$16:OFFSET('Interior - Space-By-Space'!$W$56,-1,0)),SUMIF('Interior - Space-By-Space'!$Y$16:OFFSET('Interior - Space-By-Space'!$Y$56,-1,0),$B75,'Interior - Space-By-Space'!$AA$16:OFFSET('Interior - Space-By-Space'!$AA$56,-1,0)),SUMIF('Interior - Space-By-Space'!$AC$16:OFFSET('Interior - Space-By-Space'!$AC$56,-1,0),$B75,'Interior - Space-By-Space'!$AE$16:OFFSET('Interior - Space-By-Space'!$AE$56,-1,0)),SUMIF('Interior - Space-By-Space'!$AG$16:OFFSET('Interior - Space-By-Space'!$AG$56,-1,0),$B75,'Interior - Space-By-Space'!$AI$16:OFFSET('Interior - Space-By-Space'!$AI$56,-1,0)),SUMIF('Interior - Space-By-Space'!$AK$16:OFFSET('Interior - Space-By-Space'!$AK$56,-1,0),$B75,'Interior - Space-By-Space'!$AM$16:OFFSET('Interior - Space-By-Space'!$AM$56,-1,0)),SUMIF('Interior - Space-By-Space'!$AO$16:OFFSET('Interior - Space-By-Space'!$AO$56,-1,0),$B75,'Interior - Space-By-Space'!$AQ$16:OFFSET('Interior - Space-By-Space'!$AQ$56,-1,0))),IF(ProjectMethod=BAM,SUM('Interior - Building Area Method'!$C86,'Interior - Building Area Method'!$E86,'Interior - Building Area Method'!$G86,'Interior - Building Area Method'!$I86,'Interior - Building Area Method'!$K86),0))+SUM(SUMIF(Exterior!$J$19:$J$69,$B75,Exterior!$K$19:$K$69),SUMIF(Exterior!$M$19:$M$69,$B75,Exterior!$N$19:$N$69),SUMIF(Exterior!$P$19:$P$69,$B75,Exterior!$Q$19:$Q$69),SUMIF(Exterior!$S$19:$S$69,$B75,Exterior!$T$19:$T$69),SUMIF(Exterior!$V$19:$V$69,$B75,Exterior!$W$19:$W$69))","v":0}]
[null,null,null,null,{"$f":"IF(ProjectMethod=SBS,SUM(SUMIF('Interior - Space-By-Space'!$M$16:OFFSET('Interior - Space-By-Space'!$M$56,-1,0),$B76,'Interior - Space-By-Space'!$O$16:OFFSET('Interior - Space-By-Space'!$O$56,-1,0)),SUMIF('Interior - Space-By-Space'!$Q$16:OFFSET('Interior - Space-By-Space'!$Q$56,-1,0),$B76,'Interior - Space-By-Space'!$S$16:OFFSET('Interior - Space-By-Space'!$S$56,-1,0)),SUMIF('Interior - Space-By-Space'!$U$16:OFFSET('Interior - Space-By-Space'!$U$56,-1,0),$B76,'Interior - Space-By-Space'!$W$16:OFFSET('Interior - Space-By-Space'!$W$56,-1,0)),SUMIF('Interior - Space-By-Space'!$Y$16:OFFSET('Interior - Space-By-Space'!$Y$56,-1,0),$B76,'Interior - Space-By-Space'!$AA$16:OFFSET('Interior - Space-By-Space'!$AA$56,-1,0)),SUMIF('Interior - Space-By-Space'!$AC$16:OFFSET('Interior - Space-By-Space'!$AC$56,-1,0),$B76,'Interior - Space-By-Space'!$AE$16:OFFSET('Interior - Space-By-Space'!$AE$56,-1,0)),SUMIF('Interior - Space-By-Space'!$AG$16:OFFSET('Interior - Space-By-Space'!$AG$56,-1,0),$B76,'Interior - Space-By-Space'!$AI$16:OFFSET('Interior - Space-By-Space'!$AI$56,-1,0)),SUMIF('Interior - Space-By-Space'!$AK$16:OFFSET('Interior - Space-By-Space'!$AK$56,-1,0),$B76,'Interior - Space-By-Space'!$AM$16:OFFSET('Interior - Space-By-Space'!$AM$56,-1,0)),SUMIF('Interior - Space-By-Space'!$AO$16:OFFSET('Interior - Space-By-Space'!$AO$56,-1,0),$B76,'Interior - Space-By-Space'!$AQ$16:OFFSET('Interior - Space-By-Space'!$AQ$56,-1,0))),IF(ProjectMethod=BAM,SUM('Interior - Building Area Method'!$C87,'Interior - Building Area Method'!$E87,'Interior - Building Area Method'!$G87,'Interior - Building Area Method'!$I87,'Interior - Building Area Method'!$K87),0))+SUM(SUMIF(Exterior!$J$19:$J$69,$B76,Exterior!$K$19:$K$69),SUMIF(Exterior!$M$19:$M$69,$B76,Exterior!$N$19:$N$69),SUMIF(Exterior!$P$19:$P$69,$B76,Exterior!$Q$19:$Q$69),SUMIF(Exterior!$S$19:$S$69,$B76,Exterior!$T$19:$T$69),SUMIF(Exterior!$V$19:$V$69,$B76,Exterior!$W$19:$W$69))","v":0}]
[null,null,null,null,{"$f":"IF(ProjectMethod=SBS,SUM(SUMIF('Interior - Space-By-Space'!$M$16:OFFSET('Interior - Space-By-Space'!$M$56,-1,0),$B77,'Interior - Space-By-Space'!$O$16:OFFSET('Interior - Space-By-Space'!$O$56,-1,0)),SUMIF('Interior - Space-By-Space'!$Q$16:OFFSET('Interior - Space-By-Space'!$Q$56,-1,0),$B77,'Interior - Space-By-Space'!$S$16:OFFSET('Interior - Space-By-Space'!$S$56,-1,0)),SUMIF('Interior - Space-By-Space'!$U$16:OFFSET('Interior - Space-By-Space'!$U$56,-1,0),$B77,'Interior - Space-By-Space'!$W$16:OFFSET('Interior - Space-By-Space'!$W$56,-1,0)),SUMIF('Interior - Space-By-Space'!$Y$16:OFFSET('Interior - Space-By-Space'!$Y$56,-1,0),$B77,'Interior - Space-By-Space'!$AA$16:OFFSET('Interior - Space-By-Space'!$AA$56,-1,0)),SUMIF('Interior - Space-By-Space'!$AC$16:OFFSET('Interior - Space-By-Space'!$AC$56,-1,0),$B77,'Interior - Space-By-Space'!$AE$16:OFFSET('Interior - Space-By-Space'!$AE$56,-1,0)),SUMIF('Interior - Space-By-Space'!$AG$16:OFFSET('Interior - Space-By-Space'!$AG$56,-1,0),$B77,'Interior - Space-By-Space'!$AI$16:OFFSET('Interior - Space-By-Space'!$AI$56,-1,0)),SUMIF('Interior - Space-By-Space'!$AK$16:OFFSET('Interior - Space-By-Space'!$AK$56,-1,0),$B77,'Interior - Space-By-Space'!$AM$16:OFFSET('Interior - Space-By-Space'!$AM$56,-1,0)),SUMIF('Interior - Space-By-Space'!$AO$16:OFFSET('Interior - Space-By-Space'!$AO$56,-1,0),$B77,'Interior - Space-By-Space'!$AQ$16:OFFSET('Interior - Space-By-Space'!$AQ$56,-1,0))),IF(ProjectMethod=BAM,SUM('Interior - Building Area Method'!$C88,'Interior - Building Area Method'!$E88,'Interior - Building Area Method'!$G88,'Interior - Building Area Method'!$I88,'Interior - Building Area Method'!$K88),0))+SUM(SUMIF(Exterior!$J$19:$J$69,$B77,Exterior!$K$19:$K$69),SUMIF(Exterior!$M$19:$M$69,$B77,Exterior!$N$19:$N$69),SUMIF(Exterior!$P$19:$P$69,$B77,Exterior!$Q$19:$Q$69),SUMIF(Exterior!$S$19:$S$69,$B77,Exterior!$T$19:$T$69),SUMIF(Exterior!$V$19:$V$69,$B77,Exterior!$W$19:$W$69))","v":0}]
[null,null,null,null,{"$f":"IF(ProjectMethod=SBS,SUM(SUMIF('Interior - Space-By-Space'!$M$16:OFFSET('Interior - Space-By-Space'!$M$56,-1,0),$B78,'Interior - Space-By-Space'!$O$16:OFFSET('Interior - Space-By-Space'!$O$56,-1,0)),SUMIF('Interior - Space-By-Space'!$Q$16:OFFSET('Interior - Space-By-Space'!$Q$56,-1,0),$B78,'Interior - Space-By-Space'!$S$16:OFFSET('Interior - Space-By-Space'!$S$56,-1,0)),SUMIF('Interior - Space-By-Space'!$U$16:OFFSET('Interior - Space-By-Space'!$U$56,-1,0),$B78,'Interior - Space-By-Space'!$W$16:OFFSET('Interior - Space-By-Space'!$W$56,-1,0)),SUMIF('Interior - Space-By-Space'!$Y$16:OFFSET('Interior - Space-By-Space'!$Y$56,-1,0),$B78,'Interior - Space-By-Space'!$AA$16:OFFSET('Interior - Space-By-Space'!$AA$56,-1,0)),SUMIF('Interior - Space-By-Space'!$AC$16:OFFSET('Interior - Space-By-Space'!$AC$56,-1,0),$B78,'Interior - Space-By-Space'!$AE$16:OFFSET('Interior - Space-By-Space'!$AE$56,-1,0)),SUMIF('Interior - Space-By-Space'!$AG$16:OFFSET('Interior - Space-By-Space'!$AG$56,-1,0),$B78,'Interior - Space-By-Space'!$AI$16:OFFSET('Interior - Space-By-Space'!$AI$56,-1,0)),SUMIF('Interior - Space-By-Space'!$AK$16:OFFSET('Interior - Space-By-Space'!$AK$56,-1,0),$B78,'Interior - Space-By-Space'!$AM$16:OFFSET('Interior - Space-By-Space'!$AM$56,-1,0)),SUMIF('Interior - Space-By-Space'!$AO$16:OFFSET('Interior - Space-By-Space'!$AO$56,-1,0),$B78,'Interior - Space-By-Space'!$AQ$16:OFFSET('Interior - Space-By-Space'!$AQ$56,-1,0))),IF(ProjectMethod=BAM,SUM('Interior - Building Area Method'!$C89,'Interior - Building Area Method'!$E89,'Interior - Building Area Method'!$G89,'Interior - Building Area Method'!$I89,'Interior - Building Area Method'!$K89),0))+SUM(SUMIF(Exterior!$J$19:$J$69,$B78,Exterior!$K$19:$K$69),SUMIF(Exterior!$M$19:$M$69,$B78,Exterior!$N$19:$N$69),SUMIF(Exterior!$P$19:$P$69,$B78,Exterior!$Q$19:$Q$69),SUMIF(Exterior!$S$19:$S$69,$B78,Exterior!$T$19:$T$69),SUMIF(Exterior!$V$19:$V$69,$B78,Exterior!$W$19:$W$69))","v":0}]
[null,null,null,null,{"$f":"IF(ProjectMethod=SBS,SUM(SUMIF('Interior - Space-By-Space'!$M$16:OFFSET('Interior - Space-By-Space'!$M$56,-1,0),$B79,'Interior - Space-By-Space'!$O$16:OFFSET('Interior - Space-By-Space'!$O$56,-1,0)),SUMIF('Interior - Space-By-Space'!$Q$16:OFFSET('Interior - Space-By-Space'!$Q$56,-1,0),$B79,'Interior - Space-By-Space'!$S$16:OFFSET('Interior - Space-By-Space'!$S$56,-1,0)),SUMIF('Interior - Space-By-Space'!$U$16:OFFSET('Interior - Space-By-Space'!$U$56,-1,0),$B79,'Interior - Space-By-Space'!$W$16:OFFSET('Interior - Space-By-Space'!$W$56,-1,0)),SUMIF('Interior - Space-By-Space'!$Y$16:OFFSET('Interior - Space-By-Space'!$Y$56,-1,0),$B79,'Interior - Space-By-Space'!$AA$16:OFFSET('Interior - Space-By-Space'!$AA$56,-1,0)),SUMIF('Interior - Space-By-Space'!$AC$16:OFFSET('Interior - Space-By-Space'!$AC$56,-1,0),$B79,'Interior - Space-By-Space'!$AE$16:OFFSET('Interior - Space-By-Space'!$AE$56,-1,0)),SUMIF('Interior - Space-By-Space'!$AG$16:OFFSET('Interior - Space-By-Space'!$AG$56,-1,0),$B79,'Interior - Space-By-Space'!$AI$16:OFFSET('Interior - Space-By-Space'!$AI$56,-1,0)),SUMIF('Interior - Space-By-Space'!$AK$16:OFFSET('Interior - Space-By-Space'!$AK$56,-1,0),$B79,'Interior - Space-By-Space'!$AM$16:OFFSET('Interior - Space-By-Space'!$AM$56,-1,0)),SUMIF('Interior - Space-By-Space'!$AO$16:OFFSET('Interior - Space-By-Space'!$AO$56,-1,0),$B79,'Interior - Space-By-Space'!$AQ$16:OFFSET('Interior - Space-By-Space'!$AQ$56,-1,0))),IF(ProjectMethod=BAM,SUM('Interior - Building Area Method'!$C90,'Interior - Building Area Method'!$E90,'Interior - Building Area Method'!$G90,'Interior - Building Area Method'!$I90,'Interior - Building Area Method'!$K90),0))+SUM(SUMIF(Exterior!$J$19:$J$69,$B79,Exterior!$K$19:$K$69),SUMIF(Exterior!$M$19:$M$69,$B79,Exterior!$N$19:$N$69),SUMIF(Exterior!$P$19:$P$69,$B79,Exterior!$Q$19:$Q$69),SUMIF(Exterior!$S$19:$S$69,$B79,Exterior!$T$19:$T$69),SUMIF(Exterior!$V$19:$V$69,$B79,Exterior!$W$19:$W$69))","v":0}]
[null,null,null,null,{"$f":"IF(ProjectMethod=SBS,SUM(SUMIF('Interior - Space-By-Space'!$M$16:OFFSET('Interior - Space-By-Space'!$M$56,-1,0),$B80,'Interior - Space-By-Space'!$O$16:OFFSET('Interior - Space-By-Space'!$O$56,-1,0)),SUMIF('Interior - Space-By-Space'!$Q$16:OFFSET('Interior - Space-By-Space'!$Q$56,-1,0),$B80,'Interior - Space-By-Space'!$S$16:OFFSET('Interior - Space-By-Space'!$S$56,-1,0)),SUMIF('Interior - Space-By-Space'!$U$16:OFFSET('Interior - Space-By-Space'!$U$56,-1,0),$B80,'Interior - Space-By-Space'!$W$16:OFFSET('Interior - Space-By-Space'!$W$56,-1,0)),SUMIF('Interior - Space-By-Space'!$Y$16:OFFSET('Interior - Space-By-Space'!$Y$56,-1,0),$B80,'Interior - Space-By-Space'!$AA$16:OFFSET('Interior - Space-By-Space'!$AA$56,-1,0)),SUMIF('Interior - Space-By-Space'!$AC$16:OFFSET('Interior - Space-By-Space'!$AC$56,-1,0),$B80,'Interior - Space-By-Space'!$AE$16:OFFSET('Interior - Space-By-Space'!$AE$56,-1,0)),SUMIF('Interior - Space-By-Space'!$AG$16:OFFSET('Interior - Space-By-Space'!$AG$56,-1,0),$B80,'Interior - Space-By-Space'!$AI$16:OFFSET('Interior - Space-By-Space'!$AI$56,-1,0)),SUMIF('Interior - Space-By-Space'!$AK$16:OFFSET('Interior - Space-By-Space'!$AK$56,-1,0),$B80,'Interior - Space-By-Space'!$AM$16:OFFSET('Interior - Space-By-Space'!$AM$56,-1,0)),SUMIF('Interior - Space-By-Space'!$AO$16:OFFSET('Interior - Space-By-Space'!$AO$56,-1,0),$B80,'Interior - Space-By-Space'!$AQ$16:OFFSET('Interior - Space-By-Space'!$AQ$56,-1,0))),IF(ProjectMethod=BAM,SUM('Interior - Building Area Method'!$C91,'Interior - Building Area Method'!$E91,'Interior - Building Area Method'!$G91,'Interior - Building Area Method'!$I91,'Interior - Building Area Method'!$K91),0))+SUM(SUMIF(Exterior!$J$19:$J$69,$B80,Exterior!$K$19:$K$69),SUMIF(Exterior!$M$19:$M$69,$B80,Exterior!$N$19:$N$69),SUMIF(Exterior!$P$19:$P$69,$B80,Exterior!$Q$19:$Q$69),SUMIF(Exterior!$S$19:$S$69,$B80,Exterior!$T$19:$T$69),SUMIF(Exterior!$V$19:$V$69,$B80,Exterior!$W$19:$W$69))","v":0}]
[null,null,null,null,{"$f":"IF(ProjectMethod=SBS,SUM(SUMIF('Interior - Space-By-Space'!$M$16:OFFSET('Interior - Space-By-Space'!$M$56,-1,0),$B81,'Interior - Space-By-Space'!$O$16:OFFSET('Interior - Space-By-Space'!$O$56,-1,0)),SUMIF('Interior - Space-By-Space'!$Q$16:OFFSET('Interior - Space-By-Space'!$Q$56,-1,0),$B81,'Interior - Space-By-Space'!$S$16:OFFSET('Interior - Space-By-Space'!$S$56,-1,0)),SUMIF('Interior - Space-By-Space'!$U$16:OFFSET('Interior - Space-By-Space'!$U$56,-1,0),$B81,'Interior - Space-By-Space'!$W$16:OFFSET('Interior - Space-By-Space'!$W$56,-1,0)),SUMIF('Interior - Space-By-Space'!$Y$16:OFFSET('Interior - Space-By-Space'!$Y$56,-1,0),$B81,'Interior - Space-By-Space'!$AA$16:OFFSET('Interior - Space-By-Space'!$AA$56,-1,0)),SUMIF('Interior - Space-By-Space'!$AC$16:OFFSET('Interior - Space-By-Space'!$AC$56,-1,0),$B81,'Interior - Space-By-Space'!$AE$16:OFFSET('Interior - Space-By-Space'!$AE$56,-1,0)),SUMIF('Interior - Space-By-Space'!$AG$16:OFFSET('Interior - Space-By-Space'!$AG$56,-1,0),$B81,'Interior - Space-By-Space'!$AI$16:OFFSET('Interior - Space-By-Space'!$AI$56,-1,0)),SUMIF('Interior - Space-By-Space'!$AK$16:OFFSET('Interior - Space-By-Space'!$AK$56,-1,0),$B81,'Interior - Space-By-Space'!$AM$16:OFFSET('Interior - Space-By-Space'!$AM$56,-1,0)),SUMIF('Interior - Space-By-Space'!$AO$16:OFFSET('Interior - Space-By-Space'!$AO$56,-1,0),$B81,'Interior - Space-By-Space'!$AQ$16:OFFSET('Interior - Space-By-Space'!$AQ$56,-1,0))),IF(ProjectMethod=BAM,SUM('Interior - Building Area Method'!$C92,'Interior - Building Area Method'!$E92,'Interior - Building Area Method'!$G92,'Interior - Building Area Method'!$I92,'Interior - Building Area Method'!$K92),0))+SUM(SUMIF(Exterior!$J$19:$J$69,$B81,Exterior!$K$19:$K$69),SUMIF(Exterior!$M$19:$M$69,$B81,Exterior!$N$19:$N$69),SUMIF(Exterior!$P$19:$P$69,$B81,Exterior!$Q$19:$Q$69),SUMIF(Exterior!$S$19:$S$69,$B81,Exterior!$T$19:$T$69),SUMIF(Exterior!$V$19:$V$69,$B81,Exterior!$W$19:$W$69))","v":0}]
[null,null,null,null,{"$f":"IF(ProjectMethod=SBS,SUM(SUMIF('Interior - Space-By-Space'!$M$16:OFFSET('Interior - Space-By-Space'!$M$56,-1,0),$B82,'Interior - Space-By-Space'!$O$16:OFFSET('Interior - Space-By-Space'!$O$56,-1,0)),SUMIF('Interior - Space-By-Space'!$Q$16:OFFSET('Interior - Space-By-Space'!$Q$56,-1,0),$B82,'Interior - Space-By-Space'!$S$16:OFFSET('Interior - Space-By-Space'!$S$56,-1,0)),SUMIF('Interior - Space-By-Space'!$U$16:OFFSET('Interior - Space-By-Space'!$U$56,-1,0),$B82,'Interior - Space-By-Space'!$W$16:OFFSET('Interior - Space-By-Space'!$W$56,-1,0)),SUMIF('Interior - Space-By-Space'!$Y$16:OFFSET('Interior - Space-By-Space'!$Y$56,-1,0),$B82,'Interior - Space-By-Space'!$AA$16:OFFSET('Interior - Space-By-Space'!$AA$56,-1,0)),SUMIF('Interior - Space-By-Space'!$AC$16:OFFSET('Interior - Space-By-Space'!$AC$56,-1,0),$B82,'Interior - Space-By-Space'!$AE$16:OFFSET('Interior - Space-By-Space'!$AE$56,-1,0)),SUMIF('Interior - Space-By-Space'!$AG$16:OFFSET('Interior - Space-By-Space'!$AG$56,-1,0),$B82,'Interior - Space-By-Space'!$AI$16:OFFSET('Interior - Space-By-Space'!$AI$56,-1,0)),SUMIF('Interior - Space-By-Space'!$AK$16:OFFSET('Interior - Space-By-Space'!$AK$56,-1,0),$B82,'Interior - Space-By-Space'!$AM$16:OFFSET('Interior - Space-By-Space'!$AM$56,-1,0)),SUMIF('Interior - Space-By-Space'!$AO$16:OFFSET('Interior - Space-By-Space'!$AO$56,-1,0),$B82,'Interior - Space-By-Space'!$AQ$16:OFFSET('Interior - Space-By-Space'!$AQ$56,-1,0))),IF(ProjectMethod=BAM,SUM('Interior - Building Area Method'!$C93,'Interior - Building Area Method'!$E93,'Interior - Building Area Method'!$G93,'Interior - Building Area Method'!$I93,'Interior - Building Area Method'!$K93),0))+SUM(SUMIF(Exterior!$J$19:$J$69,$B82,Exterior!$K$19:$K$69),SUMIF(Exterior!$M$19:$M$69,$B82,Exterior!$N$19:$N$69),SUMIF(Exterior!$P$19:$P$69,$B82,Exterior!$Q$19:$Q$69),SUMIF(Exterior!$S$19:$S$69,$B82,Exterior!$T$19:$T$69),SUMIF(Exterior!$V$19:$V$69,$B82,Exterior!$W$19:$W$69))","v":0}]
[null,null,null,null,{"$f":"IF(ProjectMethod=SBS,SUM(SUMIF('Interior - Space-By-Space'!$M$16:OFFSET('Interior - Space-By-Space'!$M$56,-1,0),$B83,'Interior - Space-By-Space'!$O$16:OFFSET('Interior - Space-By-Space'!$O$56,-1,0)),SUMIF('Interior - Space-By-Space'!$Q$16:OFFSET('Interior - Space-By-Space'!$Q$56,-1,0),$B83,'Interior - Space-By-Space'!$S$16:OFFSET('Interior - Space-By-Space'!$S$56,-1,0)),SUMIF('Interior - Space-By-Space'!$U$16:OFFSET('Interior - Space-By-Space'!$U$56,-1,0),$B83,'Interior - Space-By-Space'!$W$16:OFFSET('Interior - Space-By-Space'!$W$56,-1,0)),SUMIF('Interior - Space-By-Space'!$Y$16:OFFSET('Interior - Space-By-Space'!$Y$56,-1,0),$B83,'Interior - Space-By-Space'!$AA$16:OFFSET('Interior - Space-By-Space'!$AA$56,-1,0)),SUMIF('Interior - Space-By-Space'!$AC$16:OFFSET('Interior - Space-By-Space'!$AC$56,-1,0),$B83,'Interior - Space-By-Space'!$AE$16:OFFSET('Interior - Space-By-Space'!$AE$56,-1,0)),SUMIF('Interior - Space-By-Space'!$AG$16:OFFSET('Interior - Space-By-Space'!$AG$56,-1,0),$B83,'Interior - Space-By-Space'!$AI$16:OFFSET('Interior - Space-By-Space'!$AI$56,-1,0)),SUMIF('Interior - Space-By-Space'!$AK$16:OFFSET('Interior - Space-By-Space'!$AK$56,-1,0),$B83,'Interior - Space-By-Space'!$AM$16:OFFSET('Interior - Space-By-Space'!$AM$56,-1,0)),SUMIF('Interior - Space-By-Space'!$AO$16:OFFSET('Interior - Space-By-Space'!$AO$56,-1,0),$B83,'Interior - Space-By-Space'!$AQ$16:OFFSET('Interior - Space-By-Space'!$AQ$56,-1,0))),IF(ProjectMethod=BAM,SUM('Interior - Building Area Method'!$C94,'Interior - Building Area Method'!$E94,'Interior - Building Area Method'!$G94,'Interior - Building Area Method'!$I94,'Interior - Building Area Method'!$K94),0))+SUM(SUMIF(Exterior!$J$19:$J$69,$B83,Exterior!$K$19:$K$69),SUMIF(Exterior!$M$19:$M$69,$B83,Exterior!$N$19:$N$69),SUMIF(Exterior!$P$19:$P$69,$B83,Exterior!$Q$19:$Q$69),SUMIF(Exterior!$S$19:$S$69,$B83,Exterior!$T$19:$T$69),SUMIF(Exterior!$V$19:$V$69,$B83,Exterior!$W$19:$W$69))","v":0}]
[null,null,null,null,{"$f":"IF(ProjectMethod=SBS,SUM(SUMIF('Interior - Space-By-Space'!$M$16:OFFSET('Interior - Space-By-Space'!$M$56,-1,0),$B84,'Interior - Space-By-Space'!$O$16:OFFSET('Interior - Space-By-Space'!$O$56,-1,0)),SUMIF('Interior - Space-By-Space'!$Q$16:OFFSET('Interior - Space-By-Space'!$Q$56,-1,0),$B84,'Interior - Space-By-Space'!$S$16:OFFSET('Interior - Space-By-Space'!$S$56,-1,0)),SUMIF('Interior - Space-By-Space'!$U$16:OFFSET('Interior - Space-By-Space'!$U$56,-1,0),$B84,'Interior - Space-By-Space'!$W$16:OFFSET('Interior - Space-By-Space'!$W$56,-1,0)),SUMIF('Interior - Space-By-Space'!$Y$16:OFFSET('Interior - Space-By-Space'!$Y$56,-1,0),$B84,'Interior - Space-By-Space'!$AA$16:OFFSET('Interior - Space-By-Space'!$AA$56,-1,0)),SUMIF('Interior - Space-By-Space'!$AC$16:OFFSET('Interior - Space-By-Space'!$AC$56,-1,0),$B84,'Interior - Space-By-Space'!$AE$16:OFFSET('Interior - Space-By-Space'!$AE$56,-1,0)),SUMIF('Interior - Space-By-Space'!$AG$16:OFFSET('Interior - Space-By-Space'!$AG$56,-1,0),$B84,'Interior - Space-By-Space'!$AI$16:OFFSET('Interior - Space-By-Space'!$AI$56,-1,0)),SUMIF('Interior - Space-By-Space'!$AK$16:OFFSET('Interior - Space-By-Space'!$AK$56,-1,0),$B84,'Interior - Space-By-Space'!$AM$16:OFFSET('Interior - Space-By-Space'!$AM$56,-1,0)),SUMIF('Interior - Space-By-Space'!$AO$16:OFFSET('Interior - Space-By-Space'!$AO$56,-1,0),$B84,'Interior - Space-By-Space'!$AQ$16:OFFSET('Interior - Space-By-Space'!$AQ$56,-1,0))),IF(ProjectMethod=BAM,SUM('Interior - Building Area Method'!$C95,'Interior - Building Area Method'!$E95,'Interior - Building Area Method'!$G95,'Interior - Building Area Method'!$I95,'Interior - Building Area Method'!$K95),0))+SUM(SUMIF(Exterior!$J$19:$J$69,$B84,Exterior!$K$19:$K$69),SUMIF(Exterior!$M$19:$M$69,$B84,Exterior!$N$19:$N$69),SUMIF(Exterior!$P$19:$P$69,$B84,Exterior!$Q$19:$Q$69),SUMIF(Exterior!$S$19:$S$69,$B84,Exterior!$T$19:$T$69),SUMIF(Exterior!$V$19:$V$69,$B84,Exterior!$W$19:$W$69))","v":0}]
[null,null,null,null,{"$f":"IF(ProjectMethod=SBS,SUM(SUMIF('Interior - Space-By-Space'!$M$16:OFFSET('Interior - Space-By-Space'!$M$56,-1,0),$B85,'Interior - Space-By-Space'!$O$16:OFFSET('Interior - Space-By-Space'!$O$56,-1,0)),SUMIF('Interior - Space-By-Space'!$Q$16:OFFSET('Interior - Space-By-Space'!$Q$56,-1,0),$B85,'Interior - Space-By-Space'!$S$16:OFFSET('Interior - Space-By-Space'!$S$56,-1,0)),SUMIF('Interior - Space-By-Space'!$U$16:OFFSET('Interior - Space-By-Space'!$U$56,-1,0),$B85,'Interior - Space-By-Space'!$W$16:OFFSET('Interior - Space-By-Space'!$W$56,-1,0)),SUMIF('Interior - Space-By-Space'!$Y$16:OFFSET('Interior - Space-By-Space'!$Y$56,-1,0),$B85,'Interior - Space-By-Space'!$AA$16:OFFSET('Interior - Space-By-Space'!$AA$56,-1,0)),SUMIF('Interior - Space-By-Space'!$AC$16:OFFSET('Interior - Space-By-Space'!$AC$56,-1,0),$B85,'Interior - Space-By-Space'!$AE$16:OFFSET('Interior - Space-By-Space'!$AE$56,-1,0)),SUMIF('Interior - Space-By-Space'!$AG$16:OFFSET('Interior - Space-By-Space'!$AG$56,-1,0),$B85,'Interior - Space-By-Space'!$AI$16:OFFSET('Interior - Space-By-Space'!$AI$56,-1,0)),SUMIF('Interior - Space-By-Space'!$AK$16:OFFSET('Interior - Space-By-Space'!$AK$56,-1,0),$B85,'Interior - Space-By-Space'!$AM$16:OFFSET('Interior - Space-By-Space'!$AM$56,-1,0)),SUMIF('Interior - Space-By-Space'!$AO$16:OFFSET('Interior - Space-By-Space'!$AO$56,-1,0),$B85,'Interior - Space-By-Space'!$AQ$16:OFFSET('Interior - Space-By-Space'!$AQ$56,-1,0))),IF(ProjectMethod=BAM,SUM('Interior - Building Area Method'!$C96,'Interior - Building Area Method'!$E96,'Interior - Building Area Method'!$G96,'Interior - Building Area Method'!$I96,'Interior - Building Area Method'!$K96),0))+SUM(SUMIF(Exterior!$J$19:$J$69,$B85,Exterior!$K$19:$K$69),SUMIF(Exterior!$M$19:$M$69,$B85,Exterior!$N$19:$N$69),SUMIF(Exterior!$P$19:$P$69,$B85,Exterior!$Q$19:$Q$69),SUMIF(Exterior!$S$19:$S$69,$B85,Exterior!$T$19:$T$69),SUMIF(Exterior!$V$19:$V$69,$B85,Exterior!$W$19:$W$69))","v":0}]
[null,null,null,null,{"$f":"IF(ProjectMethod=SBS,SUM(SUMIF('Interior - Space-By-Space'!$M$16:OFFSET('Interior - Space-By-Space'!$M$56,-1,0),$B86,'Interior - Space-By-Space'!$O$16:OFFSET('Interior - Space-By-Space'!$O$56,-1,0)),SUMIF('Interior - Space-By-Space'!$Q$16:OFFSET('Interior - Space-By-Space'!$Q$56,-1,0),$B86,'Interior - Space-By-Space'!$S$16:OFFSET('Interior - Space-By-Space'!$S$56,-1,0)),SUMIF('Interior - Space-By-Space'!$U$16:OFFSET('Interior - Space-By-Space'!$U$56,-1,0),$B86,'Interior - Space-By-Space'!$W$16:OFFSET('Interior - Space-By-Space'!$W$56,-1,0)),SUMIF('Interior - Space-By-Space'!$Y$16:OFFSET('Interior - Space-By-Space'!$Y$56,-1,0),$B86,'Interior - Space-By-Space'!$AA$16:OFFSET('Interior - Space-By-Space'!$AA$56,-1,0)),SUMIF('Interior - Space-By-Space'!$AC$16:OFFSET('Interior - Space-By-Space'!$AC$56,-1,0),$B86,'Interior - Space-By-Space'!$AE$16:OFFSET('Interior - Space-By-Space'!$AE$56,-1,0)),SUMIF('Interior - Space-By-Space'!$AG$16:OFFSET('Interior - Space-By-Space'!$AG$56,-1,0),$B86,'Interior - Space-By-Space'!$AI$16:OFFSET('Interior - Space-By-Space'!$AI$56,-1,0)),SUMIF('Interior - Space-By-Space'!$AK$16:OFFSET('Interior - Space-By-Space'!$AK$56,-1,0),$B86,'Interior - Space-By-Space'!$AM$16:OFFSET('Interior - Space-By-Space'!$AM$56,-1,0)),SUMIF('Interior - Space-By-Space'!$AO$16:OFFSET('Interior - Space-By-Space'!$AO$56,-1,0),$B86,'Interior - Space-By-Space'!$AQ$16:OFFSET('Interior - Space-By-Space'!$AQ$56,-1,0))),IF(ProjectMethod=BAM,SUM('Interior - Building Area Method'!$C97,'Interior - Building Area Method'!$E97,'Interior - Building Area Method'!$G97,'Interior - Building Area Method'!$I97,'Interior - Building Area Method'!$K97),0))+SUM(SUMIF(Exterior!$J$19:$J$69,$B86,Exterior!$K$19:$K$69),SUMIF(Exterior!$M$19:$M$69,$B86,Exterior!$N$19:$N$69),SUMIF(Exterior!$P$19:$P$69,$B86,Exterior!$Q$19:$Q$69),SUMIF(Exterior!$S$19:$S$69,$B86,Exterior!$T$19:$T$69),SUMIF(Exterior!$V$19:$V$69,$B86,Exterior!$W$19:$W$69))","v":0}]
[null,null,null,null,{"$f":"IF(ProjectMethod=SBS,SUM(SUMIF('Interior - Space-By-Space'!$M$16:OFFSET('Interior - Space-By-Space'!$M$56,-1,0),$B87,'Interior - Space-By-Space'!$O$16:OFFSET('Interior - Space-By-Space'!$O$56,-1,0)),SUMIF('Interior - Space-By-Space'!$Q$16:OFFSET('Interior - Space-By-Space'!$Q$56,-1,0),$B87,'Interior - Space-By-Space'!$S$16:OFFSET('Interior - Space-By-Space'!$S$56,-1,0)),SUMIF('Interior - Space-By-Space'!$U$16:OFFSET('Interior - Space-By-Space'!$U$56,-1,0),$B87,'Interior - Space-By-Space'!$W$16:OFFSET('Interior - Space-By-Space'!$W$56,-1,0)),SUMIF('Interior - Space-By-Space'!$Y$16:OFFSET('Interior - Space-By-Space'!$Y$56,-1,0),$B87,'Interior - Space-By-Space'!$AA$16:OFFSET('Interior - Space-By-Space'!$AA$56,-1,0)),SUMIF('Interior - Space-By-Space'!$AC$16:OFFSET('Interior - Space-By-Space'!$AC$56,-1,0),$B87,'Interior - Space-By-Space'!$AE$16:OFFSET('Interior - Space-By-Space'!$AE$56,-1,0)),SUMIF('Interior - Space-By-Space'!$AG$16:OFFSET('Interior - Space-By-Space'!$AG$56,-1,0),$B87,'Interior - Space-By-Space'!$AI$16:OFFSET('Interior - Space-By-Space'!$AI$56,-1,0)),SUMIF('Interior - Space-By-Space'!$AK$16:OFFSET('Interior - Space-By-Space'!$AK$56,-1,0),$B87,'Interior - Space-By-Space'!$AM$16:OFFSET('Interior - Space-By-Space'!$AM$56,-1,0)),SUMIF('Interior - Space-By-Space'!$AO$16:OFFSET('Interior - Space-By-Space'!$AO$56,-1,0),$B87,'Interior - Space-By-Space'!$AQ$16:OFFSET('Interior - Space-By-Space'!$AQ$56,-1,0))),IF(ProjectMethod=BAM,SUM('Interior - Building Area Method'!$C98,'Interior - Building Area Method'!$E98,'Interior - Building Area Method'!$G98,'Interior - Building Area Method'!$I98,'Interior - Building Area Method'!$K98),0))+SUM(SUMIF(Exterior!$J$19:$J$69,$B87,Exterior!$K$19:$K$69),SUMIF(Exterior!$M$19:$M$69,$B87,Exterior!$N$19:$N$69),SUMIF(Exterior!$P$19:$P$69,$B87,Exterior!$Q$19:$Q$69),SUMIF(Exterior!$S$19:$S$69,$B87,Exterior!$T$19:$T$69),SUMIF(Exterior!$V$19:$V$69,$B87,Exterior!$W$19:$W$69))","v":0}]
[null,null,null,null,{"$f":"IF(ProjectMethod=SBS,SUM(SUMIF('Interior - Space-By-Space'!$M$16:OFFSET('Interior - Space-By-Space'!$M$56,-1,0),$B88,'Interior - Space-By-Space'!$O$16:OFFSET('Interior - Space-By-Space'!$O$56,-1,0)),SUMIF('Interior - Space-By-Space'!$Q$16:OFFSET('Interior - Space-By-Space'!$Q$56,-1,0),$B88,'Interior - Space-By-Space'!$S$16:OFFSET('Interior - Space-By-Space'!$S$56,-1,0)),SUMIF('Interior - Space-By-Space'!$U$16:OFFSET('Interior - Space-By-Space'!$U$56,-1,0),$B88,'Interior - Space-By-Space'!$W$16:OFFSET('Interior - Space-By-Space'!$W$56,-1,0)),SUMIF('Interior - Space-By-Space'!$Y$16:OFFSET('Interior - Space-By-Space'!$Y$56,-1,0),$B88,'Interior - Space-By-Space'!$AA$16:OFFSET('Interior - Space-By-Space'!$AA$56,-1,0)),SUMIF('Interior - Space-By-Space'!$AC$16:OFFSET('Interior - Space-By-Space'!$AC$56,-1,0),$B88,'Interior - Space-By-Space'!$AE$16:OFFSET('Interior - Space-By-Space'!$AE$56,-1,0)),SUMIF('Interior - Space-By-Space'!$AG$16:OFFSET('Interior - Space-By-Space'!$AG$56,-1,0),$B88,'Interior - Space-By-Space'!$AI$16:OFFSET('Interior - Space-By-Space'!$AI$56,-1,0)),SUMIF('Interior - Space-By-Space'!$AK$16:OFFSET('Interior - Space-By-Space'!$AK$56,-1,0),$B88,'Interior - Space-By-Space'!$AM$16:OFFSET('Interior - Space-By-Space'!$AM$56,-1,0)),SUMIF('Interior - Space-By-Space'!$AO$16:OFFSET('Interior - Space-By-Space'!$AO$56,-1,0),$B88,'Interior - Space-By-Space'!$AQ$16:OFFSET('Interior - Space-By-Space'!$AQ$56,-1,0))),IF(ProjectMethod=BAM,SUM('Interior - Building Area Method'!$C99,'Interior - Building Area Method'!$E99,'Interior - Building Area Method'!$G99,'Interior - Building Area Method'!$I99,'Interior - Building Area Method'!$K99),0))+SUM(SUMIF(Exterior!$J$19:$J$69,$B88,Exterior!$K$19:$K$69),SUMIF(Exterior!$M$19:$M$69,$B88,Exterior!$N$19:$N$69),SUMIF(Exterior!$P$19:$P$69,$B88,Exterior!$Q$19:$Q$69),SUMIF(Exterior!$S$19:$S$69,$B88,Exterior!$T$19:$T$69),SUMIF(Exterior!$V$19:$V$69,$B88,Exterior!$W$19:$W$69))","v":0}]
[null,null,null,null,{"$f":"IF(ProjectMethod=SBS,SUM(SUMIF('Interior - Space-By-Space'!$M$16:OFFSET('Interior - Space-By-Space'!$M$56,-1,0),$B89,'Interior - Space-By-Space'!$O$16:OFFSET('Interior - Space-By-Space'!$O$56,-1,0)),SUMIF('Interior - Space-By-Space'!$Q$16:OFFSET('Interior - Space-By-Space'!$Q$56,-1,0),$B89,'Interior - Space-By-Space'!$S$16:OFFSET('Interior - Space-By-Space'!$S$56,-1,0)),SUMIF('Interior - Space-By-Space'!$U$16:OFFSET('Interior - Space-By-Space'!$U$56,-1,0),$B89,'Interior - Space-By-Space'!$W$16:OFFSET('Interior - Space-By-Space'!$W$56,-1,0)),SUMIF('Interior - Space-By-Space'!$Y$16:OFFSET('Interior - Space-By-Space'!$Y$56,-1,0),$B89,'Interior - Space-By-Space'!$AA$16:OFFSET('Interior - Space-By-Space'!$AA$56,-1,0)),SUMIF('Interior - Space-By-Space'!$AC$16:OFFSET('Interior - Space-By-Space'!$AC$56,-1,0),$B89,'Interior - Space-By-Space'!$AE$16:OFFSET('Interior - Space-By-Space'!$AE$56,-1,0)),SUMIF('Interior - Space-By-Space'!$AG$16:OFFSET('Interior - Space-By-Space'!$AG$56,-1,0),$B89,'Interior - Space-By-Space'!$AI$16:OFFSET('Interior - Space-By-Space'!$AI$56,-1,0)),SUMIF('Interior - Space-By-Space'!$AK$16:OFFSET('Interior - Space-By-Space'!$AK$56,-1,0),$B89,'Interior - Space-By-Space'!$AM$16:OFFSET('Interior - Space-By-Space'!$AM$56,-1,0)),SUMIF('Interior - Space-By-Space'!$AO$16:OFFSET('Interior - Space-By-Space'!$AO$56,-1,0),$B89,'Interior - Space-By-Space'!$AQ$16:OFFSET('Interior - Space-By-Space'!$AQ$56,-1,0))),IF(ProjectMethod=BAM,SUM('Interior - Building Area Method'!$C100,'Interior - Building Area Method'!$E100,'Interior - Building Area Method'!$G100,'Interior - Building Area Method'!$I100,'Interior - Building Area Method'!$K100),0))+SUM(SUMIF(Exterior!$J$19:$J$69,$B89,Exterior!$K$19:$K$69),SUMIF(Exterior!$M$19:$M$69,$B89,Exterior!$N$19:$N$69),SUMIF(Exterior!$P$19:$P$69,$B89,Exterior!$Q$19:$Q$69),SUMIF(Exterior!$S$19:$S$69,$B89,Exterior!$T$19:$T$69),SUMIF(Exterior!$V$19:$V$69,$B89,Exterior!$W$19:$W$69))","v":0}]
[null,null,null,null,{"$f":"IF(ProjectMethod=SBS,SUM(SUMIF('Interior - Space-By-Space'!$M$16:OFFSET('Interior - Space-By-Space'!$M$56,-1,0),$B90,'Interior - Space-By-Space'!$O$16:OFFSET('Interior - Space-By-Space'!$O$56,-1,0)),SUMIF('Interior - Space-By-Space'!$Q$16:OFFSET('Interior - Space-By-Space'!$Q$56,-1,0),$B90,'Interior - Space-By-Space'!$S$16:OFFSET('Interior - Space-By-Space'!$S$56,-1,0)),SUMIF('Interior - Space-By-Space'!$U$16:OFFSET('Interior - Space-By-Space'!$U$56,-1,0),$B90,'Interior - Space-By-Space'!$W$16:OFFSET('Interior - Space-By-Space'!$W$56,-1,0)),SUMIF('Interior - Space-By-Space'!$Y$16:OFFSET('Interior - Space-By-Space'!$Y$56,-1,0),$B90,'Interior - Space-By-Space'!$AA$16:OFFSET('Interior - Space-By-Space'!$AA$56,-1,0)),SUMIF('Interior - Space-By-Space'!$AC$16:OFFSET('Interior - Space-By-Space'!$AC$56,-1,0),$B90,'Interior - Space-By-Space'!$AE$16:OFFSET('Interior - Space-By-Space'!$AE$56,-1,0)),SUMIF('Interior - Space-By-Space'!$AG$16:OFFSET('Interior - Space-By-Space'!$AG$56,-1,0),$B90,'Interior - Space-By-Space'!$AI$16:OFFSET('Interior - Space-By-Space'!$AI$56,-1,0)),SUMIF('Interior - Space-By-Space'!$AK$16:OFFSET('Interior - Space-By-Space'!$AK$56,-1,0),$B90,'Interior - Space-By-Space'!$AM$16:OFFSET('Interior - Space-By-Space'!$AM$56,-1,0)),SUMIF('Interior - Space-By-Space'!$AO$16:OFFSET('Interior - Space-By-Space'!$AO$56,-1,0),$B90,'Interior - Space-By-Space'!$AQ$16:OFFSET('Interior - Space-By-Space'!$AQ$56,-1,0))),IF(ProjectMethod=BAM,SUM('Interior - Building Area Method'!$C101,'Interior - Building Area Method'!$E101,'Interior - Building Area Method'!$G101,'Interior - Building Area Method'!$I101,'Interior - Building Area Method'!$K101),0))+SUM(SUMIF(Exterior!$J$19:$J$69,$B90,Exterior!$K$19:$K$69),SUMIF(Exterior!$M$19:$M$69,$B90,Exterior!$N$19:$N$69),SUMIF(Exterior!$P$19:$P$69,$B90,Exterior!$Q$19:$Q$69),SUMIF(Exterior!$S$19:$S$69,$B90,Exterior!$T$19:$T$69),SUMIF(Exterior!$V$19:$V$69,$B90,Exterior!$W$19:$W$69))","v":0}]
[null,null,null,null,{"$f":"IF(ProjectMethod=SBS,SUM(SUMIF('Interior - Space-By-Space'!$M$16:OFFSET('Interior - Space-By-Space'!$M$56,-1,0),$B91,'Interior - Space-By-Space'!$O$16:OFFSET('Interior - Space-By-Space'!$O$56,-1,0)),SUMIF('Interior - Space-By-Space'!$Q$16:OFFSET('Interior - Space-By-Space'!$Q$56,-1,0),$B91,'Interior - Space-By-Space'!$S$16:OFFSET('Interior - Space-By-Space'!$S$56,-1,0)),SUMIF('Interior - Space-By-Space'!$U$16:OFFSET('Interior - Space-By-Space'!$U$56,-1,0),$B91,'Interior - Space-By-Space'!$W$16:OFFSET('Interior - Space-By-Space'!$W$56,-1,0)),SUMIF('Interior - Space-By-Space'!$Y$16:OFFSET('Interior - Space-By-Space'!$Y$56,-1,0),$B91,'Interior - Space-By-Space'!$AA$16:OFFSET('Interior - Space-By-Space'!$AA$56,-1,0)),SUMIF('Interior - Space-By-Space'!$AC$16:OFFSET('Interior - Space-By-Space'!$AC$56,-1,0),$B91,'Interior - Space-By-Space'!$AE$16:OFFSET('Interior - Space-By-Space'!$AE$56,-1,0)),SUMIF('Interior - Space-By-Space'!$AG$16:OFFSET('Interior - Space-By-Space'!$AG$56,-1,0),$B91,'Interior - Space-By-Space'!$AI$16:OFFSET('Interior - Space-By-Space'!$AI$56,-1,0)),SUMIF('Interior - Space-By-Space'!$AK$16:OFFSET('Interior - Space-By-Space'!$AK$56,-1,0),$B91,'Interior - Space-By-Space'!$AM$16:OFFSET('Interior - Space-By-Space'!$AM$56,-1,0)),SUMIF('Interior - Space-By-Space'!$AO$16:OFFSET('Interior - Space-By-Space'!$AO$56,-1,0),$B91,'Interior - Space-By-Space'!$AQ$16:OFFSET('Interior - Space-By-Space'!$AQ$56,-1,0))),IF(ProjectMethod=BAM,SUM('Interior - Building Area Method'!$C102,'Interior - Building Area Method'!$E102,'Interior - Building Area Method'!$G102,'Interior - Building Area Method'!$I102,'Interior - Building Area Method'!$K102),0))+SUM(SUMIF(Exterior!$J$19:$J$69,$B91,Exterior!$K$19:$K$69),SUMIF(Exterior!$M$19:$M$69,$B91,Exterior!$N$19:$N$69),SUMIF(Exterior!$P$19:$P$69,$B91,Exterior!$Q$19:$Q$69),SUMIF(Exterior!$S$19:$S$69,$B91,Exterior!$T$19:$T$69),SUMIF(Exterior!$V$19:$V$69,$B91,Exterior!$W$19:$W$69))","v":0}]
[null,null,null,null,{"$f":"IF(ProjectMethod=SBS,SUM(SUMIF('Interior - Space-By-Space'!$M$16:OFFSET('Interior - Space-By-Space'!$M$56,-1,0),$B92,'Interior - Space-By-Space'!$O$16:OFFSET('Interior - Space-By-Space'!$O$56,-1,0)),SUMIF('Interior - Space-By-Space'!$Q$16:OFFSET('Interior - Space-By-Space'!$Q$56,-1,0),$B92,'Interior - Space-By-Space'!$S$16:OFFSET('Interior - Space-By-Space'!$S$56,-1,0)),SUMIF('Interior - Space-By-Space'!$U$16:OFFSET('Interior - Space-By-Space'!$U$56,-1,0),$B92,'Interior - Space-By-Space'!$W$16:OFFSET('Interior - Space-By-Space'!$W$56,-1,0)),SUMIF('Interior - Space-By-Space'!$Y$16:OFFSET('Interior - Space-By-Space'!$Y$56,-1,0),$B92,'Interior - Space-By-Space'!$AA$16:OFFSET('Interior - Space-By-Space'!$AA$56,-1,0)),SUMIF('Interior - Space-By-Space'!$AC$16:OFFSET('Interior - Space-By-Space'!$AC$56,-1,0),$B92,'Interior - Space-By-Space'!$AE$16:OFFSET('Interior - Space-By-Space'!$AE$56,-1,0)),SUMIF('Interior - Space-By-Space'!$AG$16:OFFSET('Interior - Space-By-Space'!$AG$56,-1,0),$B92,'Interior - Space-By-Space'!$AI$16:OFFSET('Interior - Space-By-Space'!$AI$56,-1,0)),SUMIF('Interior - Space-By-Space'!$AK$16:OFFSET('Interior - Space-By-Space'!$AK$56,-1,0),$B92,'Interior - Space-By-Space'!$AM$16:OFFSET('Interior - Space-By-Space'!$AM$56,-1,0)),SUMIF('Interior - Space-By-Space'!$AO$16:OFFSET('Interior - Space-By-Space'!$AO$56,-1,0),$B92,'Interior - Space-By-Space'!$AQ$16:OFFSET('Interior - Space-By-Space'!$AQ$56,-1,0))),IF(ProjectMethod=BAM,SUM('Interior - Building Area Method'!$C103,'Interior - Building Area Method'!$E103,'Interior - Building Area Method'!$G103,'Interior - Building Area Method'!$I103,'Interior - Building Area Method'!$K103),0))+SUM(SUMIF(Exterior!$J$19:$J$69,$B92,Exterior!$K$19:$K$69),SUMIF(Exterior!$M$19:$M$69,$B92,Exterior!$N$19:$N$69),SUMIF(Exterior!$P$19:$P$69,$B92,Exterior!$Q$19:$Q$69),SUMIF(Exterior!$S$19:$S$69,$B92,Exterior!$T$19:$T$69),SUMIF(Exterior!$V$19:$V$69,$B92,Exterior!$W$19:$W$69))","v":0}]
[null,null,null,null,{"$f":"IF(ProjectMethod=SBS,SUM(SUMIF('Interior - Space-By-Space'!$M$16:OFFSET('Interior - Space-By-Space'!$M$56,-1,0),$B93,'Interior - Space-By-Space'!$O$16:OFFSET('Interior - Space-By-Space'!$O$56,-1,0)),SUMIF('Interior - Space-By-Space'!$Q$16:OFFSET('Interior - Space-By-Space'!$Q$56,-1,0),$B93,'Interior - Space-By-Space'!$S$16:OFFSET('Interior - Space-By-Space'!$S$56,-1,0)),SUMIF('Interior - Space-By-Space'!$U$16:OFFSET('Interior - Space-By-Space'!$U$56,-1,0),$B93,'Interior - Space-By-Space'!$W$16:OFFSET('Interior - Space-By-Space'!$W$56,-1,0)),SUMIF('Interior - Space-By-Space'!$Y$16:OFFSET('Interior - Space-By-Space'!$Y$56,-1,0),$B93,'Interior - Space-By-Space'!$AA$16:OFFSET('Interior - Space-By-Space'!$AA$56,-1,0)),SUMIF('Interior - Space-By-Space'!$AC$16:OFFSET('Interior - Space-By-Space'!$AC$56,-1,0),$B93,'Interior - Space-By-Space'!$AE$16:OFFSET('Interior - Space-By-Space'!$AE$56,-1,0)),SUMIF('Interior - Space-By-Space'!$AG$16:OFFSET('Interior - Space-By-Space'!$AG$56,-1,0),$B93,'Interior - Space-By-Space'!$AI$16:OFFSET('Interior - Space-By-Space'!$AI$56,-1,0)),SUMIF('Interior - Space-By-Space'!$AK$16:OFFSET('Interior - Space-By-Space'!$AK$56,-1,0),$B93,'Interior - Space-By-Space'!$AM$16:OFFSET('Interior - Space-By-Space'!$AM$56,-1,0)),SUMIF('Interior - Space-By-Space'!$AO$16:OFFSET('Interior - Space-By-Space'!$AO$56,-1,0),$B93,'Interior - Space-By-Space'!$AQ$16:OFFSET('Interior - Space-By-Space'!$AQ$56,-1,0))),IF(ProjectMethod=BAM,SUM('Interior - Building Area Method'!$C104,'Interior - Building Area Method'!$E104,'Interior - Building Area Method'!$G104,'Interior - Building Area Method'!$I104,'Interior - Building Area Method'!$K104),0))+SUM(SUMIF(Exterior!$J$19:$J$69,$B93,Exterior!$K$19:$K$69),SUMIF(Exterior!$M$19:$M$69,$B93,Exterior!$N$19:$N$69),SUMIF(Exterior!$P$19:$P$69,$B93,Exterior!$Q$19:$Q$69),SUMIF(Exterior!$S$19:$S$69,$B93,Exterior!$T$19:$T$69),SUMIF(Exterior!$V$19:$V$69,$B93,Exterior!$W$19:$W$69))","v":0}]
[null,null,null,null,{"$f":"IF(ProjectMethod=SBS,SUM(SUMIF('Interior - Space-By-Space'!$M$16:OFFSET('Interior - Space-By-Space'!$M$56,-1,0),$B94,'Interior - Space-By-Space'!$O$16:OFFSET('Interior - Space-By-Space'!$O$56,-1,0)),SUMIF('Interior - Space-By-Space'!$Q$16:OFFSET('Interior - Space-By-Space'!$Q$56,-1,0),$B94,'Interior - Space-By-Space'!$S$16:OFFSET('Interior - Space-By-Space'!$S$56,-1,0)),SUMIF('Interior - Space-By-Space'!$U$16:OFFSET('Interior - Space-By-Space'!$U$56,-1,0),$B94,'Interior - Space-By-Space'!$W$16:OFFSET('Interior - Space-By-Space'!$W$56,-1,0)),SUMIF('Interior - Space-By-Space'!$Y$16:OFFSET('Interior - Space-By-Space'!$Y$56,-1,0),$B94,'Interior - Space-By-Space'!$AA$16:OFFSET('Interior - Space-By-Space'!$AA$56,-1,0)),SUMIF('Interior - Space-By-Space'!$AC$16:OFFSET('Interior - Space-By-Space'!$AC$56,-1,0),$B94,'Interior - Space-By-Space'!$AE$16:OFFSET('Interior - Space-By-Space'!$AE$56,-1,0)),SUMIF('Interior - Space-By-Space'!$AG$16:OFFSET('Interior - Space-By-Space'!$AG$56,-1,0),$B94,'Interior - Space-By-Space'!$AI$16:OFFSET('Interior - Space-By-Space'!$AI$56,-1,0)),SUMIF('Interior - Space-By-Space'!$AK$16:OFFSET('Interior - Space-By-Space'!$AK$56,-1,0),$B94,'Interior - Space-By-Space'!$AM$16:OFFSET('Interior - Space-By-Space'!$AM$56,-1,0)),SUMIF('Interior - Space-By-Space'!$AO$16:OFFSET('Interior - Space-By-Space'!$AO$56,-1,0),$B94,'Interior - Space-By-Space'!$AQ$16:OFFSET('Interior - Space-By-Space'!$AQ$56,-1,0))),IF(ProjectMethod=BAM,SUM('Interior - Building Area Method'!$C105,'Interior - Building Area Method'!$E105,'Interior - Building Area Method'!$G105,'Interior - Building Area Method'!$I105,'Interior - Building Area Method'!$K105),0))+SUM(SUMIF(Exterior!$J$19:$J$69,$B94,Exterior!$K$19:$K$69),SUMIF(Exterior!$M$19:$M$69,$B94,Exterior!$N$19:$N$69),SUMIF(Exterior!$P$19:$P$69,$B94,Exterior!$Q$19:$Q$69),SUMIF(Exterior!$S$19:$S$69,$B94,Exterior!$T$19:$T$69),SUMIF(Exterior!$V$19:$V$69,$B94,Exterior!$W$19:$W$69))","v":0}]
[null,null,null,null,{"$f":"IF(ProjectMethod=SBS,SUM(SUMIF('Interior - Space-By-Space'!$M$16:OFFSET('Interior - Space-By-Space'!$M$56,-1,0),$B95,'Interior - Space-By-Space'!$O$16:OFFSET('Interior - Space-By-Space'!$O$56,-1,0)),SUMIF('Interior - Space-By-Space'!$Q$16:OFFSET('Interior - Space-By-Space'!$Q$56,-1,0),$B95,'Interior - Space-By-Space'!$S$16:OFFSET('Interior - Space-By-Space'!$S$56,-1,0)),SUMIF('Interior - Space-By-Space'!$U$16:OFFSET('Interior - Space-By-Space'!$U$56,-1,0),$B95,'Interior - Space-By-Space'!$W$16:OFFSET('Interior - Space-By-Space'!$W$56,-1,0)),SUMIF('Interior - Space-By-Space'!$Y$16:OFFSET('Interior - Space-By-Space'!$Y$56,-1,0),$B95,'Interior - Space-By-Space'!$AA$16:OFFSET('Interior - Space-By-Space'!$AA$56,-1,0)),SUMIF('Interior - Space-By-Space'!$AC$16:OFFSET('Interior - Space-By-Space'!$AC$56,-1,0),$B95,'Interior - Space-By-Space'!$AE$16:OFFSET('Interior - Space-By-Space'!$AE$56,-1,0)),SUMIF('Interior - Space-By-Space'!$AG$16:OFFSET('Interior - Space-By-Space'!$AG$56,-1,0),$B95,'Interior - Space-By-Space'!$AI$16:OFFSET('Interior - Space-By-Space'!$AI$56,-1,0)),SUMIF('Interior - Space-By-Space'!$AK$16:OFFSET('Interior - Space-By-Space'!$AK$56,-1,0),$B95,'Interior - Space-By-Space'!$AM$16:OFFSET('Interior - Space-By-Space'!$AM$56,-1,0)),SUMIF('Interior - Space-By-Space'!$AO$16:OFFSET('Interior - Space-By-Space'!$AO$56,-1,0),$B95,'Interior - Space-By-Space'!$AQ$16:OFFSET('Interior - Space-By-Space'!$AQ$56,-1,0))),IF(ProjectMethod=BAM,SUM('Interior - Building Area Method'!$C106,'Interior - Building Area Method'!$E106,'Interior - Building Area Method'!$G106,'Interior - Building Area Method'!$I106,'Interior - Building Area Method'!$K106),0))+SUM(SUMIF(Exterior!$J$19:$J$69,$B95,Exterior!$K$19:$K$69),SUMIF(Exterior!$M$19:$M$69,$B95,Exterior!$N$19:$N$69),SUMIF(Exterior!$P$19:$P$69,$B95,Exterior!$Q$19:$Q$69),SUMIF(Exterior!$S$19:$S$69,$B95,Exterior!$T$19:$T$69),SUMIF(Exterior!$V$19:$V$69,$B95,Exterior!$W$19:$W$69))","v":0}]
[null,null,null,null,{"$f":"IF(ProjectMethod=SBS,SUM(SUMIF('Interior - Space-By-Space'!$M$16:OFFSET('Interior - Space-By-Space'!$M$56,-1,0),$B96,'Interior - Space-By-Space'!$O$16:OFFSET('Interior - Space-By-Space'!$O$56,-1,0)),SUMIF('Interior - Space-By-Space'!$Q$16:OFFSET('Interior - Space-By-Space'!$Q$56,-1,0),$B96,'Interior - Space-By-Space'!$S$16:OFFSET('Interior - Space-By-Space'!$S$56,-1,0)),SUMIF('Interior - Space-By-Space'!$U$16:OFFSET('Interior - Space-By-Space'!$U$56,-1,0),$B96,'Interior - Space-By-Space'!$W$16:OFFSET('Interior - Space-By-Space'!$W$56,-1,0)),SUMIF('Interior - Space-By-Space'!$Y$16:OFFSET('Interior - Space-By-Space'!$Y$56,-1,0),$B96,'Interior - Space-By-Space'!$AA$16:OFFSET('Interior - Space-By-Space'!$AA$56,-1,0)),SUMIF('Interior - Space-By-Space'!$AC$16:OFFSET('Interior - Space-By-Space'!$AC$56,-1,0),$B96,'Interior - Space-By-Space'!$AE$16:OFFSET('Interior - Space-By-Space'!$AE$56,-1,0)),SUMIF('Interior - Space-By-Space'!$AG$16:OFFSET('Interior - Space-By-Space'!$AG$56,-1,0),$B96,'Interior - Space-By-Space'!$AI$16:OFFSET('Interior - Space-By-Space'!$AI$56,-1,0)),SUMIF('Interior - Space-By-Space'!$AK$16:OFFSET('Interior - Space-By-Space'!$AK$56,-1,0),$B96,'Interior - Space-By-Space'!$AM$16:OFFSET('Interior - Space-By-Space'!$AM$56,-1,0)),SUMIF('Interior - Space-By-Space'!$AO$16:OFFSET('Interior - Space-By-Space'!$AO$56,-1,0),$B96,'Interior - Space-By-Space'!$AQ$16:OFFSET('Interior - Space-By-Space'!$AQ$56,-1,0))),IF(ProjectMethod=BAM,SUM('Interior - Building Area Method'!$C107,'Interior - Building Area Method'!$E107,'Interior - Building Area Method'!$G107,'Interior - Building Area Method'!$I107,'Interior - Building Area Method'!$K107),0))+SUM(SUMIF(Exterior!$J$19:$J$69,$B96,Exterior!$K$19:$K$69),SUMIF(Exterior!$M$19:$M$69,$B96,Exterior!$N$19:$N$69),SUMIF(Exterior!$P$19:$P$69,$B96,Exterior!$Q$19:$Q$69),SUMIF(Exterior!$S$19:$S$69,$B96,Exterior!$T$19:$T$69),SUMIF(Exterior!$V$19:$V$69,$B96,Exterior!$W$19:$W$69))","v":0}]
[null,null,null,null,{"$f":"IF(ProjectMethod=SBS,SUM(SUMIF('Interior - Space-By-Space'!$M$16:OFFSET('Interior - Space-By-Space'!$M$56,-1,0),$B97,'Interior - Space-By-Space'!$O$16:OFFSET('Interior - Space-By-Space'!$O$56,-1,0)),SUMIF('Interior - Space-By-Space'!$Q$16:OFFSET('Interior - Space-By-Space'!$Q$56,-1,0),$B97,'Interior - Space-By-Space'!$S$16:OFFSET('Interior - Space-By-Space'!$S$56,-1,0)),SUMIF('Interior - Space-By-Space'!$U$16:OFFSET('Interior - Space-By-Space'!$U$56,-1,0),$B97,'Interior - Space-By-Space'!$W$16:OFFSET('Interior - Space-By-Space'!$W$56,-1,0)),SUMIF('Interior - Space-By-Space'!$Y$16:OFFSET('Interior - Space-By-Space'!$Y$56,-1,0),$B97,'Interior - Space-By-Space'!$AA$16:OFFSET('Interior - Space-By-Space'!$AA$56,-1,0)),SUMIF('Interior - Space-By-Space'!$AC$16:OFFSET('Interior - Space-By-Space'!$AC$56,-1,0),$B97,'Interior - Space-By-Space'!$AE$16:OFFSET('Interior - Space-By-Space'!$AE$56,-1,0)),SUMIF('Interior - Space-By-Space'!$AG$16:OFFSET('Interior - Space-By-Space'!$AG$56,-1,0),$B97,'Interior - Space-By-Space'!$AI$16:OFFSET('Interior - Space-By-Space'!$AI$56,-1,0)),SUMIF('Interior - Space-By-Space'!$AK$16:OFFSET('Interior - Space-By-Space'!$AK$56,-1,0),$B97,'Interior - Space-By-Space'!$AM$16:OFFSET('Interior - Space-By-Space'!$AM$56,-1,0)),SUMIF('Interior - Space-By-Space'!$AO$16:OFFSET('Interior - Space-By-Space'!$AO$56,-1,0),$B97,'Interior - Space-By-Space'!$AQ$16:OFFSET('Interior - Space-By-Space'!$AQ$56,-1,0))),IF(ProjectMethod=BAM,SUM('Interior - Building Area Method'!$C108,'Interior - Building Area Method'!$E108,'Interior - Building Area Method'!$G108,'Interior - Building Area Method'!$I108,'Interior - Building Area Method'!$K108),0))+SUM(SUMIF(Exterior!$J$19:$J$69,$B97,Exterior!$K$19:$K$69),SUMIF(Exterior!$M$19:$M$69,$B97,Exterior!$N$19:$N$69),SUMIF(Exterior!$P$19:$P$69,$B97,Exterior!$Q$19:$Q$69),SUMIF(Exterior!$S$19:$S$69,$B97,Exterior!$T$19:$T$69),SUMIF(Exterior!$V$19:$V$69,$B97,Exterior!$W$19:$W$69))","v":0}]
[null,null,null,null,{"$f":"IF(ProjectMethod=SBS,SUM(SUMIF('Interior - Space-By-Space'!$M$16:OFFSET('Interior - Space-By-Space'!$M$56,-1,0),$B98,'Interior - Space-By-Space'!$O$16:OFFSET('Interior - Space-By-Space'!$O$56,-1,0)),SUMIF('Interior - Space-By-Space'!$Q$16:OFFSET('Interior - Space-By-Space'!$Q$56,-1,0),$B98,'Interior - Space-By-Space'!$S$16:OFFSET('Interior - Space-By-Space'!$S$56,-1,0)),SUMIF('Interior - Space-By-Space'!$U$16:OFFSET('Interior - Space-By-Space'!$U$56,-1,0),$B98,'Interior - Space-By-Space'!$W$16:OFFSET('Interior - Space-By-Space'!$W$56,-1,0)),SUMIF('Interior - Space-By-Space'!$Y$16:OFFSET('Interior - Space-By-Space'!$Y$56,-1,0),$B98,'Interior - Space-By-Space'!$AA$16:OFFSET('Interior - Space-By-Space'!$AA$56,-1,0)),SUMIF('Interior - Space-By-Space'!$AC$16:OFFSET('Interior - Space-By-Space'!$AC$56,-1,0),$B98,'Interior - Space-By-Space'!$AE$16:OFFSET('Interior - Space-By-Space'!$AE$56,-1,0)),SUMIF('Interior - Space-By-Space'!$AG$16:OFFSET('Interior - Space-By-Space'!$AG$56,-1,0),$B98,'Interior - Space-By-Space'!$AI$16:OFFSET('Interior - Space-By-Space'!$AI$56,-1,0)),SUMIF('Interior - Space-By-Space'!$AK$16:OFFSET('Interior - Space-By-Space'!$AK$56,-1,0),$B98,'Interior - Space-By-Space'!$AM$16:OFFSET('Interior - Space-By-Space'!$AM$56,-1,0)),SUMIF('Interior - Space-By-Space'!$AO$16:OFFSET('Interior - Space-By-Space'!$AO$56,-1,0),$B98,'Interior - Space-By-Space'!$AQ$16:OFFSET('Interior - Space-By-Space'!$AQ$56,-1,0))),IF(ProjectMethod=BAM,SUM('Interior - Building Area Method'!$C109,'Interior - Building Area Method'!$E109,'Interior - Building Area Method'!$G109,'Interior - Building Area Method'!$I109,'Interior - Building Area Method'!$K109),0))+SUM(SUMIF(Exterior!$J$19:$J$69,$B98,Exterior!$K$19:$K$69),SUMIF(Exterior!$M$19:$M$69,$B98,Exterior!$N$19:$N$69),SUMIF(Exterior!$P$19:$P$69,$B98,Exterior!$Q$19:$Q$69),SUMIF(Exterior!$S$19:$S$69,$B98,Exterior!$T$19:$T$69),SUMIF(Exterior!$V$19:$V$69,$B98,Exterior!$W$19:$W$69))","v":0}]
[null,null,null,null,{"$f":"IF(ProjectMethod=SBS,SUM(SUMIF('Interior - Space-By-Space'!$M$16:OFFSET('Interior - Space-By-Space'!$M$56,-1,0),$B99,'Interior - Space-By-Space'!$O$16:OFFSET('Interior - Space-By-Space'!$O$56,-1,0)),SUMIF('Interior - Space-By-Space'!$Q$16:OFFSET('Interior - Space-By-Space'!$Q$56,-1,0),$B99,'Interior - Space-By-Space'!$S$16:OFFSET('Interior - Space-By-Space'!$S$56,-1,0)),SUMIF('Interior - Space-By-Space'!$U$16:OFFSET('Interior - Space-By-Space'!$U$56,-1,0),$B99,'Interior - Space-By-Space'!$W$16:OFFSET('Interior - Space-By-Space'!$W$56,-1,0)),SUMIF('Interior - Space-By-Space'!$Y$16:OFFSET('Interior - Space-By-Space'!$Y$56,-1,0),$B99,'Interior - Space-By-Space'!$AA$16:OFFSET('Interior - Space-By-Space'!$AA$56,-1,0)),SUMIF('Interior - Space-By-Space'!$AC$16:OFFSET('Interior - Space-By-Space'!$AC$56,-1,0),$B99,'Interior - Space-By-Space'!$AE$16:OFFSET('Interior - Space-By-Space'!$AE$56,-1,0)),SUMIF('Interior - Space-By-Space'!$AG$16:OFFSET('Interior - Space-By-Space'!$AG$56,-1,0),$B99,'Interior - Space-By-Space'!$AI$16:OFFSET('Interior - Space-By-Space'!$AI$56,-1,0)),SUMIF('Interior - Space-By-Space'!$AK$16:OFFSET('Interior - Space-By-Space'!$AK$56,-1,0),$B99,'Interior - Space-By-Space'!$AM$16:OFFSET('Interior - Space-By-Space'!$AM$56,-1,0)),SUMIF('Interior - Space-By-Space'!$AO$16:OFFSET('Interior - Space-By-Space'!$AO$56,-1,0),$B99,'Interior - Space-By-Space'!$AQ$16:OFFSET('Interior - Space-By-Space'!$AQ$56,-1,0))),IF(ProjectMethod=BAM,SUM('Interior - Building Area Method'!$C110,'Interior - Building Area Method'!$E110,'Interior - Building Area Method'!$G110,'Interior - Building Area Method'!$I110,'Interior - Building Area Method'!$K110),0))+SUM(SUMIF(Exterior!$J$19:$J$69,$B99,Exterior!$K$19:$K$69),SUMIF(Exterior!$M$19:$M$69,$B99,Exterior!$N$19:$N$69),SUMIF(Exterior!$P$19:$P$69,$B99,Exterior!$Q$19:$Q$69),SUMIF(Exterior!$S$19:$S$69,$B99,Exterior!$T$19:$T$69),SUMIF(Exterior!$V$19:$V$69,$B99,Exterior!$W$19:$W$69))","v":0}]
[null,null,null,null,{"$f":"IF(ProjectMethod=SBS,SUM(SUMIF('Interior - Space-By-Space'!$M$16:OFFSET('Interior - Space-By-Space'!$M$56,-1,0),$B100,'Interior - Space-By-Space'!$O$16:OFFSET('Interior - Space-By-Space'!$O$56,-1,0)),SUMIF('Interior - Space-By-Space'!$Q$16:OFFSET('Interior - Space-By-Space'!$Q$56,-1,0),$B100,'Interior - Space-By-Space'!$S$16:OFFSET('Interior - Space-By-Space'!$S$56,-1,0)),SUMIF('Interior - Space-By-Space'!$U$16:OFFSET('Interior - Space-By-Space'!$U$56,-1,0),$B100,'Interior - Space-By-Space'!$W$16:OFFSET('Interior - Space-By-Space'!$W$56,-1,0)),SUMIF('Interior - Space-By-Space'!$Y$16:OFFSET('Interior - Space-By-Space'!$Y$56,-1,0),$B100,'Interior - Space-By-Space'!$AA$16:OFFSET('Interior - Space-By-Space'!$AA$56,-1,0)),SUMIF('Interior - Space-By-Space'!$AC$16:OFFSET('Interior - Space-By-Space'!$AC$56,-1,0),$B100,'Interior - Space-By-Space'!$AE$16:OFFSET('Interior - Space-By-Space'!$AE$56,-1,0)),SUMIF('Interior - Space-By-Space'!$AG$16:OFFSET('Interior - Space-By-Space'!$AG$56,-1,0),$B100,'Interior - Space-By-Space'!$AI$16:OFFSET('Interior - Space-By-Space'!$AI$56,-1,0)),SUMIF('Interior - Space-By-Space'!$AK$16:OFFSET('Interior - Space-By-Space'!$AK$56,-1,0),$B100,'Interior - Space-By-Space'!$AM$16:OFFSET('Interior - Space-By-Space'!$AM$56,-1,0)),SUMIF('Interior - Space-By-Space'!$AO$16:OFFSET('Interior - Space-By-Space'!$AO$56,-1,0),$B100,'Interior - Space-By-Space'!$AQ$16:OFFSET('Interior - Space-By-Space'!$AQ$56,-1,0))),IF(ProjectMethod=BAM,SUM('Interior - Building Area Method'!$C111,'Interior - Building Area Method'!$E111,'Interior - Building Area Method'!$G111,'Interior - Building Area Method'!$I111,'Interior - Building Area Method'!$K111),0))+SUM(SUMIF(Exterior!$J$19:$J$69,$B100,Exterior!$K$19:$K$69),SUMIF(Exterior!$M$19:$M$69,$B100,Exterior!$N$19:$N$69),SUMIF(Exterior!$P$19:$P$69,$B100,Exterior!$Q$19:$Q$69),SUMIF(Exterior!$S$19:$S$69,$B100,Exterior!$T$19:$T$69),SUMIF(Exterior!$V$19:$V$69,$B100,Exterior!$W$19:$W$69))","v":0}]
[null,null,null,null,{"$f":"IF(ProjectMethod=SBS,SUM(SUMIF('Interior - Space-By-Space'!$M$16:OFFSET('Interior - Space-By-Space'!$M$56,-1,0),$B101,'Interior - Space-By-Space'!$O$16:OFFSET('Interior - Space-By-Space'!$O$56,-1,0)),SUMIF('Interior - Space-By-Space'!$Q$16:OFFSET('Interior - Space-By-Space'!$Q$56,-1,0),$B101,'Interior - Space-By-Space'!$S$16:OFFSET('Interior - Space-By-Space'!$S$56,-1,0)),SUMIF('Interior - Space-By-Space'!$U$16:OFFSET('Interior - Space-By-Space'!$U$56,-1,0),$B101,'Interior - Space-By-Space'!$W$16:OFFSET('Interior - Space-By-Space'!$W$56,-1,0)),SUMIF('Interior - Space-By-Space'!$Y$16:OFFSET('Interior - Space-By-Space'!$Y$56,-1,0),$B101,'Interior - Space-By-Space'!$AA$16:OFFSET('Interior - Space-By-Space'!$AA$56,-1,0)),SUMIF('Interior - Space-By-Space'!$AC$16:OFFSET('Interior - Space-By-Space'!$AC$56,-1,0),$B101,'Interior - Space-By-Space'!$AE$16:OFFSET('Interior - Space-By-Space'!$AE$56,-1,0)),SUMIF('Interior - Space-By-Space'!$AG$16:OFFSET('Interior - Space-By-Space'!$AG$56,-1,0),$B101,'Interior - Space-By-Space'!$AI$16:OFFSET('Interior - Space-By-Space'!$AI$56,-1,0)),SUMIF('Interior - Space-By-Space'!$AK$16:OFFSET('Interior - Space-By-Space'!$AK$56,-1,0),$B101,'Interior - Space-By-Space'!$AM$16:OFFSET('Interior - Space-By-Space'!$AM$56,-1,0)),SUMIF('Interior - Space-By-Space'!$AO$16:OFFSET('Interior - Space-By-Space'!$AO$56,-1,0),$B101,'Interior - Space-By-Space'!$AQ$16:OFFSET('Interior - Space-By-Space'!$AQ$56,-1,0))),IF(ProjectMethod=BAM,SUM('Interior - Building Area Method'!$C112,'Interior - Building Area Method'!$E112,'Interior - Building Area Method'!$G112,'Interior - Building Area Method'!$I112,'Interior - Building Area Method'!$K112),0))+SUM(SUMIF(Exterior!$J$19:$J$69,$B101,Exterior!$K$19:$K$69),SUMIF(Exterior!$M$19:$M$69,$B101,Exterior!$N$19:$N$69),SUMIF(Exterior!$P$19:$P$69,$B101,Exterior!$Q$19:$Q$69),SUMIF(Exterior!$S$19:$S$69,$B101,Exterior!$T$19:$T$69),SUMIF(Exterior!$V$19:$V$69,$B101,Exterior!$W$19:$W$69))","v":0}]
[null,null,null,null,{"$f":"IF(ProjectMethod=SBS,SUM(SUMIF('Interior - Space-By-Space'!$M$16:OFFSET('Interior - Space-By-Space'!$M$56,-1,0),$B102,'Interior - Space-By-Space'!$O$16:OFFSET('Interior - Space-By-Space'!$O$56,-1,0)),SUMIF('Interior - Space-By-Space'!$Q$16:OFFSET('Interior - Space-By-Space'!$Q$56,-1,0),$B102,'Interior - Space-By-Space'!$S$16:OFFSET('Interior - Space-By-Space'!$S$56,-1,0)),SUMIF('Interior - Space-By-Space'!$U$16:OFFSET('Interior - Space-By-Space'!$U$56,-1,0),$B102,'Interior - Space-By-Space'!$W$16:OFFSET('Interior - Space-By-Space'!$W$56,-1,0)),SUMIF('Interior - Space-By-Space'!$Y$16:OFFSET('Interior - Space-By-Space'!$Y$56,-1,0),$B102,'Interior - Space-By-Space'!$AA$16:OFFSET('Interior - Space-By-Space'!$AA$56,-1,0)),SUMIF('Interior - Space-By-Space'!$AC$16:OFFSET('Interior - Space-By-Space'!$AC$56,-1,0),$B102,'Interior - Space-By-Space'!$AE$16:OFFSET('Interior - Space-By-Space'!$AE$56,-1,0)),SUMIF('Interior - Space-By-Space'!$AG$16:OFFSET('Interior - Space-By-Space'!$AG$56,-1,0),$B102,'Interior - Space-By-Space'!$AI$16:OFFSET('Interior - Space-By-Space'!$AI$56,-1,0)),SUMIF('Interior - Space-By-Space'!$AK$16:OFFSET('Interior - Space-By-Space'!$AK$56,-1,0),$B102,'Interior - Space-By-Space'!$AM$16:OFFSET('Interior - Space-By-Space'!$AM$56,-1,0)),SUMIF('Interior - Space-By-Space'!$AO$16:OFFSET('Interior - Space-By-Space'!$AO$56,-1,0),$B102,'Interior - Space-By-Space'!$AQ$16:OFFSET('Interior - Space-By-Space'!$AQ$56,-1,0))),IF(ProjectMethod=BAM,SUM('Interior - Building Area Method'!$C113,'Interior - Building Area Method'!$E113,'Interior - Building Area Method'!$G113,'Interior - Building Area Method'!$I113,'Interior - Building Area Method'!$K113),0))+SUM(SUMIF(Exterior!$J$19:$J$69,$B102,Exterior!$K$19:$K$69),SUMIF(Exterior!$M$19:$M$69,$B102,Exterior!$N$19:$N$69),SUMIF(Exterior!$P$19:$P$69,$B102,Exterior!$Q$19:$Q$69),SUMIF(Exterior!$S$19:$S$69,$B102,Exterior!$T$19:$T$69),SUMIF(Exterior!$V$19:$V$69,$B102,Exterior!$W$19:$W$69))","v":0}]
[null,null,null,null,{"$f":"IF(ProjectMethod=SBS,SUM(SUMIF('Interior - Space-By-Space'!$M$16:OFFSET('Interior - Space-By-Space'!$M$56,-1,0),$B103,'Interior - Space-By-Space'!$O$16:OFFSET('Interior - Space-By-Space'!$O$56,-1,0)),SUMIF('Interior - Space-By-Space'!$Q$16:OFFSET('Interior - Space-By-Space'!$Q$56,-1,0),$B103,'Interior - Space-By-Space'!$S$16:OFFSET('Interior - Space-By-Space'!$S$56,-1,0)),SUMIF('Interior - Space-By-Space'!$U$16:OFFSET('Interior - Space-By-Space'!$U$56,-1,0),$B103,'Interior - Space-By-Space'!$W$16:OFFSET('Interior - Space-By-Space'!$W$56,-1,0)),SUMIF('Interior - Space-By-Space'!$Y$16:OFFSET('Interior - Space-By-Space'!$Y$56,-1,0),$B103,'Interior - Space-By-Space'!$AA$16:OFFSET('Interior - Space-By-Space'!$AA$56,-1,0)),SUMIF('Interior - Space-By-Space'!$AC$16:OFFSET('Interior - Space-By-Space'!$AC$56,-1,0),$B103,'Interior - Space-By-Space'!$AE$16:OFFSET('Interior - Space-By-Space'!$AE$56,-1,0)),SUMIF('Interior - Space-By-Space'!$AG$16:OFFSET('Interior - Space-By-Space'!$AG$56,-1,0),$B103,'Interior - Space-By-Space'!$AI$16:OFFSET('Interior - Space-By-Space'!$AI$56,-1,0)),SUMIF('Interior - Space-By-Space'!$AK$16:OFFSET('Interior - Space-By-Space'!$AK$56,-1,0),$B103,'Interior - Space-By-Space'!$AM$16:OFFSET('Interior - Space-By-Space'!$AM$56,-1,0)),SUMIF('Interior - Space-By-Space'!$AO$16:OFFSET('Interior - Space-By-Space'!$AO$56,-1,0),$B103,'Interior - Space-By-Space'!$AQ$16:OFFSET('Interior - Space-By-Space'!$AQ$56,-1,0))),IF(ProjectMethod=BAM,SUM('Interior - Building Area Method'!$C114,'Interior - Building Area Method'!$E114,'Interior - Building Area Method'!$G114,'Interior - Building Area Method'!$I114,'Interior - Building Area Method'!$K114),0))+SUM(SUMIF(Exterior!$J$19:$J$69,$B103,Exterior!$K$19:$K$69),SUMIF(Exterior!$M$19:$M$69,$B103,Exterior!$N$19:$N$69),SUMIF(Exterior!$P$19:$P$69,$B103,Exterior!$Q$19:$Q$69),SUMIF(Exterior!$S$19:$S$69,$B103,Exterior!$T$19:$T$69),SUMIF(Exterior!$V$19:$V$69,$B103,Exterior!$W$19:$W$69))","v":0}]
[null,null,null,null,{"$f":"IF(ProjectMethod=SBS,SUM(SUMIF('Interior - Space-By-Space'!$M$16:OFFSET('Interior - Space-By-Space'!$M$56,-1,0),$B104,'Interior - Space-By-Space'!$O$16:OFFSET('Interior - Space-By-Space'!$O$56,-1,0)),SUMIF('Interior - Space-By-Space'!$Q$16:OFFSET('Interior - Space-By-Space'!$Q$56,-1,0),$B104,'Interior - Space-By-Space'!$S$16:OFFSET('Interior - Space-By-Space'!$S$56,-1,0)),SUMIF('Interior - Space-By-Space'!$U$16:OFFSET('Interior - Space-By-Space'!$U$56,-1,0),$B104,'Interior - Space-By-Space'!$W$16:OFFSET('Interior - Space-By-Space'!$W$56,-1,0)),SUMIF('Interior - Space-By-Space'!$Y$16:OFFSET('Interior - Space-By-Space'!$Y$56,-1,0),$B104,'Interior - Space-By-Space'!$AA$16:OFFSET('Interior - Space-By-Space'!$AA$56,-1,0)),SUMIF('Interior - Space-By-Space'!$AC$16:OFFSET('Interior - Space-By-Space'!$AC$56,-1,0),$B104,'Interior - Space-By-Space'!$AE$16:OFFSET('Interior - Space-By-Space'!$AE$56,-1,0)),SUMIF('Interior - Space-By-Space'!$AG$16:OFFSET('Interior - Space-By-Space'!$AG$56,-1,0),$B104,'Interior - Space-By-Space'!$AI$16:OFFSET('Interior - Space-By-Space'!$AI$56,-1,0)),SUMIF('Interior - Space-By-Space'!$AK$16:OFFSET('Interior - Space-By-Space'!$AK$56,-1,0),$B104,'Interior - Space-By-Space'!$AM$16:OFFSET('Interior - Space-By-Space'!$AM$56,-1,0)),SUMIF('Interior - Space-By-Space'!$AO$16:OFFSET('Interior - Space-By-Space'!$AO$56,-1,0),$B104,'Interior - Space-By-Space'!$AQ$16:OFFSET('Interior - Space-By-Space'!$AQ$56,-1,0))),IF(ProjectMethod=BAM,SUM('Interior - Building Area Method'!$C115,'Interior - Building Area Method'!$E115,'Interior - Building Area Method'!$G115,'Interior - Building Area Method'!$I115,'Interior - Building Area Method'!$K115),0))+SUM(SUMIF(Exterior!$J$19:$J$69,$B104,Exterior!$K$19:$K$69),SUMIF(Exterior!$M$19:$M$69,$B104,Exterior!$N$19:$N$69),SUMIF(Exterior!$P$19:$P$69,$B104,Exterior!$Q$19:$Q$69),SUMIF(Exterior!$S$19:$S$69,$B104,Exterior!$T$19:$T$69),SUMIF(Exterior!$V$19:$V$69,$B104,Exterior!$W$19:$W$69))","v":0}]
[null,null,null,null,{"$f":"IF(ProjectMethod=SBS,SUM(SUMIF('Interior - Space-By-Space'!$M$16:OFFSET('Interior - Space-By-Space'!$M$56,-1,0),$B105,'Interior - Space-By-Space'!$O$16:OFFSET('Interior - Space-By-Space'!$O$56,-1,0)),SUMIF('Interior - Space-By-Space'!$Q$16:OFFSET('Interior - Space-By-Space'!$Q$56,-1,0),$B105,'Interior - Space-By-Space'!$S$16:OFFSET('Interior - Space-By-Space'!$S$56,-1,0)),SUMIF('Interior - Space-By-Space'!$U$16:OFFSET('Interior - Space-By-Space'!$U$56,-1,0),$B105,'Interior - Space-By-Space'!$W$16:OFFSET('Interior - Space-By-Space'!$W$56,-1,0)),SUMIF('Interior - Space-By-Space'!$Y$16:OFFSET('Interior - Space-By-Space'!$Y$56,-1,0),$B105,'Interior - Space-By-Space'!$AA$16:OFFSET('Interior - Space-By-Space'!$AA$56,-1,0)),SUMIF('Interior - Space-By-Space'!$AC$16:OFFSET('Interior - Space-By-Space'!$AC$56,-1,0),$B105,'Interior - Space-By-Space'!$AE$16:OFFSET('Interior - Space-By-Space'!$AE$56,-1,0)),SUMIF('Interior - Space-By-Space'!$AG$16:OFFSET('Interior - Space-By-Space'!$AG$56,-1,0),$B105,'Interior - Space-By-Space'!$AI$16:OFFSET('Interior - Space-By-Space'!$AI$56,-1,0)),SUMIF('Interior - Space-By-Space'!$AK$16:OFFSET('Interior - Space-By-Space'!$AK$56,-1,0),$B105,'Interior - Space-By-Space'!$AM$16:OFFSET('Interior - Space-By-Space'!$AM$56,-1,0)),SUMIF('Interior - Space-By-Space'!$AO$16:OFFSET('Interior - Space-By-Space'!$AO$56,-1,0),$B105,'Interior - Space-By-Space'!$AQ$16:OFFSET('Interior - Space-By-Space'!$AQ$56,-1,0))),IF(ProjectMethod=BAM,SUM('Interior - Building Area Method'!$C116,'Interior - Building Area Method'!$E116,'Interior - Building Area Method'!$G116,'Interior - Building Area Method'!$I116,'Interior - Building Area Method'!$K116),0))+SUM(SUMIF(Exterior!$J$19:$J$69,$B105,Exterior!$K$19:$K$69),SUMIF(Exterior!$M$19:$M$69,$B105,Exterior!$N$19:$N$69),SUMIF(Exterior!$P$19:$P$69,$B105,Exterior!$Q$19:$Q$69),SUMIF(Exterior!$S$19:$S$69,$B105,Exterior!$T$19:$T$69),SUMIF(Exterior!$V$19:$V$69,$B105,Exterior!$W$19:$W$69))","v":0}]
[null,null,null,null,{"$f":"IF(ProjectMethod=SBS,SUM(SUMIF('Interior - Space-By-Space'!$M$16:OFFSET('Interior - Space-By-Space'!$M$56,-1,0),$B106,'Interior - Space-By-Space'!$O$16:OFFSET('Interior - Space-By-Space'!$O$56,-1,0)),SUMIF('Interior - Space-By-Space'!$Q$16:OFFSET('Interior - Space-By-Space'!$Q$56,-1,0),$B106,'Interior - Space-By-Space'!$S$16:OFFSET('Interior - Space-By-Space'!$S$56,-1,0)),SUMIF('Interior - Space-By-Space'!$U$16:OFFSET('Interior - Space-By-Space'!$U$56,-1,0),$B106,'Interior - Space-By-Space'!$W$16:OFFSET('Interior - Space-By-Space'!$W$56,-1,0)),SUMIF('Interior - Space-By-Space'!$Y$16:OFFSET('Interior - Space-By-Space'!$Y$56,-1,0),$B106,'Interior - Space-By-Space'!$AA$16:OFFSET('Interior - Space-By-Space'!$AA$56,-1,0)),SUMIF('Interior - Space-By-Space'!$AC$16:OFFSET('Interior - Space-By-Space'!$AC$56,-1,0),$B106,'Interior - Space-By-Space'!$AE$16:OFFSET('Interior - Space-By-Space'!$AE$56,-1,0)),SUMIF('Interior - Space-By-Space'!$AG$16:OFFSET('Interior - Space-By-Space'!$AG$56,-1,0),$B106,'Interior - Space-By-Space'!$AI$16:OFFSET('Interior - Space-By-Space'!$AI$56,-1,0)),SUMIF('Interior - Space-By-Space'!$AK$16:OFFSET('Interior - Space-By-Space'!$AK$56,-1,0),$B106,'Interior - Space-By-Space'!$AM$16:OFFSET('Interior - Space-By-Space'!$AM$56,-1,0)),SUMIF('Interior - Space-By-Space'!$AO$16:OFFSET('Interior - Space-By-Space'!$AO$56,-1,0),$B106,'Interior - Space-By-Space'!$AQ$16:OFFSET('Interior - Space-By-Space'!$AQ$56,-1,0))),IF(ProjectMethod=BAM,SUM('Interior - Building Area Method'!$C117,'Interior - Building Area Method'!$E117,'Interior - Building Area Method'!$G117,'Interior - Building Area Method'!$I117,'Interior - Building Area Method'!$K117),0))+SUM(SUMIF(Exterior!$J$19:$J$69,$B106,Exterior!$K$19:$K$69),SUMIF(Exterior!$M$19:$M$69,$B106,Exterior!$N$19:$N$69),SUMIF(Exterior!$P$19:$P$69,$B106,Exterior!$Q$19:$Q$69),SUMIF(Exterior!$S$19:$S$69,$B106,Exterior!$T$19:$T$69),SUMIF(Exterior!$V$19:$V$69,$B106,Exterior!$W$19:$W$69))","v":0}]
[null,null,null,null,{"$f":"IF(ProjectMethod=SBS,SUM(SUMIF('Interior - Space-By-Space'!$M$16:OFFSET('Interior - Space-By-Space'!$M$56,-1,0),$B107,'Interior - Space-By-Space'!$O$16:OFFSET('Interior - Space-By-Space'!$O$56,-1,0)),SUMIF('Interior - Space-By-Space'!$Q$16:OFFSET('Interior - Space-By-Space'!$Q$56,-1,0),$B107,'Interior - Space-By-Space'!$S$16:OFFSET('Interior - Space-By-Space'!$S$56,-1,0)),SUMIF('Interior - Space-By-Space'!$U$16:OFFSET('Interior - Space-By-Space'!$U$56,-1,0),$B107,'Interior - Space-By-Space'!$W$16:OFFSET('Interior - Space-By-Space'!$W$56,-1,0)),SUMIF('Interior - Space-By-Space'!$Y$16:OFFSET('Interior - Space-By-Space'!$Y$56,-1,0),$B107,'Interior - Space-By-Space'!$AA$16:OFFSET('Interior - Space-By-Space'!$AA$56,-1,0)),SUMIF('Interior - Space-By-Space'!$AC$16:OFFSET('Interior - Space-By-Space'!$AC$56,-1,0),$B107,'Interior - Space-By-Space'!$AE$16:OFFSET('Interior - Space-By-Space'!$AE$56,-1,0)),SUMIF('Interior - Space-By-Space'!$AG$16:OFFSET('Interior - Space-By-Space'!$AG$56,-1,0),$B107,'Interior - Space-By-Space'!$AI$16:OFFSET('Interior - Space-By-Space'!$AI$56,-1,0)),SUMIF('Interior - Space-By-Space'!$AK$16:OFFSET('Interior - Space-By-Space'!$AK$56,-1,0),$B107,'Interior - Space-By-Space'!$AM$16:OFFSET('Interior - Space-By-Space'!$AM$56,-1,0)),SUMIF('Interior - Space-By-Space'!$AO$16:OFFSET('Interior - Space-By-Space'!$AO$56,-1,0),$B107,'Interior - Space-By-Space'!$AQ$16:OFFSET('Interior - Space-By-Space'!$AQ$56,-1,0))),IF(ProjectMethod=BAM,SUM('Interior - Building Area Method'!$C118,'Interior - Building Area Method'!$E118,'Interior - Building Area Method'!$G118,'Interior - Building Area Method'!$I118,'Interior - Building Area Method'!$K118),0))+SUM(SUMIF(Exterior!$J$19:$J$69,$B107,Exterior!$K$19:$K$69),SUMIF(Exterior!$M$19:$M$69,$B107,Exterior!$N$19:$N$69),SUMIF(Exterior!$P$19:$P$69,$B107,Exterior!$Q$19:$Q$69),SUMIF(Exterior!$S$19:$S$69,$B107,Exterior!$T$19:$T$69),SUMIF(Exterior!$V$19:$V$69,$B107,Exterior!$W$19:$W$69))","v":0}]
[null,null,null,null,{"$f":"IF(ProjectMethod=SBS,SUM(SUMIF('Interior - Space-By-Space'!$M$16:OFFSET('Interior - Space-By-Space'!$M$56,-1,0),$B108,'Interior - Space-By-Space'!$O$16:OFFSET('Interior - Space-By-Space'!$O$56,-1,0)),SUMIF('Interior - Space-By-Space'!$Q$16:OFFSET('Interior - Space-By-Space'!$Q$56,-1,0),$B108,'Interior - Space-By-Space'!$S$16:OFFSET('Interior - Space-By-Space'!$S$56,-1,0)),SUMIF('Interior - Space-By-Space'!$U$16:OFFSET('Interior - Space-By-Space'!$U$56,-1,0),$B108,'Interior - Space-By-Space'!$W$16:OFFSET('Interior - Space-By-Space'!$W$56,-1,0)),SUMIF('Interior - Space-By-Space'!$Y$16:OFFSET('Interior - Space-By-Space'!$Y$56,-1,0),$B108,'Interior - Space-By-Space'!$AA$16:OFFSET('Interior - Space-By-Space'!$AA$56,-1,0)),SUMIF('Interior - Space-By-Space'!$AC$16:OFFSET('Interior - Space-By-Space'!$AC$56,-1,0),$B108,'Interior - Space-By-Space'!$AE$16:OFFSET('Interior - Space-By-Space'!$AE$56,-1,0)),SUMIF('Interior - Space-By-Space'!$AG$16:OFFSET('Interior - Space-By-Space'!$AG$56,-1,0),$B108,'Interior - Space-By-Space'!$AI$16:OFFSET('Interior - Space-By-Space'!$AI$56,-1,0)),SUMIF('Interior - Space-By-Space'!$AK$16:OFFSET('Interior - Space-By-Space'!$AK$56,-1,0),$B108,'Interior - Space-By-Space'!$AM$16:OFFSET('Interior - Space-By-Space'!$AM$56,-1,0)),SUMIF('Interior - Space-By-Space'!$AO$16:OFFSET('Interior - Space-By-Space'!$AO$56,-1,0),$B108,'Interior - Space-By-Space'!$AQ$16:OFFSET('Interior - Space-By-Space'!$AQ$56,-1,0))),IF(ProjectMethod=BAM,SUM('Interior - Building Area Method'!$C119,'Interior - Building Area Method'!$E119,'Interior - Building Area Method'!$G119,'Interior - Building Area Method'!$I119,'Interior - Building Area Method'!$K119),0))+SUM(SUMIF(Exterior!$J$19:$J$69,$B108,Exterior!$K$19:$K$69),SUMIF(Exterior!$M$19:$M$69,$B108,Exterior!$N$19:$N$69),SUMIF(Exterior!$P$19:$P$69,$B108,Exterior!$Q$19:$Q$69),SUMIF(Exterior!$S$19:$S$69,$B108,Exterior!$T$19:$T$69),SUMIF(Exterior!$V$19:$V$69,$B108,Exterior!$W$19:$W$69))","v":0}]
[null,null,null,null,{"$f":"IF(ProjectMethod=SBS,SUM(SUMIF('Interior - Space-By-Space'!$M$16:OFFSET('Interior - Space-By-Space'!$M$56,-1,0),$B109,'Interior - Space-By-Space'!$O$16:OFFSET('Interior - Space-By-Space'!$O$56,-1,0)),SUMIF('Interior - Space-By-Space'!$Q$16:OFFSET('Interior - Space-By-Space'!$Q$56,-1,0),$B109,'Interior - Space-By-Space'!$S$16:OFFSET('Interior - Space-By-Space'!$S$56,-1,0)),SUMIF('Interior - Space-By-Space'!$U$16:OFFSET('Interior - Space-By-Space'!$U$56,-1,0),$B109,'Interior - Space-By-Space'!$W$16:OFFSET('Interior - Space-By-Space'!$W$56,-1,0)),SUMIF('Interior - Space-By-Space'!$Y$16:OFFSET('Interior - Space-By-Space'!$Y$56,-1,0),$B109,'Interior - Space-By-Space'!$AA$16:OFFSET('Interior - Space-By-Space'!$AA$56,-1,0)),SUMIF('Interior - Space-By-Space'!$AC$16:OFFSET('Interior - Space-By-Space'!$AC$56,-1,0),$B109,'Interior - Space-By-Space'!$AE$16:OFFSET('Interior - Space-By-Space'!$AE$56,-1,0)),SUMIF('Interior - Space-By-Space'!$AG$16:OFFSET('Interior - Space-By-Space'!$AG$56,-1,0),$B109,'Interior - Space-By-Space'!$AI$16:OFFSET('Interior - Space-By-Space'!$AI$56,-1,0)),SUMIF('Interior - Space-By-Space'!$AK$16:OFFSET('Interior - Space-By-Space'!$AK$56,-1,0),$B109,'Interior - Space-By-Space'!$AM$16:OFFSET('Interior - Space-By-Space'!$AM$56,-1,0)),SUMIF('Interior - Space-By-Space'!$AO$16:OFFSET('Interior - Space-By-Space'!$AO$56,-1,0),$B109,'Interior - Space-By-Space'!$AQ$16:OFFSET('Interior - Space-By-Space'!$AQ$56,-1,0))),IF(ProjectMethod=BAM,SUM('Interior - Building Area Method'!$C120,'Interior - Building Area Method'!$E120,'Interior - Building Area Method'!$G120,'Interior - Building Area Method'!$I120,'Interior - Building Area Method'!$K120),0))+SUM(SUMIF(Exterior!$J$19:$J$69,$B109,Exterior!$K$19:$K$69),SUMIF(Exterior!$M$19:$M$69,$B109,Exterior!$N$19:$N$69),SUMIF(Exterior!$P$19:$P$69,$B109,Exterior!$Q$19:$Q$69),SUMIF(Exterior!$S$19:$S$69,$B109,Exterior!$T$19:$T$69),SUMIF(Exterior!$V$19:$V$69,$B109,Exterior!$W$19:$W$69))","v":0}]
[null,null,null,null,{"$f":"IF(ProjectMethod=SBS,SUM(SUMIF('Interior - Space-By-Space'!$M$16:OFFSET('Interior - Space-By-Space'!$M$56,-1,0),$B110,'Interior - Space-By-Space'!$O$16:OFFSET('Interior - Space-By-Space'!$O$56,-1,0)),SUMIF('Interior - Space-By-Space'!$Q$16:OFFSET('Interior - Space-By-Space'!$Q$56,-1,0),$B110,'Interior - Space-By-Space'!$S$16:OFFSET('Interior - Space-By-Space'!$S$56,-1,0)),SUMIF('Interior - Space-By-Space'!$U$16:OFFSET('Interior - Space-By-Space'!$U$56,-1,0),$B110,'Interior - Space-By-Space'!$W$16:OFFSET('Interior - Space-By-Space'!$W$56,-1,0)),SUMIF('Interior - Space-By-Space'!$Y$16:OFFSET('Interior - Space-By-Space'!$Y$56,-1,0),$B110,'Interior - Space-By-Space'!$AA$16:OFFSET('Interior - Space-By-Space'!$AA$56,-1,0)),SUMIF('Interior - Space-By-Space'!$AC$16:OFFSET('Interior - Space-By-Space'!$AC$56,-1,0),$B110,'Interior - Space-By-Space'!$AE$16:OFFSET('Interior - Space-By-Space'!$AE$56,-1,0)),SUMIF('Interior - Space-By-Space'!$AG$16:OFFSET('Interior - Space-By-Space'!$AG$56,-1,0),$B110,'Interior - Space-By-Space'!$AI$16:OFFSET('Interior - Space-By-Space'!$AI$56,-1,0)),SUMIF('Interior - Space-By-Space'!$AK$16:OFFSET('Interior - Space-By-Space'!$AK$56,-1,0),$B110,'Interior - Space-By-Space'!$AM$16:OFFSET('Interior - Space-By-Space'!$AM$56,-1,0)),SUMIF('Interior - Space-By-Space'!$AO$16:OFFSET('Interior - Space-By-Space'!$AO$56,-1,0),$B110,'Interior - Space-By-Space'!$AQ$16:OFFSET('Interior - Space-By-Space'!$AQ$56,-1,0))),IF(ProjectMethod=BAM,SUM('Interior - Building Area Method'!$C121,'Interior - Building Area Method'!$E121,'Interior - Building Area Method'!$G121,'Interior - Building Area Method'!$I121,'Interior - Building Area Method'!$K121),0))+SUM(SUMIF(Exterior!$J$19:$J$69,$B110,Exterior!$K$19:$K$69),SUMIF(Exterior!$M$19:$M$69,$B110,Exterior!$N$19:$N$69),SUMIF(Exterior!$P$19:$P$69,$B110,Exterior!$Q$19:$Q$69),SUMIF(Exterior!$S$19:$S$69,$B110,Exterior!$T$19:$T$69),SUMIF(Exterior!$V$19:$V$69,$B110,Exterior!$W$19:$W$69))","v":0}]
[null,null,null,null,{"$f":"IF(ProjectMethod=SBS,SUM(SUMIF('Interior - Space-By-Space'!$M$16:OFFSET('Interior - Space-By-Space'!$M$56,-1,0),$B111,'Interior - Space-By-Space'!$O$16:OFFSET('Interior - Space-By-Space'!$O$56,-1,0)),SUMIF('Interior - Space-By-Space'!$Q$16:OFFSET('Interior - Space-By-Space'!$Q$56,-1,0),$B111,'Interior - Space-By-Space'!$S$16:OFFSET('Interior - Space-By-Space'!$S$56,-1,0)),SUMIF('Interior - Space-By-Space'!$U$16:OFFSET('Interior - Space-By-Space'!$U$56,-1,0),$B111,'Interior - Space-By-Space'!$W$16:OFFSET('Interior - Space-By-Space'!$W$56,-1,0)),SUMIF('Interior - Space-By-Space'!$Y$16:OFFSET('Interior - Space-By-Space'!$Y$56,-1,0),$B111,'Interior - Space-By-Space'!$AA$16:OFFSET('Interior - Space-By-Space'!$AA$56,-1,0)),SUMIF('Interior - Space-By-Space'!$AC$16:OFFSET('Interior - Space-By-Space'!$AC$56,-1,0),$B111,'Interior - Space-By-Space'!$AE$16:OFFSET('Interior - Space-By-Space'!$AE$56,-1,0)),SUMIF('Interior - Space-By-Space'!$AG$16:OFFSET('Interior - Space-By-Space'!$AG$56,-1,0),$B111,'Interior - Space-By-Space'!$AI$16:OFFSET('Interior - Space-By-Space'!$AI$56,-1,0)),SUMIF('Interior - Space-By-Space'!$AK$16:OFFSET('Interior - Space-By-Space'!$AK$56,-1,0),$B111,'Interior - Space-By-Space'!$AM$16:OFFSET('Interior - Space-By-Space'!$AM$56,-1,0)),SUMIF('Interior - Space-By-Space'!$AO$16:OFFSET('Interior - Space-By-Space'!$AO$56,-1,0),$B111,'Interior - Space-By-Space'!$AQ$16:OFFSET('Interior - Space-By-Space'!$AQ$56,-1,0))),IF(ProjectMethod=BAM,SUM('Interior - Building Area Method'!$C122,'Interior - Building Area Method'!$E122,'Interior - Building Area Method'!$G122,'Interior - Building Area Method'!$I122,'Interior - Building Area Method'!$K122),0))+SUM(SUMIF(Exterior!$J$19:$J$69,$B111,Exterior!$K$19:$K$69),SUMIF(Exterior!$M$19:$M$69,$B111,Exterior!$N$19:$N$69),SUMIF(Exterior!$P$19:$P$69,$B111,Exterior!$Q$19:$Q$69),SUMIF(Exterior!$S$19:$S$69,$B111,Exterior!$T$19:$T$69),SUMIF(Exterior!$V$19:$V$69,$B111,Exterior!$W$19:$W$69))","v":0}]
[null,null,null,null,{"$f":"IF(ProjectMethod=SBS,SUM(SUMIF('Interior - Space-By-Space'!$M$16:OFFSET('Interior - Space-By-Space'!$M$56,-1,0),$B112,'Interior - Space-By-Space'!$O$16:OFFSET('Interior - Space-By-Space'!$O$56,-1,0)),SUMIF('Interior - Space-By-Space'!$Q$16:OFFSET('Interior - Space-By-Space'!$Q$56,-1,0),$B112,'Interior - Space-By-Space'!$S$16:OFFSET('Interior - Space-By-Space'!$S$56,-1,0)),SUMIF('Interior - Space-By-Space'!$U$16:OFFSET('Interior - Space-By-Space'!$U$56,-1,0),$B112,'Interior - Space-By-Space'!$W$16:OFFSET('Interior - Space-By-Space'!$W$56,-1,0)),SUMIF('Interior - Space-By-Space'!$Y$16:OFFSET('Interior - Space-By-Space'!$Y$56,-1,0),$B112,'Interior - Space-By-Space'!$AA$16:OFFSET('Interior - Space-By-Space'!$AA$56,-1,0)),SUMIF('Interior - Space-By-Space'!$AC$16:OFFSET('Interior - Space-By-Space'!$AC$56,-1,0),$B112,'Interior - Space-By-Space'!$AE$16:OFFSET('Interior - Space-By-Space'!$AE$56,-1,0)),SUMIF('Interior - Space-By-Space'!$AG$16:OFFSET('Interior - Space-By-Space'!$AG$56,-1,0),$B112,'Interior - Space-By-Space'!$AI$16:OFFSET('Interior - Space-By-Space'!$AI$56,-1,0)),SUMIF('Interior - Space-By-Space'!$AK$16:OFFSET('Interior - Space-By-Space'!$AK$56,-1,0),$B112,'Interior - Space-By-Space'!$AM$16:OFFSET('Interior - Space-By-Space'!$AM$56,-1,0)),SUMIF('Interior - Space-By-Space'!$AO$16:OFFSET('Interior - Space-By-Space'!$AO$56,-1,0),$B112,'Interior - Space-By-Space'!$AQ$16:OFFSET('Interior - Space-By-Space'!$AQ$56,-1,0))),IF(ProjectMethod=BAM,SUM('Interior - Building Area Method'!$C123,'Interior - Building Area Method'!$E123,'Interior - Building Area Method'!$G123,'Interior - Building Area Method'!$I123,'Interior - Building Area Method'!$K123),0))+SUM(SUMIF(Exterior!$J$19:$J$69,$B112,Exterior!$K$19:$K$69),SUMIF(Exterior!$M$19:$M$69,$B112,Exterior!$N$19:$N$69),SUMIF(Exterior!$P$19:$P$69,$B112,Exterior!$Q$19:$Q$69),SUMIF(Exterior!$S$19:$S$69,$B112,Exterior!$T$19:$T$69),SUMIF(Exterior!$V$19:$V$69,$B112,Exterior!$W$19:$W$69))","v":0}]
[null,null,null,null,{"$f":"IF(ProjectMethod=SBS,SUM(SUMIF('Interior - Space-By-Space'!$M$16:OFFSET('Interior - Space-By-Space'!$M$56,-1,0),$B113,'Interior - Space-By-Space'!$O$16:OFFSET('Interior - Space-By-Space'!$O$56,-1,0)),SUMIF('Interior - Space-By-Space'!$Q$16:OFFSET('Interior - Space-By-Space'!$Q$56,-1,0),$B113,'Interior - Space-By-Space'!$S$16:OFFSET('Interior - Space-By-Space'!$S$56,-1,0)),SUMIF('Interior - Space-By-Space'!$U$16:OFFSET('Interior - Space-By-Space'!$U$56,-1,0),$B113,'Interior - Space-By-Space'!$W$16:OFFSET('Interior - Space-By-Space'!$W$56,-1,0)),SUMIF('Interior - Space-By-Space'!$Y$16:OFFSET('Interior - Space-By-Space'!$Y$56,-1,0),$B113,'Interior - Space-By-Space'!$AA$16:OFFSET('Interior - Space-By-Space'!$AA$56,-1,0)),SUMIF('Interior - Space-By-Space'!$AC$16:OFFSET('Interior - Space-By-Space'!$AC$56,-1,0),$B113,'Interior - Space-By-Space'!$AE$16:OFFSET('Interior - Space-By-Space'!$AE$56,-1,0)),SUMIF('Interior - Space-By-Space'!$AG$16:OFFSET('Interior - Space-By-Space'!$AG$56,-1,0),$B113,'Interior - Space-By-Space'!$AI$16:OFFSET('Interior - Space-By-Space'!$AI$56,-1,0)),SUMIF('Interior - Space-By-Space'!$AK$16:OFFSET('Interior - Space-By-Space'!$AK$56,-1,0),$B113,'Interior - Space-By-Space'!$AM$16:OFFSET('Interior - Space-By-Space'!$AM$56,-1,0)),SUMIF('Interior - Space-By-Space'!$AO$16:OFFSET('Interior - Space-By-Space'!$AO$56,-1,0),$B113,'Interior - Space-By-Space'!$AQ$16:OFFSET('Interior - Space-By-Space'!$AQ$56,-1,0))),IF(ProjectMethod=BAM,SUM('Interior - Building Area Method'!$C124,'Interior - Building Area Method'!$E124,'Interior - Building Area Method'!$G124,'Interior - Building Area Method'!$I124,'Interior - Building Area Method'!$K124),0))+SUM(SUMIF(Exterior!$J$19:$J$69,$B113,Exterior!$K$19:$K$69),SUMIF(Exterior!$M$19:$M$69,$B113,Exterior!$N$19:$N$69),SUMIF(Exterior!$P$19:$P$69,$B113,Exterior!$Q$19:$Q$69),SUMIF(Exterior!$S$19:$S$69,$B113,Exterior!$T$19:$T$69),SUMIF(Exterior!$V$19:$V$69,$B113,Exterior!$W$19:$W$69))","v":0}]
[null,null,null,null,{"$f":"IF(ProjectMethod=SBS,SUM(SUMIF('Interior - Space-By-Space'!$M$16:OFFSET('Interior - Space-By-Space'!$M$56,-1,0),$B114,'Interior - Space-By-Space'!$O$16:OFFSET('Interior - Space-By-Space'!$O$56,-1,0)),SUMIF('Interior - Space-By-Space'!$Q$16:OFFSET('Interior - Space-By-Space'!$Q$56,-1,0),$B114,'Interior - Space-By-Space'!$S$16:OFFSET('Interior - Space-By-Space'!$S$56,-1,0)),SUMIF('Interior - Space-By-Space'!$U$16:OFFSET('Interior - Space-By-Space'!$U$56,-1,0),$B114,'Interior - Space-By-Space'!$W$16:OFFSET('Interior - Space-By-Space'!$W$56,-1,0)),SUMIF('Interior - Space-By-Space'!$Y$16:OFFSET('Interior - Space-By-Space'!$Y$56,-1,0),$B114,'Interior - Space-By-Space'!$AA$16:OFFSET('Interior - Space-By-Space'!$AA$56,-1,0)),SUMIF('Interior - Space-By-Space'!$AC$16:OFFSET('Interior - Space-By-Space'!$AC$56,-1,0),$B114,'Interior - Space-By-Space'!$AE$16:OFFSET('Interior - Space-By-Space'!$AE$56,-1,0)),SUMIF('Interior - Space-By-Space'!$AG$16:OFFSET('Interior - Space-By-Space'!$AG$56,-1,0),$B114,'Interior - Space-By-Space'!$AI$16:OFFSET('Interior - Space-By-Space'!$AI$56,-1,0)),SUMIF('Interior - Space-By-Space'!$AK$16:OFFSET('Interior - Space-By-Space'!$AK$56,-1,0),$B114,'Interior - Space-By-Space'!$AM$16:OFFSET('Interior - Space-By-Space'!$AM$56,-1,0)),SUMIF('Interior - Space-By-Space'!$AO$16:OFFSET('Interior - Space-By-Space'!$AO$56,-1,0),$B114,'Interior - Space-By-Space'!$AQ$16:OFFSET('Interior - Space-By-Space'!$AQ$56,-1,0))),IF(ProjectMethod=BAM,SUM('Interior - Building Area Method'!$C125,'Interior - Building Area Method'!$E125,'Interior - Building Area Method'!$G125,'Interior - Building Area Method'!$I125,'Interior - Building Area Method'!$K125),0))+SUM(SUMIF(Exterior!$J$19:$J$69,$B114,Exterior!$K$19:$K$69),SUMIF(Exterior!$M$19:$M$69,$B114,Exterior!$N$19:$N$69),SUMIF(Exterior!$P$19:$P$69,$B114,Exterior!$Q$19:$Q$69),SUMIF(Exterior!$S$19:$S$69,$B114,Exterior!$T$19:$T$69),SUMIF(Exterior!$V$19:$V$69,$B114,Exterior!$W$19:$W$69))","v":0}]
[null,null,null,null,{"$f":"IF(ProjectMethod=SBS,SUM(SUMIF('Interior - Space-By-Space'!$M$16:OFFSET('Interior - Space-By-Space'!$M$56,-1,0),$B115,'Interior - Space-By-Space'!$O$16:OFFSET('Interior - Space-By-Space'!$O$56,-1,0)),SUMIF('Interior - Space-By-Space'!$Q$16:OFFSET('Interior - Space-By-Space'!$Q$56,-1,0),$B115,'Interior - Space-By-Space'!$S$16:OFFSET('Interior - Space-By-Space'!$S$56,-1,0)),SUMIF('Interior - Space-By-Space'!$U$16:OFFSET('Interior - Space-By-Space'!$U$56,-1,0),$B115,'Interior - Space-By-Space'!$W$16:OFFSET('Interior - Space-By-Space'!$W$56,-1,0)),SUMIF('Interior - Space-By-Space'!$Y$16:OFFSET('Interior - Space-By-Space'!$Y$56,-1,0),$B115,'Interior - Space-By-Space'!$AA$16:OFFSET('Interior - Space-By-Space'!$AA$56,-1,0)),SUMIF('Interior - Space-By-Space'!$AC$16:OFFSET('Interior - Space-By-Space'!$AC$56,-1,0),$B115,'Interior - Space-By-Space'!$AE$16:OFFSET('Interior - Space-By-Space'!$AE$56,-1,0)),SUMIF('Interior - Space-By-Space'!$AG$16:OFFSET('Interior - Space-By-Space'!$AG$56,-1,0),$B115,'Interior - Space-By-Space'!$AI$16:OFFSET('Interior - Space-By-Space'!$AI$56,-1,0)),SUMIF('Interior - Space-By-Space'!$AK$16:OFFSET('Interior - Space-By-Space'!$AK$56,-1,0),$B115,'Interior - Space-By-Space'!$AM$16:OFFSET('Interior - Space-By-Space'!$AM$56,-1,0)),SUMIF('Interior - Space-By-Space'!$AO$16:OFFSET('Interior - Space-By-Space'!$AO$56,-1,0),$B115,'Interior - Space-By-Space'!$AQ$16:OFFSET('Interior - Space-By-Space'!$AQ$56,-1,0))),IF(ProjectMethod=BAM,SUM('Interior - Building Area Method'!$C126,'Interior - Building Area Method'!$E126,'Interior - Building Area Method'!$G126,'Interior - Building Area Method'!$I126,'Interior - Building Area Method'!$K126),0))+SUM(SUMIF(Exterior!$J$19:$J$69,$B115,Exterior!$K$19:$K$69),SUMIF(Exterior!$M$19:$M$69,$B115,Exterior!$N$19:$N$69),SUMIF(Exterior!$P$19:$P$69,$B115,Exterior!$Q$19:$Q$69),SUMIF(Exterior!$S$19:$S$69,$B115,Exterior!$T$19:$T$69),SUMIF(Exterior!$V$19:$V$69,$B115,Exterior!$W$19:$W$69))","v":0}]
[null,null,null,null,{"$f":"IF(ProjectMethod=SBS,SUM(SUMIF('Interior - Space-By-Space'!$M$16:OFFSET('Interior - Space-By-Space'!$M$56,-1,0),$B116,'Interior - Space-By-Space'!$O$16:OFFSET('Interior - Space-By-Space'!$O$56,-1,0)),SUMIF('Interior - Space-By-Space'!$Q$16:OFFSET('Interior - Space-By-Space'!$Q$56,-1,0),$B116,'Interior - Space-By-Space'!$S$16:OFFSET('Interior - Space-By-Space'!$S$56,-1,0)),SUMIF('Interior - Space-By-Space'!$U$16:OFFSET('Interior - Space-By-Space'!$U$56,-1,0),$B116,'Interior - Space-By-Space'!$W$16:OFFSET('Interior - Space-By-Space'!$W$56,-1,0)),SUMIF('Interior - Space-By-Space'!$Y$16:OFFSET('Interior - Space-By-Space'!$Y$56,-1,0),$B116,'Interior - Space-By-Space'!$AA$16:OFFSET('Interior - Space-By-Space'!$AA$56,-1,0)),SUMIF('Interior - Space-By-Space'!$AC$16:OFFSET('Interior - Space-By-Space'!$AC$56,-1,0),$B116,'Interior - Space-By-Space'!$AE$16:OFFSET('Interior - Space-By-Space'!$AE$56,-1,0)),SUMIF('Interior - Space-By-Space'!$AG$16:OFFSET('Interior - Space-By-Space'!$AG$56,-1,0),$B116,'Interior - Space-By-Space'!$AI$16:OFFSET('Interior - Space-By-Space'!$AI$56,-1,0)),SUMIF('Interior - Space-By-Space'!$AK$16:OFFSET('Interior - Space-By-Space'!$AK$56,-1,0),$B116,'Interior - Space-By-Space'!$AM$16:OFFSET('Interior - Space-By-Space'!$AM$56,-1,0)),SUMIF('Interior - Space-By-Space'!$AO$16:OFFSET('Interior - Space-By-Space'!$AO$56,-1,0),$B116,'Interior - Space-By-Space'!$AQ$16:OFFSET('Interior - Space-By-Space'!$AQ$56,-1,0))),IF(ProjectMethod=BAM,SUM('Interior - Building Area Method'!$C127,'Interior - Building Area Method'!$E127,'Interior - Building Area Method'!$G127,'Interior - Building Area Method'!$I127,'Interior - Building Area Method'!$K127),0))+SUM(SUMIF(Exterior!$J$19:$J$69,$B116,Exterior!$K$19:$K$69),SUMIF(Exterior!$M$19:$M$69,$B116,Exterior!$N$19:$N$69),SUMIF(Exterior!$P$19:$P$69,$B116,Exterior!$Q$19:$Q$69),SUMIF(Exterior!$S$19:$S$69,$B116,Exterior!$T$19:$T$69),SUMIF(Exterior!$V$19:$V$69,$B116,Exterior!$W$19:$W$69))","v":0}]
[null,null,null,null,{"$f":"IF(ProjectMethod=SBS,SUM(SUMIF('Interior - Space-By-Space'!$M$16:OFFSET('Interior - Space-By-Space'!$M$56,-1,0),$B117,'Interior - Space-By-Space'!$O$16:OFFSET('Interior - Space-By-Space'!$O$56,-1,0)),SUMIF('Interior - Space-By-Space'!$Q$16:OFFSET('Interior - Space-By-Space'!$Q$56,-1,0),$B117,'Interior - Space-By-Space'!$S$16:OFFSET('Interior - Space-By-Space'!$S$56,-1,0)),SUMIF('Interior - Space-By-Space'!$U$16:OFFSET('Interior - Space-By-Space'!$U$56,-1,0),$B117,'Interior - Space-By-Space'!$W$16:OFFSET('Interior - Space-By-Space'!$W$56,-1,0)),SUMIF('Interior - Space-By-Space'!$Y$16:OFFSET('Interior - Space-By-Space'!$Y$56,-1,0),$B117,'Interior - Space-By-Space'!$AA$16:OFFSET('Interior - Space-By-Space'!$AA$56,-1,0)),SUMIF('Interior - Space-By-Space'!$AC$16:OFFSET('Interior - Space-By-Space'!$AC$56,-1,0),$B117,'Interior - Space-By-Space'!$AE$16:OFFSET('Interior - Space-By-Space'!$AE$56,-1,0)),SUMIF('Interior - Space-By-Space'!$AG$16:OFFSET('Interior - Space-By-Space'!$AG$56,-1,0),$B117,'Interior - Space-By-Space'!$AI$16:OFFSET('Interior - Space-By-Space'!$AI$56,-1,0)),SUMIF('Interior - Space-By-Space'!$AK$16:OFFSET('Interior - Space-By-Space'!$AK$56,-1,0),$B117,'Interior - Space-By-Space'!$AM$16:OFFSET('Interior - Space-By-Space'!$AM$56,-1,0)),SUMIF('Interior - Space-By-Space'!$AO$16:OFFSET('Interior - Space-By-Space'!$AO$56,-1,0),$B117,'Interior - Space-By-Space'!$AQ$16:OFFSET('Interior - Space-By-Space'!$AQ$56,-1,0))),IF(ProjectMethod=BAM,SUM('Interior - Building Area Method'!$C128,'Interior - Building Area Method'!$E128,'Interior - Building Area Method'!$G128,'Interior - Building Area Method'!$I128,'Interior - Building Area Method'!$K128),0))+SUM(SUMIF(Exterior!$J$19:$J$69,$B117,Exterior!$K$19:$K$69),SUMIF(Exterior!$M$19:$M$69,$B117,Exterior!$N$19:$N$69),SUMIF(Exterior!$P$19:$P$69,$B117,Exterior!$Q$19:$Q$69),SUMIF(Exterior!$S$19:$S$69,$B117,Exterior!$T$19:$T$69),SUMIF(Exterior!$V$19:$V$69,$B117,Exterior!$W$19:$W$69))","v":0}]
[null,null,null,null,{"$f":"IF(ProjectMethod=SBS,SUM(SUMIF('Interior - Space-By-Space'!$M$16:OFFSET('Interior - Space-By-Space'!$M$56,-1,0),$B118,'Interior - Space-By-Space'!$O$16:OFFSET('Interior - Space-By-Space'!$O$56,-1,0)),SUMIF('Interior - Space-By-Space'!$Q$16:OFFSET('Interior - Space-By-Space'!$Q$56,-1,0),$B118,'Interior - Space-By-Space'!$S$16:OFFSET('Interior - Space-By-Space'!$S$56,-1,0)),SUMIF('Interior - Space-By-Space'!$U$16:OFFSET('Interior - Space-By-Space'!$U$56,-1,0),$B118,'Interior - Space-By-Space'!$W$16:OFFSET('Interior - Space-By-Space'!$W$56,-1,0)),SUMIF('Interior - Space-By-Space'!$Y$16:OFFSET('Interior - Space-By-Space'!$Y$56,-1,0),$B118,'Interior - Space-By-Space'!$AA$16:OFFSET('Interior - Space-By-Space'!$AA$56,-1,0)),SUMIF('Interior - Space-By-Space'!$AC$16:OFFSET('Interior - Space-By-Space'!$AC$56,-1,0),$B118,'Interior - Space-By-Space'!$AE$16:OFFSET('Interior - Space-By-Space'!$AE$56,-1,0)),SUMIF('Interior - Space-By-Space'!$AG$16:OFFSET('Interior - Space-By-Space'!$AG$56,-1,0),$B118,'Interior - Space-By-Space'!$AI$16:OFFSET('Interior - Space-By-Space'!$AI$56,-1,0)),SUMIF('Interior - Space-By-Space'!$AK$16:OFFSET('Interior - Space-By-Space'!$AK$56,-1,0),$B118,'Interior - Space-By-Space'!$AM$16:OFFSET('Interior - Space-By-Space'!$AM$56,-1,0)),SUMIF('Interior - Space-By-Space'!$AO$16:OFFSET('Interior - Space-By-Space'!$AO$56,-1,0),$B118,'Interior - Space-By-Space'!$AQ$16:OFFSET('Interior - Space-By-Space'!$AQ$56,-1,0))),IF(ProjectMethod=BAM,SUM('Interior - Building Area Method'!$C129,'Interior - Building Area Method'!$E129,'Interior - Building Area Method'!$G129,'Interior - Building Area Method'!$I129,'Interior - Building Area Method'!$K129),0))+SUM(SUMIF(Exterior!$J$19:$J$69,$B118,Exterior!$K$19:$K$69),SUMIF(Exterior!$M$19:$M$69,$B118,Exterior!$N$19:$N$69),SUMIF(Exterior!$P$19:$P$69,$B118,Exterior!$Q$19:$Q$69),SUMIF(Exterior!$S$19:$S$69,$B118,Exterior!$T$19:$T$69),SUMIF(Exterior!$V$19:$V$69,$B118,Exterior!$W$19:$W$69))","v":0}]
[null,null,null,null,{"$f":"IF(ProjectMethod=SBS,SUM(SUMIF('Interior - Space-By-Space'!$M$16:OFFSET('Interior - Space-By-Space'!$M$56,-1,0),$B119,'Interior - Space-By-Space'!$O$16:OFFSET('Interior - Space-By-Space'!$O$56,-1,0)),SUMIF('Interior - Space-By-Space'!$Q$16:OFFSET('Interior - Space-By-Space'!$Q$56,-1,0),$B119,'Interior - Space-By-Space'!$S$16:OFFSET('Interior - Space-By-Space'!$S$56,-1,0)),SUMIF('Interior - Space-By-Space'!$U$16:OFFSET('Interior - Space-By-Space'!$U$56,-1,0),$B119,'Interior - Space-By-Space'!$W$16:OFFSET('Interior - Space-By-Space'!$W$56,-1,0)),SUMIF('Interior - Space-By-Space'!$Y$16:OFFSET('Interior - Space-By-Space'!$Y$56,-1,0),$B119,'Interior - Space-By-Space'!$AA$16:OFFSET('Interior - Space-By-Space'!$AA$56,-1,0)),SUMIF('Interior - Space-By-Space'!$AC$16:OFFSET('Interior - Space-By-Space'!$AC$56,-1,0),$B119,'Interior - Space-By-Space'!$AE$16:OFFSET('Interior - Space-By-Space'!$AE$56,-1,0)),SUMIF('Interior - Space-By-Space'!$AG$16:OFFSET('Interior - Space-By-Space'!$AG$56,-1,0),$B119,'Interior - Space-By-Space'!$AI$16:OFFSET('Interior - Space-By-Space'!$AI$56,-1,0)),SUMIF('Interior - Space-By-Space'!$AK$16:OFFSET('Interior - Space-By-Space'!$AK$56,-1,0),$B119,'Interior - Space-By-Space'!$AM$16:OFFSET('Interior - Space-By-Space'!$AM$56,-1,0)),SUMIF('Interior - Space-By-Space'!$AO$16:OFFSET('Interior - Space-By-Space'!$AO$56,-1,0),$B119,'Interior - Space-By-Space'!$AQ$16:OFFSET('Interior - Space-By-Space'!$AQ$56,-1,0))),IF(ProjectMethod=BAM,SUM('Interior - Building Area Method'!$C130,'Interior - Building Area Method'!$E130,'Interior - Building Area Method'!$G130,'Interior - Building Area Method'!$I130,'Interior - Building Area Method'!$K130),0))+SUM(SUMIF(Exterior!$J$19:$J$69,$B119,Exterior!$K$19:$K$69),SUMIF(Exterior!$M$19:$M$69,$B119,Exterior!$N$19:$N$69),SUMIF(Exterior!$P$19:$P$69,$B119,Exterior!$Q$19:$Q$69),SUMIF(Exterior!$S$19:$S$69,$B119,Exterior!$T$19:$T$69),SUMIF(Exterior!$V$19:$V$69,$B119,Exterior!$W$19:$W$69))","v":0}]
[null,null,null,null,{"$f":"IF(ProjectMethod=SBS,SUM(SUMIF('Interior - Space-By-Space'!$M$16:OFFSET('Interior - Space-By-Space'!$M$56,-1,0),$B120,'Interior - Space-By-Space'!$O$16:OFFSET('Interior - Space-By-Space'!$O$56,-1,0)),SUMIF('Interior - Space-By-Space'!$Q$16:OFFSET('Interior - Space-By-Space'!$Q$56,-1,0),$B120,'Interior - Space-By-Space'!$S$16:OFFSET('Interior - Space-By-Space'!$S$56,-1,0)),SUMIF('Interior - Space-By-Space'!$U$16:OFFSET('Interior - Space-By-Space'!$U$56,-1,0),$B120,'Interior - Space-By-Space'!$W$16:OFFSET('Interior - Space-By-Space'!$W$56,-1,0)),SUMIF('Interior - Space-By-Space'!$Y$16:OFFSET('Interior - Space-By-Space'!$Y$56,-1,0),$B120,'Interior - Space-By-Space'!$AA$16:OFFSET('Interior - Space-By-Space'!$AA$56,-1,0)),SUMIF('Interior - Space-By-Space'!$AC$16:OFFSET('Interior - Space-By-Space'!$AC$56,-1,0),$B120,'Interior - Space-By-Space'!$AE$16:OFFSET('Interior - Space-By-Space'!$AE$56,-1,0)),SUMIF('Interior - Space-By-Space'!$AG$16:OFFSET('Interior - Space-By-Space'!$AG$56,-1,0),$B120,'Interior - Space-By-Space'!$AI$16:OFFSET('Interior - Space-By-Space'!$AI$56,-1,0)),SUMIF('Interior - Space-By-Space'!$AK$16:OFFSET('Interior - Space-By-Space'!$AK$56,-1,0),$B120,'Interior - Space-By-Space'!$AM$16:OFFSET('Interior - Space-By-Space'!$AM$56,-1,0)),SUMIF('Interior - Space-By-Space'!$AO$16:OFFSET('Interior - Space-By-Space'!$AO$56,-1,0),$B120,'Interior - Space-By-Space'!$AQ$16:OFFSET('Interior - Space-By-Space'!$AQ$56,-1,0))),IF(ProjectMethod=BAM,SUM('Interior - Building Area Method'!$C131,'Interior - Building Area Method'!$E131,'Interior - Building Area Method'!$G131,'Interior - Building Area Method'!$I131,'Interior - Building Area Method'!$K131),0))+SUM(SUMIF(Exterior!$J$19:$J$69,$B120,Exterior!$K$19:$K$69),SUMIF(Exterior!$M$19:$M$69,$B120,Exterior!$N$19:$N$69),SUMIF(Exterior!$P$19:$P$69,$B120,Exterior!$Q$19:$Q$69),SUMIF(Exterior!$S$19:$S$69,$B120,Exterior!$T$19:$T$69),SUMIF(Exterior!$V$19:$V$69,$B120,Exterior!$W$19:$W$69))","v":0}]
[null,null,null,null,{"$f":"IF(ProjectMethod=SBS,SUM(SUMIF('Interior - Space-By-Space'!$M$16:OFFSET('Interior - Space-By-Space'!$M$56,-1,0),$B121,'Interior - Space-By-Space'!$O$16:OFFSET('Interior - Space-By-Space'!$O$56,-1,0)),SUMIF('Interior - Space-By-Space'!$Q$16:OFFSET('Interior - Space-By-Space'!$Q$56,-1,0),$B121,'Interior - Space-By-Space'!$S$16:OFFSET('Interior - Space-By-Space'!$S$56,-1,0)),SUMIF('Interior - Space-By-Space'!$U$16:OFFSET('Interior - Space-By-Space'!$U$56,-1,0),$B121,'Interior - Space-By-Space'!$W$16:OFFSET('Interior - Space-By-Space'!$W$56,-1,0)),SUMIF('Interior - Space-By-Space'!$Y$16:OFFSET('Interior - Space-By-Space'!$Y$56,-1,0),$B121,'Interior - Space-By-Space'!$AA$16:OFFSET('Interior - Space-By-Space'!$AA$56,-1,0)),SUMIF('Interior - Space-By-Space'!$AC$16:OFFSET('Interior - Space-By-Space'!$AC$56,-1,0),$B121,'Interior - Space-By-Space'!$AE$16:OFFSET('Interior - Space-By-Space'!$AE$56,-1,0)),SUMIF('Interior - Space-By-Space'!$AG$16:OFFSET('Interior - Space-By-Space'!$AG$56,-1,0),$B121,'Interior - Space-By-Space'!$AI$16:OFFSET('Interior - Space-By-Space'!$AI$56,-1,0)),SUMIF('Interior - Space-By-Space'!$AK$16:OFFSET('Interior - Space-By-Space'!$AK$56,-1,0),$B121,'Interior - Space-By-Space'!$AM$16:OFFSET('Interior - Space-By-Space'!$AM$56,-1,0)),SUMIF('Interior - Space-By-Space'!$AO$16:OFFSET('Interior - Space-By-Space'!$AO$56,-1,0),$B121,'Interior - Space-By-Space'!$AQ$16:OFFSET('Interior - Space-By-Space'!$AQ$56,-1,0))),IF(ProjectMethod=BAM,SUM('Interior - Building Area Method'!$C132,'Interior - Building Area Method'!$E132,'Interior - Building Area Method'!$G132,'Interior - Building Area Method'!$I132,'Interior - Building Area Method'!$K132),0))+SUM(SUMIF(Exterior!$J$19:$J$69,$B121,Exterior!$K$19:$K$69),SUMIF(Exterior!$M$19:$M$69,$B121,Exterior!$N$19:$N$69),SUMIF(Exterior!$P$19:$P$69,$B121,Exterior!$Q$19:$Q$69),SUMIF(Exterior!$S$19:$S$69,$B121,Exterior!$T$19:$T$69),SUMIF(Exterior!$V$19:$V$69,$B121,Exterior!$W$19:$W$69))","v":0}]
[null,null,null,null,{"$f":"IF(ProjectMethod=SBS,SUM(SUMIF('Interior - Space-By-Space'!$M$16:OFFSET('Interior - Space-By-Space'!$M$56,-1,0),$B122,'Interior - Space-By-Space'!$O$16:OFFSET('Interior - Space-By-Space'!$O$56,-1,0)),SUMIF('Interior - Space-By-Space'!$Q$16:OFFSET('Interior - Space-By-Space'!$Q$56,-1,0),$B122,'Interior - Space-By-Space'!$S$16:OFFSET('Interior - Space-By-Space'!$S$56,-1,0)),SUMIF('Interior - Space-By-Space'!$U$16:OFFSET('Interior - Space-By-Space'!$U$56,-1,0),$B122,'Interior - Space-By-Space'!$W$16:OFFSET('Interior - Space-By-Space'!$W$56,-1,0)),SUMIF('Interior - Space-By-Space'!$Y$16:OFFSET('Interior - Space-By-Space'!$Y$56,-1,0),$B122,'Interior - Space-By-Space'!$AA$16:OFFSET('Interior - Space-By-Space'!$AA$56,-1,0)),SUMIF('Interior - Space-By-Space'!$AC$16:OFFSET('Interior - Space-By-Space'!$AC$56,-1,0),$B122,'Interior - Space-By-Space'!$AE$16:OFFSET('Interior - Space-By-Space'!$AE$56,-1,0)),SUMIF('Interior - Space-By-Space'!$AG$16:OFFSET('Interior - Space-By-Space'!$AG$56,-1,0),$B122,'Interior - Space-By-Space'!$AI$16:OFFSET('Interior - Space-By-Space'!$AI$56,-1,0)),SUMIF('Interior - Space-By-Space'!$AK$16:OFFSET('Interior - Space-By-Space'!$AK$56,-1,0),$B122,'Interior - Space-By-Space'!$AM$16:OFFSET('Interior - Space-By-Space'!$AM$56,-1,0)),SUMIF('Interior - Space-By-Space'!$AO$16:OFFSET('Interior - Space-By-Space'!$AO$56,-1,0),$B122,'Interior - Space-By-Space'!$AQ$16:OFFSET('Interior - Space-By-Space'!$AQ$56,-1,0))),IF(ProjectMethod=BAM,SUM('Interior - Building Area Method'!$C133,'Interior - Building Area Method'!$E133,'Interior - Building Area Method'!$G133,'Interior - Building Area Method'!$I133,'Interior - Building Area Method'!$K133),0))+SUM(SUMIF(Exterior!$J$19:$J$69,$B122,Exterior!$K$19:$K$69),SUMIF(Exterior!$M$19:$M$69,$B122,Exterior!$N$19:$N$69),SUMIF(Exterior!$P$19:$P$69,$B122,Exterior!$Q$19:$Q$69),SUMIF(Exterior!$S$19:$S$69,$B122,Exterior!$T$19:$T$69),SUMIF(Exterior!$V$19:$V$69,$B122,Exterior!$W$19:$W$69))","v":0}]
[null,null,null,null,{"$f":"IF(ProjectMethod=SBS,SUM(SUMIF('Interior - Space-By-Space'!$M$16:OFFSET('Interior - Space-By-Space'!$M$56,-1,0),$B123,'Interior - Space-By-Space'!$O$16:OFFSET('Interior - Space-By-Space'!$O$56,-1,0)),SUMIF('Interior - Space-By-Space'!$Q$16:OFFSET('Interior - Space-By-Space'!$Q$56,-1,0),$B123,'Interior - Space-By-Space'!$S$16:OFFSET('Interior - Space-By-Space'!$S$56,-1,0)),SUMIF('Interior - Space-By-Space'!$U$16:OFFSET('Interior - Space-By-Space'!$U$56,-1,0),$B123,'Interior - Space-By-Space'!$W$16:OFFSET('Interior - Space-By-Space'!$W$56,-1,0)),SUMIF('Interior - Space-By-Space'!$Y$16:OFFSET('Interior - Space-By-Space'!$Y$56,-1,0),$B123,'Interior - Space-By-Space'!$AA$16:OFFSET('Interior - Space-By-Space'!$AA$56,-1,0)),SUMIF('Interior - Space-By-Space'!$AC$16:OFFSET('Interior - Space-By-Space'!$AC$56,-1,0),$B123,'Interior - Space-By-Space'!$AE$16:OFFSET('Interior - Space-By-Space'!$AE$56,-1,0)),SUMIF('Interior - Space-By-Space'!$AG$16:OFFSET('Interior - Space-By-Space'!$AG$56,-1,0),$B123,'Interior - Space-By-Space'!$AI$16:OFFSET('Interior - Space-By-Space'!$AI$56,-1,0)),SUMIF('Interior - Space-By-Space'!$AK$16:OFFSET('Interior - Space-By-Space'!$AK$56,-1,0),$B123,'Interior - Space-By-Space'!$AM$16:OFFSET('Interior - Space-By-Space'!$AM$56,-1,0)),SUMIF('Interior - Space-By-Space'!$AO$16:OFFSET('Interior - Space-By-Space'!$AO$56,-1,0),$B123,'Interior - Space-By-Space'!$AQ$16:OFFSET('Interior - Space-By-Space'!$AQ$56,-1,0))),IF(ProjectMethod=BAM,SUM('Interior - Building Area Method'!$C134,'Interior - Building Area Method'!$E134,'Interior - Building Area Method'!$G134,'Interior - Building Area Method'!$I134,'Interior - Building Area Method'!$K134),0))+SUM(SUMIF(Exterior!$J$19:$J$69,$B123,Exterior!$K$19:$K$69),SUMIF(Exterior!$M$19:$M$69,$B123,Exterior!$N$19:$N$69),SUMIF(Exterior!$P$19:$P$69,$B123,Exterior!$Q$19:$Q$69),SUMIF(Exterior!$S$19:$S$69,$B123,Exterior!$T$19:$T$69),SUMIF(Exterior!$V$19:$V$69,$B123,Exterior!$W$19:$W$69))","v":0}]
[null,null,null,null,{"$f":"IF(ProjectMethod=SBS,SUM(SUMIF('Interior - Space-By-Space'!$M$16:OFFSET('Interior - Space-By-Space'!$M$56,-1,0),$B124,'Interior - Space-By-Space'!$O$16:OFFSET('Interior - Space-By-Space'!$O$56,-1,0)),SUMIF('Interior - Space-By-Space'!$Q$16:OFFSET('Interior - Space-By-Space'!$Q$56,-1,0),$B124,'Interior - Space-By-Space'!$S$16:OFFSET('Interior - Space-By-Space'!$S$56,-1,0)),SUMIF('Interior - Space-By-Space'!$U$16:OFFSET('Interior - Space-By-Space'!$U$56,-1,0),$B124,'Interior - Space-By-Space'!$W$16:OFFSET('Interior - Space-By-Space'!$W$56,-1,0)),SUMIF('Interior - Space-By-Space'!$Y$16:OFFSET('Interior - Space-By-Space'!$Y$56,-1,0),$B124,'Interior - Space-By-Space'!$AA$16:OFFSET('Interior - Space-By-Space'!$AA$56,-1,0)),SUMIF('Interior - Space-By-Space'!$AC$16:OFFSET('Interior - Space-By-Space'!$AC$56,-1,0),$B124,'Interior - Space-By-Space'!$AE$16:OFFSET('Interior - Space-By-Space'!$AE$56,-1,0)),SUMIF('Interior - Space-By-Space'!$AG$16:OFFSET('Interior - Space-By-Space'!$AG$56,-1,0),$B124,'Interior - Space-By-Space'!$AI$16:OFFSET('Interior - Space-By-Space'!$AI$56,-1,0)),SUMIF('Interior - Space-By-Space'!$AK$16:OFFSET('Interior - Space-By-Space'!$AK$56,-1,0),$B124,'Interior - Space-By-Space'!$AM$16:OFFSET('Interior - Space-By-Space'!$AM$56,-1,0)),SUMIF('Interior - Space-By-Space'!$AO$16:OFFSET('Interior - Space-By-Space'!$AO$56,-1,0),$B124,'Interior - Space-By-Space'!$AQ$16:OFFSET('Interior - Space-By-Space'!$AQ$56,-1,0))),IF(ProjectMethod=BAM,SUM('Interior - Building Area Method'!$C135,'Interior - Building Area Method'!$E135,'Interior - Building Area Method'!$G135,'Interior - Building Area Method'!$I135,'Interior - Building Area Method'!$K135),0))+SUM(SUMIF(Exterior!$J$19:$J$69,$B124,Exterior!$K$19:$K$69),SUMIF(Exterior!$M$19:$M$69,$B124,Exterior!$N$19:$N$69),SUMIF(Exterior!$P$19:$P$69,$B124,Exterior!$Q$19:$Q$69),SUMIF(Exterior!$S$19:$S$69,$B124,Exterior!$T$19:$T$69),SUMIF(Exterior!$V$19:$V$69,$B124,Exterior!$W$19:$W$69))","v":0}]
[null,null,null,null,{"$f":"IF(ProjectMethod=SBS,SUM(SUMIF('Interior - Space-By-Space'!$M$16:OFFSET('Interior - Space-By-Space'!$M$56,-1,0),$B125,'Interior - Space-By-Space'!$O$16:OFFSET('Interior - Space-By-Space'!$O$56,-1,0)),SUMIF('Interior - Space-By-Space'!$Q$16:OFFSET('Interior - Space-By-Space'!$Q$56,-1,0),$B125,'Interior - Space-By-Space'!$S$16:OFFSET('Interior - Space-By-Space'!$S$56,-1,0)),SUMIF('Interior - Space-By-Space'!$U$16:OFFSET('Interior - Space-By-Space'!$U$56,-1,0),$B125,'Interior - Space-By-Space'!$W$16:OFFSET('Interior - Space-By-Space'!$W$56,-1,0)),SUMIF('Interior - Space-By-Space'!$Y$16:OFFSET('Interior - Space-By-Space'!$Y$56,-1,0),$B125,'Interior - Space-By-Space'!$AA$16:OFFSET('Interior - Space-By-Space'!$AA$56,-1,0)),SUMIF('Interior - Space-By-Space'!$AC$16:OFFSET('Interior - Space-By-Space'!$AC$56,-1,0),$B125,'Interior - Space-By-Space'!$AE$16:OFFSET('Interior - Space-By-Space'!$AE$56,-1,0)),SUMIF('Interior - Space-By-Space'!$AG$16:OFFSET('Interior - Space-By-Space'!$AG$56,-1,0),$B125,'Interior - Space-By-Space'!$AI$16:OFFSET('Interior - Space-By-Space'!$AI$56,-1,0)),SUMIF('Interior - Space-By-Space'!$AK$16:OFFSET('Interior - Space-By-Space'!$AK$56,-1,0),$B125,'Interior - Space-By-Space'!$AM$16:OFFSET('Interior - Space-By-Space'!$AM$56,-1,0)),SUMIF('Interior - Space-By-Space'!$AO$16:OFFSET('Interior - Space-By-Space'!$AO$56,-1,0),$B125,'Interior - Space-By-Space'!$AQ$16:OFFSET('Interior - Space-By-Space'!$AQ$56,-1,0))),IF(ProjectMethod=BAM,SUM('Interior - Building Area Method'!$C136,'Interior - Building Area Method'!$E136,'Interior - Building Area Method'!$G136,'Interior - Building Area Method'!$I136,'Interior - Building Area Method'!$K136),0))+SUM(SUMIF(Exterior!$J$19:$J$69,$B125,Exterior!$K$19:$K$69),SUMIF(Exterior!$M$19:$M$69,$B125,Exterior!$N$19:$N$69),SUMIF(Exterior!$P$19:$P$69,$B125,Exterior!$Q$19:$Q$69),SUMIF(Exterior!$S$19:$S$69,$B125,Exterior!$T$19:$T$69),SUMIF(Exterior!$V$19:$V$69,$B125,Exterior!$W$19:$W$69))","v":0}]
[null,null,null,null,{"$f":"IF(ProjectMethod=SBS,SUM(SUMIF('Interior - Space-By-Space'!$M$16:OFFSET('Interior - Space-By-Space'!$M$56,-1,0),$B126,'Interior - Space-By-Space'!$O$16:OFFSET('Interior - Space-By-Space'!$O$56,-1,0)),SUMIF('Interior - Space-By-Space'!$Q$16:OFFSET('Interior - Space-By-Space'!$Q$56,-1,0),$B126,'Interior - Space-By-Space'!$S$16:OFFSET('Interior - Space-By-Space'!$S$56,-1,0)),SUMIF('Interior - Space-By-Space'!$U$16:OFFSET('Interior - Space-By-Space'!$U$56,-1,0),$B126,'Interior - Space-By-Space'!$W$16:OFFSET('Interior - Space-By-Space'!$W$56,-1,0)),SUMIF('Interior - Space-By-Space'!$Y$16:OFFSET('Interior - Space-By-Space'!$Y$56,-1,0),$B126,'Interior - Space-By-Space'!$AA$16:OFFSET('Interior - Space-By-Space'!$AA$56,-1,0)),SUMIF('Interior - Space-By-Space'!$AC$16:OFFSET('Interior - Space-By-Space'!$AC$56,-1,0),$B126,'Interior - Space-By-Space'!$AE$16:OFFSET('Interior - Space-By-Space'!$AE$56,-1,0)),SUMIF('Interior - Space-By-Space'!$AG$16:OFFSET('Interior - Space-By-Space'!$AG$56,-1,0),$B126,'Interior - Space-By-Space'!$AI$16:OFFSET('Interior - Space-By-Space'!$AI$56,-1,0)),SUMIF('Interior - Space-By-Space'!$AK$16:OFFSET('Interior - Space-By-Space'!$AK$56,-1,0),$B126,'Interior - Space-By-Space'!$AM$16:OFFSET('Interior - Space-By-Space'!$AM$56,-1,0)),SUMIF('Interior - Space-By-Space'!$AO$16:OFFSET('Interior - Space-By-Space'!$AO$56,-1,0),$B126,'Interior - Space-By-Space'!$AQ$16:OFFSET('Interior - Space-By-Space'!$AQ$56,-1,0))),IF(ProjectMethod=BAM,SUM('Interior - Building Area Method'!$C137,'Interior - Building Area Method'!$E137,'Interior - Building Area Method'!$G137,'Interior - Building Area Method'!$I137,'Interior - Building Area Method'!$K137),0))+SUM(SUMIF(Exterior!$J$19:$J$69,$B126,Exterior!$K$19:$K$69),SUMIF(Exterior!$M$19:$M$69,$B126,Exterior!$N$19:$N$69),SUMIF(Exterior!$P$19:$P$69,$B126,Exterior!$Q$19:$Q$69),SUMIF(Exterior!$S$19:$S$69,$B126,Exterior!$T$19:$T$69),SUMIF(Exterior!$V$19:$V$69,$B126,Exterior!$W$19:$W$69))","v":0}]
[null,null,null,null,{"$f":"IF(ProjectMethod=SBS,SUM(SUMIF('Interior - Space-By-Space'!$M$16:OFFSET('Interior - Space-By-Space'!$M$56,-1,0),$B127,'Interior - Space-By-Space'!$O$16:OFFSET('Interior - Space-By-Space'!$O$56,-1,0)),SUMIF('Interior - Space-By-Space'!$Q$16:OFFSET('Interior - Space-By-Space'!$Q$56,-1,0),$B127,'Interior - Space-By-Space'!$S$16:OFFSET('Interior - Space-By-Space'!$S$56,-1,0)),SUMIF('Interior - Space-By-Space'!$U$16:OFFSET('Interior - Space-By-Space'!$U$56,-1,0),$B127,'Interior - Space-By-Space'!$W$16:OFFSET('Interior - Space-By-Space'!$W$56,-1,0)),SUMIF('Interior - Space-By-Space'!$Y$16:OFFSET('Interior - Space-By-Space'!$Y$56,-1,0),$B127,'Interior - Space-By-Space'!$AA$16:OFFSET('Interior - Space-By-Space'!$AA$56,-1,0)),SUMIF('Interior - Space-By-Space'!$AC$16:OFFSET('Interior - Space-By-Space'!$AC$56,-1,0),$B127,'Interior - Space-By-Space'!$AE$16:OFFSET('Interior - Space-By-Space'!$AE$56,-1,0)),SUMIF('Interior - Space-By-Space'!$AG$16:OFFSET('Interior - Space-By-Space'!$AG$56,-1,0),$B127,'Interior - Space-By-Space'!$AI$16:OFFSET('Interior - Space-By-Space'!$AI$56,-1,0)),SUMIF('Interior - Space-By-Space'!$AK$16:OFFSET('Interior - Space-By-Space'!$AK$56,-1,0),$B127,'Interior - Space-By-Space'!$AM$16:OFFSET('Interior - Space-By-Space'!$AM$56,-1,0)),SUMIF('Interior - Space-By-Space'!$AO$16:OFFSET('Interior - Space-By-Space'!$AO$56,-1,0),$B127,'Interior - Space-By-Space'!$AQ$16:OFFSET('Interior - Space-By-Space'!$AQ$56,-1,0))),IF(ProjectMethod=BAM,SUM('Interior - Building Area Method'!$C138,'Interior - Building Area Method'!$E138,'Interior - Building Area Method'!$G138,'Interior - Building Area Method'!$I138,'Interior - Building Area Method'!$K138),0))+SUM(SUMIF(Exterior!$J$19:$J$69,$B127,Exterior!$K$19:$K$69),SUMIF(Exterior!$M$19:$M$69,$B127,Exterior!$N$19:$N$69),SUMIF(Exterior!$P$19:$P$69,$B127,Exterior!$Q$19:$Q$69),SUMIF(Exterior!$S$19:$S$69,$B127,Exterior!$T$19:$T$69),SUMIF(Exterior!$V$19:$V$69,$B127,Exterior!$W$19:$W$69))","v":0}]
[null,null,null,null,{"$f":"IF(ProjectMethod=SBS,SUM(SUMIF('Interior - Space-By-Space'!$M$16:OFFSET('Interior - Space-By-Space'!$M$56,-1,0),$B128,'Interior - Space-By-Space'!$O$16:OFFSET('Interior - Space-By-Space'!$O$56,-1,0)),SUMIF('Interior - Space-By-Space'!$Q$16:OFFSET('Interior - Space-By-Space'!$Q$56,-1,0),$B128,'Interior - Space-By-Space'!$S$16:OFFSET('Interior - Space-By-Space'!$S$56,-1,0)),SUMIF('Interior - Space-By-Space'!$U$16:OFFSET('Interior - Space-By-Space'!$U$56,-1,0),$B128,'Interior - Space-By-Space'!$W$16:OFFSET('Interior - Space-By-Space'!$W$56,-1,0)),SUMIF('Interior - Space-By-Space'!$Y$16:OFFSET('Interior - Space-By-Space'!$Y$56,-1,0),$B128,'Interior - Space-By-Space'!$AA$16:OFFSET('Interior - Space-By-Space'!$AA$56,-1,0)),SUMIF('Interior - Space-By-Space'!$AC$16:OFFSET('Interior - Space-By-Space'!$AC$56,-1,0),$B128,'Interior - Space-By-Space'!$AE$16:OFFSET('Interior - Space-By-Space'!$AE$56,-1,0)),SUMIF('Interior - Space-By-Space'!$AG$16:OFFSET('Interior - Space-By-Space'!$AG$56,-1,0),$B128,'Interior - Space-By-Space'!$AI$16:OFFSET('Interior - Space-By-Space'!$AI$56,-1,0)),SUMIF('Interior - Space-By-Space'!$AK$16:OFFSET('Interior - Space-By-Space'!$AK$56,-1,0),$B128,'Interior - Space-By-Space'!$AM$16:OFFSET('Interior - Space-By-Space'!$AM$56,-1,0)),SUMIF('Interior - Space-By-Space'!$AO$16:OFFSET('Interior - Space-By-Space'!$AO$56,-1,0),$B128,'Interior - Space-By-Space'!$AQ$16:OFFSET('Interior - Space-By-Space'!$AQ$56,-1,0))),IF(ProjectMethod=BAM,SUM('Interior - Building Area Method'!$C139,'Interior - Building Area Method'!$E139,'Interior - Building Area Method'!$G139,'Interior - Building Area Method'!$I139,'Interior - Building Area Method'!$K139),0))+SUM(SUMIF(Exterior!$J$19:$J$69,$B128,Exterior!$K$19:$K$69),SUMIF(Exterior!$M$19:$M$69,$B128,Exterior!$N$19:$N$69),SUMIF(Exterior!$P$19:$P$69,$B128,Exterior!$Q$19:$Q$69),SUMIF(Exterior!$S$19:$S$69,$B128,Exterior!$T$19:$T$69),SUMIF(Exterior!$V$19:$V$69,$B128,Exterior!$W$19:$W$69))","v":0}]
[null,null,null,null,{"$f":"IF(ProjectMethod=SBS,SUM(SUMIF('Interior - Space-By-Space'!$M$16:OFFSET('Interior - Space-By-Space'!$M$56,-1,0),$B129,'Interior - Space-By-Space'!$O$16:OFFSET('Interior - Space-By-Space'!$O$56,-1,0)),SUMIF('Interior - Space-By-Space'!$Q$16:OFFSET('Interior - Space-By-Space'!$Q$56,-1,0),$B129,'Interior - Space-By-Space'!$S$16:OFFSET('Interior - Space-By-Space'!$S$56,-1,0)),SUMIF('Interior - Space-By-Space'!$U$16:OFFSET('Interior - Space-By-Space'!$U$56,-1,0),$B129,'Interior - Space-By-Space'!$W$16:OFFSET('Interior - Space-By-Space'!$W$56,-1,0)),SUMIF('Interior - Space-By-Space'!$Y$16:OFFSET('Interior - Space-By-Space'!$Y$56,-1,0),$B129,'Interior - Space-By-Space'!$AA$16:OFFSET('Interior - Space-By-Space'!$AA$56,-1,0)),SUMIF('Interior - Space-By-Space'!$AC$16:OFFSET('Interior - Space-By-Space'!$AC$56,-1,0),$B129,'Interior - Space-By-Space'!$AE$16:OFFSET('Interior - Space-By-Space'!$AE$56,-1,0)),SUMIF('Interior - Space-By-Space'!$AG$16:OFFSET('Interior - Space-By-Space'!$AG$56,-1,0),$B129,'Interior - Space-By-Space'!$AI$16:OFFSET('Interior - Space-By-Space'!$AI$56,-1,0)),SUMIF('Interior - Space-By-Space'!$AK$16:OFFSET('Interior - Space-By-Space'!$AK$56,-1,0),$B129,'Interior - Space-By-Space'!$AM$16:OFFSET('Interior - Space-By-Space'!$AM$56,-1,0)),SUMIF('Interior - Space-By-Space'!$AO$16:OFFSET('Interior - Space-By-Space'!$AO$56,-1,0),$B129,'Interior - Space-By-Space'!$AQ$16:OFFSET('Interior - Space-By-Space'!$AQ$56,-1,0))),IF(ProjectMethod=BAM,SUM('Interior - Building Area Method'!$C140,'Interior - Building Area Method'!$E140,'Interior - Building Area Method'!$G140,'Interior - Building Area Method'!$I140,'Interior - Building Area Method'!$K140),0))+SUM(SUMIF(Exterior!$J$19:$J$69,$B129,Exterior!$K$19:$K$69),SUMIF(Exterior!$M$19:$M$69,$B129,Exterior!$N$19:$N$69),SUMIF(Exterior!$P$19:$P$69,$B129,Exterior!$Q$19:$Q$69),SUMIF(Exterior!$S$19:$S$69,$B129,Exterior!$T$19:$T$69),SUMIF(Exterior!$V$19:$V$69,$B129,Exterior!$W$19:$W$69))","v":0}]
[null,null,null,null,{"$f":"IF(ProjectMethod=SBS,SUM(SUMIF('Interior - Space-By-Space'!$M$16:OFFSET('Interior - Space-By-Space'!$M$56,-1,0),$B130,'Interior - Space-By-Space'!$O$16:OFFSET('Interior - Space-By-Space'!$O$56,-1,0)),SUMIF('Interior - Space-By-Space'!$Q$16:OFFSET('Interior - Space-By-Space'!$Q$56,-1,0),$B130,'Interior - Space-By-Space'!$S$16:OFFSET('Interior - Space-By-Space'!$S$56,-1,0)),SUMIF('Interior - Space-By-Space'!$U$16:OFFSET('Interior - Space-By-Space'!$U$56,-1,0),$B130,'Interior - Space-By-Space'!$W$16:OFFSET('Interior - Space-By-Space'!$W$56,-1,0)),SUMIF('Interior - Space-By-Space'!$Y$16:OFFSET('Interior - Space-By-Space'!$Y$56,-1,0),$B130,'Interior - Space-By-Space'!$AA$16:OFFSET('Interior - Space-By-Space'!$AA$56,-1,0)),SUMIF('Interior - Space-By-Space'!$AC$16:OFFSET('Interior - Space-By-Space'!$AC$56,-1,0),$B130,'Interior - Space-By-Space'!$AE$16:OFFSET('Interior - Space-By-Space'!$AE$56,-1,0)),SUMIF('Interior - Space-By-Space'!$AG$16:OFFSET('Interior - Space-By-Space'!$AG$56,-1,0),$B130,'Interior - Space-By-Space'!$AI$16:OFFSET('Interior - Space-By-Space'!$AI$56,-1,0)),SUMIF('Interior - Space-By-Space'!$AK$16:OFFSET('Interior - Space-By-Space'!$AK$56,-1,0),$B130,'Interior - Space-By-Space'!$AM$16:OFFSET('Interior - Space-By-Space'!$AM$56,-1,0)),SUMIF('Interior - Space-By-Space'!$AO$16:OFFSET('Interior - Space-By-Space'!$AO$56,-1,0),$B130,'Interior - Space-By-Space'!$AQ$16:OFFSET('Interior - Space-By-Space'!$AQ$56,-1,0))),IF(ProjectMethod=BAM,SUM('Interior - Building Area Method'!$C141,'Interior - Building Area Method'!$E141,'Interior - Building Area Method'!$G141,'Interior - Building Area Method'!$I141,'Interior - Building Area Method'!$K141),0))+SUM(SUMIF(Exterior!$J$19:$J$69,$B130,Exterior!$K$19:$K$69),SUMIF(Exterior!$M$19:$M$69,$B130,Exterior!$N$19:$N$69),SUMIF(Exterior!$P$19:$P$69,$B130,Exterior!$Q$19:$Q$69),SUMIF(Exterior!$S$19:$S$69,$B130,Exterior!$T$19:$T$69),SUMIF(Exterior!$V$19:$V$69,$B130,Exterior!$W$19:$W$69))","v":0}]
[null,null,null,null,{"$f":"IF(ProjectMethod=SBS,SUM(SUMIF('Interior - Space-By-Space'!$M$16:OFFSET('Interior - Space-By-Space'!$M$56,-1,0),$B131,'Interior - Space-By-Space'!$O$16:OFFSET('Interior - Space-By-Space'!$O$56,-1,0)),SUMIF('Interior - Space-By-Space'!$Q$16:OFFSET('Interior - Space-By-Space'!$Q$56,-1,0),$B131,'Interior - Space-By-Space'!$S$16:OFFSET('Interior - Space-By-Space'!$S$56,-1,0)),SUMIF('Interior - Space-By-Space'!$U$16:OFFSET('Interior - Space-By-Space'!$U$56,-1,0),$B131,'Interior - Space-By-Space'!$W$16:OFFSET('Interior - Space-By-Space'!$W$56,-1,0)),SUMIF('Interior - Space-By-Space'!$Y$16:OFFSET('Interior - Space-By-Space'!$Y$56,-1,0),$B131,'Interior - Space-By-Space'!$AA$16:OFFSET('Interior - Space-By-Space'!$AA$56,-1,0)),SUMIF('Interior - Space-By-Space'!$AC$16:OFFSET('Interior - Space-By-Space'!$AC$56,-1,0),$B131,'Interior - Space-By-Space'!$AE$16:OFFSET('Interior - Space-By-Space'!$AE$56,-1,0)),SUMIF('Interior - Space-By-Space'!$AG$16:OFFSET('Interior - Space-By-Space'!$AG$56,-1,0),$B131,'Interior - Space-By-Space'!$AI$16:OFFSET('Interior - Space-By-Space'!$AI$56,-1,0)),SUMIF('Interior - Space-By-Space'!$AK$16:OFFSET('Interior - Space-By-Space'!$AK$56,-1,0),$B131,'Interior - Space-By-Space'!$AM$16:OFFSET('Interior - Space-By-Space'!$AM$56,-1,0)),SUMIF('Interior - Space-By-Space'!$AO$16:OFFSET('Interior - Space-By-Space'!$AO$56,-1,0),$B131,'Interior - Space-By-Space'!$AQ$16:OFFSET('Interior - Space-By-Space'!$AQ$56,-1,0))),IF(ProjectMethod=BAM,SUM('Interior - Building Area Method'!$C142,'Interior - Building Area Method'!$E142,'Interior - Building Area Method'!$G142,'Interior - Building Area Method'!$I142,'Interior - Building Area Method'!$K142),0))+SUM(SUMIF(Exterior!$J$19:$J$69,$B131,Exterior!$K$19:$K$69),SUMIF(Exterior!$M$19:$M$69,$B131,Exterior!$N$19:$N$69),SUMIF(Exterior!$P$19:$P$69,$B131,Exterior!$Q$19:$Q$69),SUMIF(Exterior!$S$19:$S$69,$B131,Exterior!$T$19:$T$69),SUMIF(Exterior!$V$19:$V$69,$B131,Exterior!$W$19:$W$69))","v":0}]
[null,null,null,null,{"$f":"IF(ProjectMethod=SBS,SUM(SUMIF('Interior - Space-By-Space'!$M$16:OFFSET('Interior - Space-By-Space'!$M$56,-1,0),$B132,'Interior - Space-By-Space'!$O$16:OFFSET('Interior - Space-By-Space'!$O$56,-1,0)),SUMIF('Interior - Space-By-Space'!$Q$16:OFFSET('Interior - Space-By-Space'!$Q$56,-1,0),$B132,'Interior - Space-By-Space'!$S$16:OFFSET('Interior - Space-By-Space'!$S$56,-1,0)),SUMIF('Interior - Space-By-Space'!$U$16:OFFSET('Interior - Space-By-Space'!$U$56,-1,0),$B132,'Interior - Space-By-Space'!$W$16:OFFSET('Interior - Space-By-Space'!$W$56,-1,0)),SUMIF('Interior - Space-By-Space'!$Y$16:OFFSET('Interior - Space-By-Space'!$Y$56,-1,0),$B132,'Interior - Space-By-Space'!$AA$16:OFFSET('Interior - Space-By-Space'!$AA$56,-1,0)),SUMIF('Interior - Space-By-Space'!$AC$16:OFFSET('Interior - Space-By-Space'!$AC$56,-1,0),$B132,'Interior - Space-By-Space'!$AE$16:OFFSET('Interior - Space-By-Space'!$AE$56,-1,0)),SUMIF('Interior - Space-By-Space'!$AG$16:OFFSET('Interior - Space-By-Space'!$AG$56,-1,0),$B132,'Interior - Space-By-Space'!$AI$16:OFFSET('Interior - Space-By-Space'!$AI$56,-1,0)),SUMIF('Interior - Space-By-Space'!$AK$16:OFFSET('Interior - Space-By-Space'!$AK$56,-1,0),$B132,'Interior - Space-By-Space'!$AM$16:OFFSET('Interior - Space-By-Space'!$AM$56,-1,0)),SUMIF('Interior - Space-By-Space'!$AO$16:OFFSET('Interior - Space-By-Space'!$AO$56,-1,0),$B132,'Interior - Space-By-Space'!$AQ$16:OFFSET('Interior - Space-By-Space'!$AQ$56,-1,0))),IF(ProjectMethod=BAM,SUM('Interior - Building Area Method'!$C143,'Interior - Building Area Method'!$E143,'Interior - Building Area Method'!$G143,'Interior - Building Area Method'!$I143,'Interior - Building Area Method'!$K143),0))+SUM(SUMIF(Exterior!$J$19:$J$69,$B132,Exterior!$K$19:$K$69),SUMIF(Exterior!$M$19:$M$69,$B132,Exterior!$N$19:$N$69),SUMIF(Exterior!$P$19:$P$69,$B132,Exterior!$Q$19:$Q$69),SUMIF(Exterior!$S$19:$S$69,$B132,Exterior!$T$19:$T$69),SUMIF(Exterior!$V$19:$V$69,$B132,Exterior!$W$19:$W$69))","v":0}]
[null,null,null,null,{"$f":"IF(ProjectMethod=SBS,SUM(SUMIF('Interior - Space-By-Space'!$M$16:OFFSET('Interior - Space-By-Space'!$M$56,-1,0),$B133,'Interior - Space-By-Space'!$O$16:OFFSET('Interior - Space-By-Space'!$O$56,-1,0)),SUMIF('Interior - Space-By-Space'!$Q$16:OFFSET('Interior - Space-By-Space'!$Q$56,-1,0),$B133,'Interior - Space-By-Space'!$S$16:OFFSET('Interior - Space-By-Space'!$S$56,-1,0)),SUMIF('Interior - Space-By-Space'!$U$16:OFFSET('Interior - Space-By-Space'!$U$56,-1,0),$B133,'Interior - Space-By-Space'!$W$16:OFFSET('Interior - Space-By-Space'!$W$56,-1,0)),SUMIF('Interior - Space-By-Space'!$Y$16:OFFSET('Interior - Space-By-Space'!$Y$56,-1,0),$B133,'Interior - Space-By-Space'!$AA$16:OFFSET('Interior - Space-By-Space'!$AA$56,-1,0)),SUMIF('Interior - Space-By-Space'!$AC$16:OFFSET('Interior - Space-By-Space'!$AC$56,-1,0),$B133,'Interior - Space-By-Space'!$AE$16:OFFSET('Interior - Space-By-Space'!$AE$56,-1,0)),SUMIF('Interior - Space-By-Space'!$AG$16:OFFSET('Interior - Space-By-Space'!$AG$56,-1,0),$B133,'Interior - Space-By-Space'!$AI$16:OFFSET('Interior - Space-By-Space'!$AI$56,-1,0)),SUMIF('Interior - Space-By-Space'!$AK$16:OFFSET('Interior - Space-By-Space'!$AK$56,-1,0),$B133,'Interior - Space-By-Space'!$AM$16:OFFSET('Interior - Space-By-Space'!$AM$56,-1,0)),SUMIF('Interior - Space-By-Space'!$AO$16:OFFSET('Interior - Space-By-Space'!$AO$56,-1,0),$B133,'Interior - Space-By-Space'!$AQ$16:OFFSET('Interior - Space-By-Space'!$AQ$56,-1,0))),IF(ProjectMethod=BAM,SUM('Interior - Building Area Method'!$C144,'Interior - Building Area Method'!$E144,'Interior - Building Area Method'!$G144,'Interior - Building Area Method'!$I144,'Interior - Building Area Method'!$K144),0))+SUM(SUMIF(Exterior!$J$19:$J$69,$B133,Exterior!$K$19:$K$69),SUMIF(Exterior!$M$19:$M$69,$B133,Exterior!$N$19:$N$69),SUMIF(Exterior!$P$19:$P$69,$B133,Exterior!$Q$19:$Q$69),SUMIF(Exterior!$S$19:$S$69,$B133,Exterior!$T$19:$T$69),SUMIF(Exterior!$V$19:$V$69,$B133,Exterior!$W$19:$W$69))","v":0}]
[null,null,null,null,{"$f":"IF(ProjectMethod=SBS,SUM(SUMIF('Interior - Space-By-Space'!$M$16:OFFSET('Interior - Space-By-Space'!$M$56,-1,0),$B134,'Interior - Space-By-Space'!$O$16:OFFSET('Interior - Space-By-Space'!$O$56,-1,0)),SUMIF('Interior - Space-By-Space'!$Q$16:OFFSET('Interior - Space-By-Space'!$Q$56,-1,0),$B134,'Interior - Space-By-Space'!$S$16:OFFSET('Interior - Space-By-Space'!$S$56,-1,0)),SUMIF('Interior - Space-By-Space'!$U$16:OFFSET('Interior - Space-By-Space'!$U$56,-1,0),$B134,'Interior - Space-By-Space'!$W$16:OFFSET('Interior - Space-By-Space'!$W$56,-1,0)),SUMIF('Interior - Space-By-Space'!$Y$16:OFFSET('Interior - Space-By-Space'!$Y$56,-1,0),$B134,'Interior - Space-By-Space'!$AA$16:OFFSET('Interior - Space-By-Space'!$AA$56,-1,0)),SUMIF('Interior - Space-By-Space'!$AC$16:OFFSET('Interior - Space-By-Space'!$AC$56,-1,0),$B134,'Interior - Space-By-Space'!$AE$16:OFFSET('Interior - Space-By-Space'!$AE$56,-1,0)),SUMIF('Interior - Space-By-Space'!$AG$16:OFFSET('Interior - Space-By-Space'!$AG$56,-1,0),$B134,'Interior - Space-By-Space'!$AI$16:OFFSET('Interior - Space-By-Space'!$AI$56,-1,0)),SUMIF('Interior - Space-By-Space'!$AK$16:OFFSET('Interior - Space-By-Space'!$AK$56,-1,0),$B134,'Interior - Space-By-Space'!$AM$16:OFFSET('Interior - Space-By-Space'!$AM$56,-1,0)),SUMIF('Interior - Space-By-Space'!$AO$16:OFFSET('Interior - Space-By-Space'!$AO$56,-1,0),$B134,'Interior - Space-By-Space'!$AQ$16:OFFSET('Interior - Space-By-Space'!$AQ$56,-1,0))),IF(ProjectMethod=BAM,SUM('Interior - Building Area Method'!$C145,'Interior - Building Area Method'!$E145,'Interior - Building Area Method'!$G145,'Interior - Building Area Method'!$I145,'Interior - Building Area Method'!$K145),0))+SUM(SUMIF(Exterior!$J$19:$J$69,$B134,Exterior!$K$19:$K$69),SUMIF(Exterior!$M$19:$M$69,$B134,Exterior!$N$19:$N$69),SUMIF(Exterior!$P$19:$P$69,$B134,Exterior!$Q$19:$Q$69),SUMIF(Exterior!$S$19:$S$69,$B134,Exterior!$T$19:$T$69),SUMIF(Exterior!$V$19:$V$69,$B134,Exterior!$W$19:$W$69))","v":0}]
[null,null,null,null,{"$f":"IF(ProjectMethod=SBS,SUM(SUMIF('Interior - Space-By-Space'!$M$16:OFFSET('Interior - Space-By-Space'!$M$56,-1,0),$B135,'Interior - Space-By-Space'!$O$16:OFFSET('Interior - Space-By-Space'!$O$56,-1,0)),SUMIF('Interior - Space-By-Space'!$Q$16:OFFSET('Interior - Space-By-Space'!$Q$56,-1,0),$B135,'Interior - Space-By-Space'!$S$16:OFFSET('Interior - Space-By-Space'!$S$56,-1,0)),SUMIF('Interior - Space-By-Space'!$U$16:OFFSET('Interior - Space-By-Space'!$U$56,-1,0),$B135,'Interior - Space-By-Space'!$W$16:OFFSET('Interior - Space-By-Space'!$W$56,-1,0)),SUMIF('Interior - Space-By-Space'!$Y$16:OFFSET('Interior - Space-By-Space'!$Y$56,-1,0),$B135,'Interior - Space-By-Space'!$AA$16:OFFSET('Interior - Space-By-Space'!$AA$56,-1,0)),SUMIF('Interior - Space-By-Space'!$AC$16:OFFSET('Interior - Space-By-Space'!$AC$56,-1,0),$B135,'Interior - Space-By-Space'!$AE$16:OFFSET('Interior - Space-By-Space'!$AE$56,-1,0)),SUMIF('Interior - Space-By-Space'!$AG$16:OFFSET('Interior - Space-By-Space'!$AG$56,-1,0),$B135,'Interior - Space-By-Space'!$AI$16:OFFSET('Interior - Space-By-Space'!$AI$56,-1,0)),SUMIF('Interior - Space-By-Space'!$AK$16:OFFSET('Interior - Space-By-Space'!$AK$56,-1,0),$B135,'Interior - Space-By-Space'!$AM$16:OFFSET('Interior - Space-By-Space'!$AM$56,-1,0)),SUMIF('Interior - Space-By-Space'!$AO$16:OFFSET('Interior - Space-By-Space'!$AO$56,-1,0),$B135,'Interior - Space-By-Space'!$AQ$16:OFFSET('Interior - Space-By-Space'!$AQ$56,-1,0))),IF(ProjectMethod=BAM,SUM('Interior - Building Area Method'!$C146,'Interior - Building Area Method'!$E146,'Interior - Building Area Method'!$G146,'Interior - Building Area Method'!$I146,'Interior - Building Area Method'!$K146),0))+SUM(SUMIF(Exterior!$J$19:$J$69,$B135,Exterior!$K$19:$K$69),SUMIF(Exterior!$M$19:$M$69,$B135,Exterior!$N$19:$N$69),SUMIF(Exterior!$P$19:$P$69,$B135,Exterior!$Q$19:$Q$69),SUMIF(Exterior!$S$19:$S$69,$B135,Exterior!$T$19:$T$69),SUMIF(Exterior!$V$19:$V$69,$B135,Exterior!$W$19:$W$69))","v":0}]
[null,null,null,null,{"$f":"IF(ProjectMethod=SBS,SUM(SUMIF('Interior - Space-By-Space'!$M$16:OFFSET('Interior - Space-By-Space'!$M$56,-1,0),$B136,'Interior - Space-By-Space'!$O$16:OFFSET('Interior - Space-By-Space'!$O$56,-1,0)),SUMIF('Interior - Space-By-Space'!$Q$16:OFFSET('Interior - Space-By-Space'!$Q$56,-1,0),$B136,'Interior - Space-By-Space'!$S$16:OFFSET('Interior - Space-By-Space'!$S$56,-1,0)),SUMIF('Interior - Space-By-Space'!$U$16:OFFSET('Interior - Space-By-Space'!$U$56,-1,0),$B136,'Interior - Space-By-Space'!$W$16:OFFSET('Interior - Space-By-Space'!$W$56,-1,0)),SUMIF('Interior - Space-By-Space'!$Y$16:OFFSET('Interior - Space-By-Space'!$Y$56,-1,0),$B136,'Interior - Space-By-Space'!$AA$16:OFFSET('Interior - Space-By-Space'!$AA$56,-1,0)),SUMIF('Interior - Space-By-Space'!$AC$16:OFFSET('Interior - Space-By-Space'!$AC$56,-1,0),$B136,'Interior - Space-By-Space'!$AE$16:OFFSET('Interior - Space-By-Space'!$AE$56,-1,0)),SUMIF('Interior - Space-By-Space'!$AG$16:OFFSET('Interior - Space-By-Space'!$AG$56,-1,0),$B136,'Interior - Space-By-Space'!$AI$16:OFFSET('Interior - Space-By-Space'!$AI$56,-1,0)),SUMIF('Interior - Space-By-Space'!$AK$16:OFFSET('Interior - Space-By-Space'!$AK$56,-1,0),$B136,'Interior - Space-By-Space'!$AM$16:OFFSET('Interior - Space-By-Space'!$AM$56,-1,0)),SUMIF('Interior - Space-By-Space'!$AO$16:OFFSET('Interior - Space-By-Space'!$AO$56,-1,0),$B136,'Interior - Space-By-Space'!$AQ$16:OFFSET('Interior - Space-By-Space'!$AQ$56,-1,0))),IF(ProjectMethod=BAM,SUM('Interior - Building Area Method'!$C147,'Interior - Building Area Method'!$E147,'Interior - Building Area Method'!$G147,'Interior - Building Area Method'!$I147,'Interior - Building Area Method'!$K147),0))+SUM(SUMIF(Exterior!$J$19:$J$69,$B136,Exterior!$K$19:$K$69),SUMIF(Exterior!$M$19:$M$69,$B136,Exterior!$N$19:$N$69),SUMIF(Exterior!$P$19:$P$69,$B136,Exterior!$Q$19:$Q$69),SUMIF(Exterior!$S$19:$S$69,$B136,Exterior!$T$19:$T$69),SUMIF(Exterior!$V$19:$V$69,$B136,Exterior!$W$19:$W$69))","v":0}]
[null,null,null,null,{"$f":"IF(ProjectMethod=SBS,SUM(SUMIF('Interior - Space-By-Space'!$M$16:OFFSET('Interior - Space-By-Space'!$M$56,-1,0),$B137,'Interior - Space-By-Space'!$O$16:OFFSET('Interior - Space-By-Space'!$O$56,-1,0)),SUMIF('Interior - Space-By-Space'!$Q$16:OFFSET('Interior - Space-By-Space'!$Q$56,-1,0),$B137,'Interior - Space-By-Space'!$S$16:OFFSET('Interior - Space-By-Space'!$S$56,-1,0)),SUMIF('Interior - Space-By-Space'!$U$16:OFFSET('Interior - Space-By-Space'!$U$56,-1,0),$B137,'Interior - Space-By-Space'!$W$16:OFFSET('Interior - Space-By-Space'!$W$56,-1,0)),SUMIF('Interior - Space-By-Space'!$Y$16:OFFSET('Interior - Space-By-Space'!$Y$56,-1,0),$B137,'Interior - Space-By-Space'!$AA$16:OFFSET('Interior - Space-By-Space'!$AA$56,-1,0)),SUMIF('Interior - Space-By-Space'!$AC$16:OFFSET('Interior - Space-By-Space'!$AC$56,-1,0),$B137,'Interior - Space-By-Space'!$AE$16:OFFSET('Interior - Space-By-Space'!$AE$56,-1,0)),SUMIF('Interior - Space-By-Space'!$AG$16:OFFSET('Interior - Space-By-Space'!$AG$56,-1,0),$B137,'Interior - Space-By-Space'!$AI$16:OFFSET('Interior - Space-By-Space'!$AI$56,-1,0)),SUMIF('Interior - Space-By-Space'!$AK$16:OFFSET('Interior - Space-By-Space'!$AK$56,-1,0),$B137,'Interior - Space-By-Space'!$AM$16:OFFSET('Interior - Space-By-Space'!$AM$56,-1,0)),SUMIF('Interior - Space-By-Space'!$AO$16:OFFSET('Interior - Space-By-Space'!$AO$56,-1,0),$B137,'Interior - Space-By-Space'!$AQ$16:OFFSET('Interior - Space-By-Space'!$AQ$56,-1,0))),IF(ProjectMethod=BAM,SUM('Interior - Building Area Method'!$C148,'Interior - Building Area Method'!$E148,'Interior - Building Area Method'!$G148,'Interior - Building Area Method'!$I148,'Interior - Building Area Method'!$K148),0))+SUM(SUMIF(Exterior!$J$19:$J$69,$B137,Exterior!$K$19:$K$69),SUMIF(Exterior!$M$19:$M$69,$B137,Exterior!$N$19:$N$69),SUMIF(Exterior!$P$19:$P$69,$B137,Exterior!$Q$19:$Q$69),SUMIF(Exterior!$S$19:$S$69,$B137,Exterior!$T$19:$T$69),SUMIF(Exterior!$V$19:$V$69,$B137,Exterior!$W$19:$W$69))","v":0}]
[null,null,null,null,{"$f":"IF(ProjectMethod=SBS,SUM(SUMIF('Interior - Space-By-Space'!$M$16:OFFSET('Interior - Space-By-Space'!$M$56,-1,0),$B138,'Interior - Space-By-Space'!$O$16:OFFSET('Interior - Space-By-Space'!$O$56,-1,0)),SUMIF('Interior - Space-By-Space'!$Q$16:OFFSET('Interior - Space-By-Space'!$Q$56,-1,0),$B138,'Interior - Space-By-Space'!$S$16:OFFSET('Interior - Space-By-Space'!$S$56,-1,0)),SUMIF('Interior - Space-By-Space'!$U$16:OFFSET('Interior - Space-By-Space'!$U$56,-1,0),$B138,'Interior - Space-By-Space'!$W$16:OFFSET('Interior - Space-By-Space'!$W$56,-1,0)),SUMIF('Interior - Space-By-Space'!$Y$16:OFFSET('Interior - Space-By-Space'!$Y$56,-1,0),$B138,'Interior - Space-By-Space'!$AA$16:OFFSET('Interior - Space-By-Space'!$AA$56,-1,0)),SUMIF('Interior - Space-By-Space'!$AC$16:OFFSET('Interior - Space-By-Space'!$AC$56,-1,0),$B138,'Interior - Space-By-Space'!$AE$16:OFFSET('Interior - Space-By-Space'!$AE$56,-1,0)),SUMIF('Interior - Space-By-Space'!$AG$16:OFFSET('Interior - Space-By-Space'!$AG$56,-1,0),$B138,'Interior - Space-By-Space'!$AI$16:OFFSET('Interior - Space-By-Space'!$AI$56,-1,0)),SUMIF('Interior - Space-By-Space'!$AK$16:OFFSET('Interior - Space-By-Space'!$AK$56,-1,0),$B138,'Interior - Space-By-Space'!$AM$16:OFFSET('Interior - Space-By-Space'!$AM$56,-1,0)),SUMIF('Interior - Space-By-Space'!$AO$16:OFFSET('Interior - Space-By-Space'!$AO$56,-1,0),$B138,'Interior - Space-By-Space'!$AQ$16:OFFSET('Interior - Space-By-Space'!$AQ$56,-1,0))),IF(ProjectMethod=BAM,SUM('Interior - Building Area Method'!$C149,'Interior - Building Area Method'!$E149,'Interior - Building Area Method'!$G149,'Interior - Building Area Method'!$I149,'Interior - Building Area Method'!$K149),0))+SUM(SUMIF(Exterior!$J$19:$J$69,$B138,Exterior!$K$19:$K$69),SUMIF(Exterior!$M$19:$M$69,$B138,Exterior!$N$19:$N$69),SUMIF(Exterior!$P$19:$P$69,$B138,Exterior!$Q$19:$Q$69),SUMIF(Exterior!$S$19:$S$69,$B138,Exterior!$T$19:$T$69),SUMIF(Exterior!$V$19:$V$69,$B138,Exterior!$W$19:$W$69))","v":0}]
[null,null,null,null,{"$f":"IF(ProjectMethod=SBS,SUM(SUMIF('Interior - Space-By-Space'!$M$16:OFFSET('Interior - Space-By-Space'!$M$56,-1,0),$B139,'Interior - Space-By-Space'!$O$16:OFFSET('Interior - Space-By-Space'!$O$56,-1,0)),SUMIF('Interior - Space-By-Space'!$Q$16:OFFSET('Interior - Space-By-Space'!$Q$56,-1,0),$B139,'Interior - Space-By-Space'!$S$16:OFFSET('Interior - Space-By-Space'!$S$56,-1,0)),SUMIF('Interior - Space-By-Space'!$U$16:OFFSET('Interior - Space-By-Space'!$U$56,-1,0),$B139,'Interior - Space-By-Space'!$W$16:OFFSET('Interior - Space-By-Space'!$W$56,-1,0)),SUMIF('Interior - Space-By-Space'!$Y$16:OFFSET('Interior - Space-By-Space'!$Y$56,-1,0),$B139,'Interior - Space-By-Space'!$AA$16:OFFSET('Interior - Space-By-Space'!$AA$56,-1,0)),SUMIF('Interior - Space-By-Space'!$AC$16:OFFSET('Interior - Space-By-Space'!$AC$56,-1,0),$B139,'Interior - Space-By-Space'!$AE$16:OFFSET('Interior - Space-By-Space'!$AE$56,-1,0)),SUMIF('Interior - Space-By-Space'!$AG$16:OFFSET('Interior - Space-By-Space'!$AG$56,-1,0),$B139,'Interior - Space-By-Space'!$AI$16:OFFSET('Interior - Space-By-Space'!$AI$56,-1,0)),SUMIF('Interior - Space-By-Space'!$AK$16:OFFSET('Interior - Space-By-Space'!$AK$56,-1,0),$B139,'Interior - Space-By-Space'!$AM$16:OFFSET('Interior - Space-By-Space'!$AM$56,-1,0)),SUMIF('Interior - Space-By-Space'!$AO$16:OFFSET('Interior - Space-By-Space'!$AO$56,-1,0),$B139,'Interior - Space-By-Space'!$AQ$16:OFFSET('Interior - Space-By-Space'!$AQ$56,-1,0))),IF(ProjectMethod=BAM,SUM('Interior - Building Area Method'!$C150,'Interior - Building Area Method'!$E150,'Interior - Building Area Method'!$G150,'Interior - Building Area Method'!$I150,'Interior - Building Area Method'!$K150),0))+SUM(SUMIF(Exterior!$J$19:$J$69,$B139,Exterior!$K$19:$K$69),SUMIF(Exterior!$M$19:$M$69,$B139,Exterior!$N$19:$N$69),SUMIF(Exterior!$P$19:$P$69,$B139,Exterior!$Q$19:$Q$69),SUMIF(Exterior!$S$19:$S$69,$B139,Exterior!$T$19:$T$69),SUMIF(Exterior!$V$19:$V$69,$B139,Exterior!$W$19:$W$69))","v":0}]
[null,null,null,null,{"$f":"IF(ProjectMethod=SBS,SUM(SUMIF('Interior - Space-By-Space'!$M$16:OFFSET('Interior - Space-By-Space'!$M$56,-1,0),$B140,'Interior - Space-By-Space'!$O$16:OFFSET('Interior - Space-By-Space'!$O$56,-1,0)),SUMIF('Interior - Space-By-Space'!$Q$16:OFFSET('Interior - Space-By-Space'!$Q$56,-1,0),$B140,'Interior - Space-By-Space'!$S$16:OFFSET('Interior - Space-By-Space'!$S$56,-1,0)),SUMIF('Interior - Space-By-Space'!$U$16:OFFSET('Interior - Space-By-Space'!$U$56,-1,0),$B140,'Interior - Space-By-Space'!$W$16:OFFSET('Interior - Space-By-Space'!$W$56,-1,0)),SUMIF('Interior - Space-By-Space'!$Y$16:OFFSET('Interior - Space-By-Space'!$Y$56,-1,0),$B140,'Interior - Space-By-Space'!$AA$16:OFFSET('Interior - Space-By-Space'!$AA$56,-1,0)),SUMIF('Interior - Space-By-Space'!$AC$16:OFFSET('Interior - Space-By-Space'!$AC$56,-1,0),$B140,'Interior - Space-By-Space'!$AE$16:OFFSET('Interior - Space-By-Space'!$AE$56,-1,0)),SUMIF('Interior - Space-By-Space'!$AG$16:OFFSET('Interior - Space-By-Space'!$AG$56,-1,0),$B140,'Interior - Space-By-Space'!$AI$16:OFFSET('Interior - Space-By-Space'!$AI$56,-1,0)),SUMIF('Interior - Space-By-Space'!$AK$16:OFFSET('Interior - Space-By-Space'!$AK$56,-1,0),$B140,'Interior - Space-By-Space'!$AM$16:OFFSET('Interior - Space-By-Space'!$AM$56,-1,0)),SUMIF('Interior - Space-By-Space'!$AO$16:OFFSET('Interior - Space-By-Space'!$AO$56,-1,0),$B140,'Interior - Space-By-Space'!$AQ$16:OFFSET('Interior - Space-By-Space'!$AQ$56,-1,0))),IF(ProjectMethod=BAM,SUM('Interior - Building Area Method'!$C151,'Interior - Building Area Method'!$E151,'Interior - Building Area Method'!$G151,'Interior - Building Area Method'!$I151,'Interior - Building Area Method'!$K151),0))+SUM(SUMIF(Exterior!$J$19:$J$69,$B140,Exterior!$K$19:$K$69),SUMIF(Exterior!$M$19:$M$69,$B140,Exterior!$N$19:$N$69),SUMIF(Exterior!$P$19:$P$69,$B140,Exterior!$Q$19:$Q$69),SUMIF(Exterior!$S$19:$S$69,$B140,Exterior!$T$19:$T$69),SUMIF(Exterior!$V$19:$V$69,$B140,Exterior!$W$19:$W$69))","v":0}]
[null,null,null,null,{"$f":"IF(ProjectMethod=SBS,SUM(SUMIF('Interior - Space-By-Space'!$M$16:OFFSET('Interior - Space-By-Space'!$M$56,-1,0),$B141,'Interior - Space-By-Space'!$O$16:OFFSET('Interior - Space-By-Space'!$O$56,-1,0)),SUMIF('Interior - Space-By-Space'!$Q$16:OFFSET('Interior - Space-By-Space'!$Q$56,-1,0),$B141,'Interior - Space-By-Space'!$S$16:OFFSET('Interior - Space-By-Space'!$S$56,-1,0)),SUMIF('Interior - Space-By-Space'!$U$16:OFFSET('Interior - Space-By-Space'!$U$56,-1,0),$B141,'Interior - Space-By-Space'!$W$16:OFFSET('Interior - Space-By-Space'!$W$56,-1,0)),SUMIF('Interior - Space-By-Space'!$Y$16:OFFSET('Interior - Space-By-Space'!$Y$56,-1,0),$B141,'Interior - Space-By-Space'!$AA$16:OFFSET('Interior - Space-By-Space'!$AA$56,-1,0)),SUMIF('Interior - Space-By-Space'!$AC$16:OFFSET('Interior - Space-By-Space'!$AC$56,-1,0),$B141,'Interior - Space-By-Space'!$AE$16:OFFSET('Interior - Space-By-Space'!$AE$56,-1,0)),SUMIF('Interior - Space-By-Space'!$AG$16:OFFSET('Interior - Space-By-Space'!$AG$56,-1,0),$B141,'Interior - Space-By-Space'!$AI$16:OFFSET('Interior - Space-By-Space'!$AI$56,-1,0)),SUMIF('Interior - Space-By-Space'!$AK$16:OFFSET('Interior - Space-By-Space'!$AK$56,-1,0),$B141,'Interior - Space-By-Space'!$AM$16:OFFSET('Interior - Space-By-Space'!$AM$56,-1,0)),SUMIF('Interior - Space-By-Space'!$AO$16:OFFSET('Interior - Space-By-Space'!$AO$56,-1,0),$B141,'Interior - Space-By-Space'!$AQ$16:OFFSET('Interior - Space-By-Space'!$AQ$56,-1,0))),IF(ProjectMethod=BAM,SUM('Interior - Building Area Method'!$C152,'Interior - Building Area Method'!$E152,'Interior - Building Area Method'!$G152,'Interior - Building Area Method'!$I152,'Interior - Building Area Method'!$K152),0))+SUM(SUMIF(Exterior!$J$19:$J$69,$B141,Exterior!$K$19:$K$69),SUMIF(Exterior!$M$19:$M$69,$B141,Exterior!$N$19:$N$69),SUMIF(Exterior!$P$19:$P$69,$B141,Exterior!$Q$19:$Q$69),SUMIF(Exterior!$S$19:$S$69,$B141,Exterior!$T$19:$T$69),SUMIF(Exterior!$V$19:$V$69,$B141,Exterior!$W$19:$W$69))","v":0}]
[null,null,null,null,{"$f":"IF(ProjectMethod=SBS,SUM(SUMIF('Interior - Space-By-Space'!$M$16:OFFSET('Interior - Space-By-Space'!$M$56,-1,0),$B142,'Interior - Space-By-Space'!$O$16:OFFSET('Interior - Space-By-Space'!$O$56,-1,0)),SUMIF('Interior - Space-By-Space'!$Q$16:OFFSET('Interior - Space-By-Space'!$Q$56,-1,0),$B142,'Interior - Space-By-Space'!$S$16:OFFSET('Interior - Space-By-Space'!$S$56,-1,0)),SUMIF('Interior - Space-By-Space'!$U$16:OFFSET('Interior - Space-By-Space'!$U$56,-1,0),$B142,'Interior - Space-By-Space'!$W$16:OFFSET('Interior - Space-By-Space'!$W$56,-1,0)),SUMIF('Interior - Space-By-Space'!$Y$16:OFFSET('Interior - Space-By-Space'!$Y$56,-1,0),$B142,'Interior - Space-By-Space'!$AA$16:OFFSET('Interior - Space-By-Space'!$AA$56,-1,0)),SUMIF('Interior - Space-By-Space'!$AC$16:OFFSET('Interior - Space-By-Space'!$AC$56,-1,0),$B142,'Interior - Space-By-Space'!$AE$16:OFFSET('Interior - Space-By-Space'!$AE$56,-1,0)),SUMIF('Interior - Space-By-Space'!$AG$16:OFFSET('Interior - Space-By-Space'!$AG$56,-1,0),$B142,'Interior - Space-By-Space'!$AI$16:OFFSET('Interior - Space-By-Space'!$AI$56,-1,0)),SUMIF('Interior - Space-By-Space'!$AK$16:OFFSET('Interior - Space-By-Space'!$AK$56,-1,0),$B142,'Interior - Space-By-Space'!$AM$16:OFFSET('Interior - Space-By-Space'!$AM$56,-1,0)),SUMIF('Interior - Space-By-Space'!$AO$16:OFFSET('Interior - Space-By-Space'!$AO$56,-1,0),$B142,'Interior - Space-By-Space'!$AQ$16:OFFSET('Interior - Space-By-Space'!$AQ$56,-1,0))),IF(ProjectMethod=BAM,SUM('Interior - Building Area Method'!$C153,'Interior - Building Area Method'!$E153,'Interior - Building Area Method'!$G153,'Interior - Building Area Method'!$I153,'Interior - Building Area Method'!$K153),0))+SUM(SUMIF(Exterior!$J$19:$J$69,$B142,Exterior!$K$19:$K$69),SUMIF(Exterior!$M$19:$M$69,$B142,Exterior!$N$19:$N$69),SUMIF(Exterior!$P$19:$P$69,$B142,Exterior!$Q$19:$Q$69),SUMIF(Exterior!$S$19:$S$69,$B142,Exterior!$T$19:$T$69),SUMIF(Exterior!$V$19:$V$69,$B142,Exterior!$W$19:$W$69))","v":0}]
[null,null,null,null,{"$f":"IF(ProjectMethod=SBS,SUM(SUMIF('Interior - Space-By-Space'!$M$16:OFFSET('Interior - Space-By-Space'!$M$56,-1,0),$B143,'Interior - Space-By-Space'!$O$16:OFFSET('Interior - Space-By-Space'!$O$56,-1,0)),SUMIF('Interior - Space-By-Space'!$Q$16:OFFSET('Interior - Space-By-Space'!$Q$56,-1,0),$B143,'Interior - Space-By-Space'!$S$16:OFFSET('Interior - Space-By-Space'!$S$56,-1,0)),SUMIF('Interior - Space-By-Space'!$U$16:OFFSET('Interior - Space-By-Space'!$U$56,-1,0),$B143,'Interior - Space-By-Space'!$W$16:OFFSET('Interior - Space-By-Space'!$W$56,-1,0)),SUMIF('Interior - Space-By-Space'!$Y$16:OFFSET('Interior - Space-By-Space'!$Y$56,-1,0),$B143,'Interior - Space-By-Space'!$AA$16:OFFSET('Interior - Space-By-Space'!$AA$56,-1,0)),SUMIF('Interior - Space-By-Space'!$AC$16:OFFSET('Interior - Space-By-Space'!$AC$56,-1,0),$B143,'Interior - Space-By-Space'!$AE$16:OFFSET('Interior - Space-By-Space'!$AE$56,-1,0)),SUMIF('Interior - Space-By-Space'!$AG$16:OFFSET('Interior - Space-By-Space'!$AG$56,-1,0),$B143,'Interior - Space-By-Space'!$AI$16:OFFSET('Interior - Space-By-Space'!$AI$56,-1,0)),SUMIF('Interior - Space-By-Space'!$AK$16:OFFSET('Interior - Space-By-Space'!$AK$56,-1,0),$B143,'Interior - Space-By-Space'!$AM$16:OFFSET('Interior - Space-By-Space'!$AM$56,-1,0)),SUMIF('Interior - Space-By-Space'!$AO$16:OFFSET('Interior - Space-By-Space'!$AO$56,-1,0),$B143,'Interior - Space-By-Space'!$AQ$16:OFFSET('Interior - Space-By-Space'!$AQ$56,-1,0))),IF(ProjectMethod=BAM,SUM('Interior - Building Area Method'!$C154,'Interior - Building Area Method'!$E154,'Interior - Building Area Method'!$G154,'Interior - Building Area Method'!$I154,'Interior - Building Area Method'!$K154),0))+SUM(SUMIF(Exterior!$J$19:$J$69,$B143,Exterior!$K$19:$K$69),SUMIF(Exterior!$M$19:$M$69,$B143,Exterior!$N$19:$N$69),SUMIF(Exterior!$P$19:$P$69,$B143,Exterior!$Q$19:$Q$69),SUMIF(Exterior!$S$19:$S$69,$B143,Exterior!$T$19:$T$69),SUMIF(Exterior!$V$19:$V$69,$B143,Exterior!$W$19:$W$69))","v":0}]
[null,null,null,null,{"$f":"IF(ProjectMethod=SBS,SUM(SUMIF('Interior - Space-By-Space'!$M$16:OFFSET('Interior - Space-By-Space'!$M$56,-1,0),$B144,'Interior - Space-By-Space'!$O$16:OFFSET('Interior - Space-By-Space'!$O$56,-1,0)),SUMIF('Interior - Space-By-Space'!$Q$16:OFFSET('Interior - Space-By-Space'!$Q$56,-1,0),$B144,'Interior - Space-By-Space'!$S$16:OFFSET('Interior - Space-By-Space'!$S$56,-1,0)),SUMIF('Interior - Space-By-Space'!$U$16:OFFSET('Interior - Space-By-Space'!$U$56,-1,0),$B144,'Interior - Space-By-Space'!$W$16:OFFSET('Interior - Space-By-Space'!$W$56,-1,0)),SUMIF('Interior - Space-By-Space'!$Y$16:OFFSET('Interior - Space-By-Space'!$Y$56,-1,0),$B144,'Interior - Space-By-Space'!$AA$16:OFFSET('Interior - Space-By-Space'!$AA$56,-1,0)),SUMIF('Interior - Space-By-Space'!$AC$16:OFFSET('Interior - Space-By-Space'!$AC$56,-1,0),$B144,'Interior - Space-By-Space'!$AE$16:OFFSET('Interior - Space-By-Space'!$AE$56,-1,0)),SUMIF('Interior - Space-By-Space'!$AG$16:OFFSET('Interior - Space-By-Space'!$AG$56,-1,0),$B144,'Interior - Space-By-Space'!$AI$16:OFFSET('Interior - Space-By-Space'!$AI$56,-1,0)),SUMIF('Interior - Space-By-Space'!$AK$16:OFFSET('Interior - Space-By-Space'!$AK$56,-1,0),$B144,'Interior - Space-By-Space'!$AM$16:OFFSET('Interior - Space-By-Space'!$AM$56,-1,0)),SUMIF('Interior - Space-By-Space'!$AO$16:OFFSET('Interior - Space-By-Space'!$AO$56,-1,0),$B144,'Interior - Space-By-Space'!$AQ$16:OFFSET('Interior - Space-By-Space'!$AQ$56,-1,0))),IF(ProjectMethod=BAM,SUM('Interior - Building Area Method'!$C155,'Interior - Building Area Method'!$E155,'Interior - Building Area Method'!$G155,'Interior - Building Area Method'!$I155,'Interior - Building Area Method'!$K155),0))+SUM(SUMIF(Exterior!$J$19:$J$69,$B144,Exterior!$K$19:$K$69),SUMIF(Exterior!$M$19:$M$69,$B144,Exterior!$N$19:$N$69),SUMIF(Exterior!$P$19:$P$69,$B144,Exterior!$Q$19:$Q$69),SUMIF(Exterior!$S$19:$S$69,$B144,Exterior!$T$19:$T$69),SUMIF(Exterior!$V$19:$V$69,$B144,Exterior!$W$19:$W$69))","v":0}]
[null,null,null,null,{"$f":"IF(ProjectMethod=SBS,SUM(SUMIF('Interior - Space-By-Space'!$M$16:OFFSET('Interior - Space-By-Space'!$M$56,-1,0),$B145,'Interior - Space-By-Space'!$O$16:OFFSET('Interior - Space-By-Space'!$O$56,-1,0)),SUMIF('Interior - Space-By-Space'!$Q$16:OFFSET('Interior - Space-By-Space'!$Q$56,-1,0),$B145,'Interior - Space-By-Space'!$S$16:OFFSET('Interior - Space-By-Space'!$S$56,-1,0)),SUMIF('Interior - Space-By-Space'!$U$16:OFFSET('Interior - Space-By-Space'!$U$56,-1,0),$B145,'Interior - Space-By-Space'!$W$16:OFFSET('Interior - Space-By-Space'!$W$56,-1,0)),SUMIF('Interior - Space-By-Space'!$Y$16:OFFSET('Interior - Space-By-Space'!$Y$56,-1,0),$B145,'Interior - Space-By-Space'!$AA$16:OFFSET('Interior - Space-By-Space'!$AA$56,-1,0)),SUMIF('Interior - Space-By-Space'!$AC$16:OFFSET('Interior - Space-By-Space'!$AC$56,-1,0),$B145,'Interior - Space-By-Space'!$AE$16:OFFSET('Interior - Space-By-Space'!$AE$56,-1,0)),SUMIF('Interior - Space-By-Space'!$AG$16:OFFSET('Interior - Space-By-Space'!$AG$56,-1,0),$B145,'Interior - Space-By-Space'!$AI$16:OFFSET('Interior - Space-By-Space'!$AI$56,-1,0)),SUMIF('Interior - Space-By-Space'!$AK$16:OFFSET('Interior - Space-By-Space'!$AK$56,-1,0),$B145,'Interior - Space-By-Space'!$AM$16:OFFSET('Interior - Space-By-Space'!$AM$56,-1,0)),SUMIF('Interior - Space-By-Space'!$AO$16:OFFSET('Interior - Space-By-Space'!$AO$56,-1,0),$B145,'Interior - Space-By-Space'!$AQ$16:OFFSET('Interior - Space-By-Space'!$AQ$56,-1,0))),IF(ProjectMethod=BAM,SUM('Interior - Building Area Method'!$C156,'Interior - Building Area Method'!$E156,'Interior - Building Area Method'!$G156,'Interior - Building Area Method'!$I156,'Interior - Building Area Method'!$K156),0))+SUM(SUMIF(Exterior!$J$19:$J$69,$B145,Exterior!$K$19:$K$69),SUMIF(Exterior!$M$19:$M$69,$B145,Exterior!$N$19:$N$69),SUMIF(Exterior!$P$19:$P$69,$B145,Exterior!$Q$19:$Q$69),SUMIF(Exterior!$S$19:$S$69,$B145,Exterior!$T$19:$T$69),SUMIF(Exterior!$V$19:$V$69,$B145,Exterior!$W$19:$W$69))","v":0}]
[null,null,null,null,{"$f":"IF(ProjectMethod=SBS,SUM(SUMIF('Interior - Space-By-Space'!$M$16:OFFSET('Interior - Space-By-Space'!$M$56,-1,0),$B146,'Interior - Space-By-Space'!$O$16:OFFSET('Interior - Space-By-Space'!$O$56,-1,0)),SUMIF('Interior - Space-By-Space'!$Q$16:OFFSET('Interior - Space-By-Space'!$Q$56,-1,0),$B146,'Interior - Space-By-Space'!$S$16:OFFSET('Interior - Space-By-Space'!$S$56,-1,0)),SUMIF('Interior - Space-By-Space'!$U$16:OFFSET('Interior - Space-By-Space'!$U$56,-1,0),$B146,'Interior - Space-By-Space'!$W$16:OFFSET('Interior - Space-By-Space'!$W$56,-1,0)),SUMIF('Interior - Space-By-Space'!$Y$16:OFFSET('Interior - Space-By-Space'!$Y$56,-1,0),$B146,'Interior - Space-By-Space'!$AA$16:OFFSET('Interior - Space-By-Space'!$AA$56,-1,0)),SUMIF('Interior - Space-By-Space'!$AC$16:OFFSET('Interior - Space-By-Space'!$AC$56,-1,0),$B146,'Interior - Space-By-Space'!$AE$16:OFFSET('Interior - Space-By-Space'!$AE$56,-1,0)),SUMIF('Interior - Space-By-Space'!$AG$16:OFFSET('Interior - Space-By-Space'!$AG$56,-1,0),$B146,'Interior - Space-By-Space'!$AI$16:OFFSET('Interior - Space-By-Space'!$AI$56,-1,0)),SUMIF('Interior - Space-By-Space'!$AK$16:OFFSET('Interior - Space-By-Space'!$AK$56,-1,0),$B146,'Interior - Space-By-Space'!$AM$16:OFFSET('Interior - Space-By-Space'!$AM$56,-1,0)),SUMIF('Interior - Space-By-Space'!$AO$16:OFFSET('Interior - Space-By-Space'!$AO$56,-1,0),$B146,'Interior - Space-By-Space'!$AQ$16:OFFSET('Interior - Space-By-Space'!$AQ$56,-1,0))),IF(ProjectMethod=BAM,SUM('Interior - Building Area Method'!$C157,'Interior - Building Area Method'!$E157,'Interior - Building Area Method'!$G157,'Interior - Building Area Method'!$I157,'Interior - Building Area Method'!$K157),0))+SUM(SUMIF(Exterior!$J$19:$J$69,$B146,Exterior!$K$19:$K$69),SUMIF(Exterior!$M$19:$M$69,$B146,Exterior!$N$19:$N$69),SUMIF(Exterior!$P$19:$P$69,$B146,Exterior!$Q$19:$Q$69),SUMIF(Exterior!$S$19:$S$69,$B146,Exterior!$T$19:$T$69),SUMIF(Exterior!$V$19:$V$69,$B146,Exterior!$W$19:$W$69))","v":0}]
[null,null,null,null,{"$f":"IF(ProjectMethod=SBS,SUM(SUMIF('Interior - Space-By-Space'!$M$16:OFFSET('Interior - Space-By-Space'!$M$56,-1,0),$B147,'Interior - Space-By-Space'!$O$16:OFFSET('Interior - Space-By-Space'!$O$56,-1,0)),SUMIF('Interior - Space-By-Space'!$Q$16:OFFSET('Interior - Space-By-Space'!$Q$56,-1,0),$B147,'Interior - Space-By-Space'!$S$16:OFFSET('Interior - Space-By-Space'!$S$56,-1,0)),SUMIF('Interior - Space-By-Space'!$U$16:OFFSET('Interior - Space-By-Space'!$U$56,-1,0),$B147,'Interior - Space-By-Space'!$W$16:OFFSET('Interior - Space-By-Space'!$W$56,-1,0)),SUMIF('Interior - Space-By-Space'!$Y$16:OFFSET('Interior - Space-By-Space'!$Y$56,-1,0),$B147,'Interior - Space-By-Space'!$AA$16:OFFSET('Interior - Space-By-Space'!$AA$56,-1,0)),SUMIF('Interior - Space-By-Space'!$AC$16:OFFSET('Interior - Space-By-Space'!$AC$56,-1,0),$B147,'Interior - Space-By-Space'!$AE$16:OFFSET('Interior - Space-By-Space'!$AE$56,-1,0)),SUMIF('Interior - Space-By-Space'!$AG$16:OFFSET('Interior - Space-By-Space'!$AG$56,-1,0),$B147,'Interior - Space-By-Space'!$AI$16:OFFSET('Interior - Space-By-Space'!$AI$56,-1,0)),SUMIF('Interior - Space-By-Space'!$AK$16:OFFSET('Interior - Space-By-Space'!$AK$56,-1,0),$B147,'Interior - Space-By-Space'!$AM$16:OFFSET('Interior - Space-By-Space'!$AM$56,-1,0)),SUMIF('Interior - Space-By-Space'!$AO$16:OFFSET('Interior - Space-By-Space'!$AO$56,-1,0),$B147,'Interior - Space-By-Space'!$AQ$16:OFFSET('Interior - Space-By-Space'!$AQ$56,-1,0))),IF(ProjectMethod=BAM,SUM('Interior - Building Area Method'!$C158,'Interior - Building Area Method'!$E158,'Interior - Building Area Method'!$G158,'Interior - Building Area Method'!$I158,'Interior - Building Area Method'!$K158),0))+SUM(SUMIF(Exterior!$J$19:$J$69,$B147,Exterior!$K$19:$K$69),SUMIF(Exterior!$M$19:$M$69,$B147,Exterior!$N$19:$N$69),SUMIF(Exterior!$P$19:$P$69,$B147,Exterior!$Q$19:$Q$69),SUMIF(Exterior!$S$19:$S$69,$B147,Exterior!$T$19:$T$69),SUMIF(Exterior!$V$19:$V$69,$B147,Exterior!$W$19:$W$69))","v":0}]
[null,null,null,null,{"$f":"IF(ProjectMethod=SBS,SUM(SUMIF('Interior - Space-By-Space'!$M$16:OFFSET('Interior - Space-By-Space'!$M$56,-1,0),$B148,'Interior - Space-By-Space'!$O$16:OFFSET('Interior - Space-By-Space'!$O$56,-1,0)),SUMIF('Interior - Space-By-Space'!$Q$16:OFFSET('Interior - Space-By-Space'!$Q$56,-1,0),$B148,'Interior - Space-By-Space'!$S$16:OFFSET('Interior - Space-By-Space'!$S$56,-1,0)),SUMIF('Interior - Space-By-Space'!$U$16:OFFSET('Interior - Space-By-Space'!$U$56,-1,0),$B148,'Interior - Space-By-Space'!$W$16:OFFSET('Interior - Space-By-Space'!$W$56,-1,0)),SUMIF('Interior - Space-By-Space'!$Y$16:OFFSET('Interior - Space-By-Space'!$Y$56,-1,0),$B148,'Interior - Space-By-Space'!$AA$16:OFFSET('Interior - Space-By-Space'!$AA$56,-1,0)),SUMIF('Interior - Space-By-Space'!$AC$16:OFFSET('Interior - Space-By-Space'!$AC$56,-1,0),$B148,'Interior - Space-By-Space'!$AE$16:OFFSET('Interior - Space-By-Space'!$AE$56,-1,0)),SUMIF('Interior - Space-By-Space'!$AG$16:OFFSET('Interior - Space-By-Space'!$AG$56,-1,0),$B148,'Interior - Space-By-Space'!$AI$16:OFFSET('Interior - Space-By-Space'!$AI$56,-1,0)),SUMIF('Interior - Space-By-Space'!$AK$16:OFFSET('Interior - Space-By-Space'!$AK$56,-1,0),$B148,'Interior - Space-By-Space'!$AM$16:OFFSET('Interior - Space-By-Space'!$AM$56,-1,0)),SUMIF('Interior - Space-By-Space'!$AO$16:OFFSET('Interior - Space-By-Space'!$AO$56,-1,0),$B148,'Interior - Space-By-Space'!$AQ$16:OFFSET('Interior - Space-By-Space'!$AQ$56,-1,0))),IF(ProjectMethod=BAM,SUM('Interior - Building Area Method'!$C159,'Interior - Building Area Method'!$E159,'Interior - Building Area Method'!$G159,'Interior - Building Area Method'!$I159,'Interior - Building Area Method'!$K159),0))+SUM(SUMIF(Exterior!$J$19:$J$69,$B148,Exterior!$K$19:$K$69),SUMIF(Exterior!$M$19:$M$69,$B148,Exterior!$N$19:$N$69),SUMIF(Exterior!$P$19:$P$69,$B148,Exterior!$Q$19:$Q$69),SUMIF(Exterior!$S$19:$S$69,$B148,Exterior!$T$19:$T$69),SUMIF(Exterior!$V$19:$V$69,$B148,Exterior!$W$19:$W$69))","v":0}]
[null,null,null,null,{"$f":"IF(ProjectMethod=SBS,SUM(SUMIF('Interior - Space-By-Space'!$M$16:OFFSET('Interior - Space-By-Space'!$M$56,-1,0),$B149,'Interior - Space-By-Space'!$O$16:OFFSET('Interior - Space-By-Space'!$O$56,-1,0)),SUMIF('Interior - Space-By-Space'!$Q$16:OFFSET('Interior - Space-By-Space'!$Q$56,-1,0),$B149,'Interior - Space-By-Space'!$S$16:OFFSET('Interior - Space-By-Space'!$S$56,-1,0)),SUMIF('Interior - Space-By-Space'!$U$16:OFFSET('Interior - Space-By-Space'!$U$56,-1,0),$B149,'Interior - Space-By-Space'!$W$16:OFFSET('Interior - Space-By-Space'!$W$56,-1,0)),SUMIF('Interior - Space-By-Space'!$Y$16:OFFSET('Interior - Space-By-Space'!$Y$56,-1,0),$B149,'Interior - Space-By-Space'!$AA$16:OFFSET('Interior - Space-By-Space'!$AA$56,-1,0)),SUMIF('Interior - Space-By-Space'!$AC$16:OFFSET('Interior - Space-By-Space'!$AC$56,-1,0),$B149,'Interior - Space-By-Space'!$AE$16:OFFSET('Interior - Space-By-Space'!$AE$56,-1,0)),SUMIF('Interior - Space-By-Space'!$AG$16:OFFSET('Interior - Space-By-Space'!$AG$56,-1,0),$B149,'Interior - Space-By-Space'!$AI$16:OFFSET('Interior - Space-By-Space'!$AI$56,-1,0)),SUMIF('Interior - Space-By-Space'!$AK$16:OFFSET('Interior - Space-By-Space'!$AK$56,-1,0),$B149,'Interior - Space-By-Space'!$AM$16:OFFSET('Interior - Space-By-Space'!$AM$56,-1,0)),SUMIF('Interior - Space-By-Space'!$AO$16:OFFSET('Interior - Space-By-Space'!$AO$56,-1,0),$B149,'Interior - Space-By-Space'!$AQ$16:OFFSET('Interior - Space-By-Space'!$AQ$56,-1,0))),IF(ProjectMethod=BAM,SUM('Interior - Building Area Method'!$C160,'Interior - Building Area Method'!$E160,'Interior - Building Area Method'!$G160,'Interior - Building Area Method'!$I160,'Interior - Building Area Method'!$K160),0))+SUM(SUMIF(Exterior!$J$19:$J$69,$B149,Exterior!$K$19:$K$69),SUMIF(Exterior!$M$19:$M$69,$B149,Exterior!$N$19:$N$69),SUMIF(Exterior!$P$19:$P$69,$B149,Exterior!$Q$19:$Q$69),SUMIF(Exterior!$S$19:$S$69,$B149,Exterior!$T$19:$T$69),SUMIF(Exterior!$V$19:$V$69,$B149,Exterior!$W$19:$W$69))","v":0}]
[null,null,null,null,{"$f":"IF(ProjectMethod=SBS,SUM(SUMIF('Interior - Space-By-Space'!$M$16:OFFSET('Interior - Space-By-Space'!$M$56,-1,0),$B150,'Interior - Space-By-Space'!$O$16:OFFSET('Interior - Space-By-Space'!$O$56,-1,0)),SUMIF('Interior - Space-By-Space'!$Q$16:OFFSET('Interior - Space-By-Space'!$Q$56,-1,0),$B150,'Interior - Space-By-Space'!$S$16:OFFSET('Interior - Space-By-Space'!$S$56,-1,0)),SUMIF('Interior - Space-By-Space'!$U$16:OFFSET('Interior - Space-By-Space'!$U$56,-1,0),$B150,'Interior - Space-By-Space'!$W$16:OFFSET('Interior - Space-By-Space'!$W$56,-1,0)),SUMIF('Interior - Space-By-Space'!$Y$16:OFFSET('Interior - Space-By-Space'!$Y$56,-1,0),$B150,'Interior - Space-By-Space'!$AA$16:OFFSET('Interior - Space-By-Space'!$AA$56,-1,0)),SUMIF('Interior - Space-By-Space'!$AC$16:OFFSET('Interior - Space-By-Space'!$AC$56,-1,0),$B150,'Interior - Space-By-Space'!$AE$16:OFFSET('Interior - Space-By-Space'!$AE$56,-1,0)),SUMIF('Interior - Space-By-Space'!$AG$16:OFFSET('Interior - Space-By-Space'!$AG$56,-1,0),$B150,'Interior - Space-By-Space'!$AI$16:OFFSET('Interior - Space-By-Space'!$AI$56,-1,0)),SUMIF('Interior - Space-By-Space'!$AK$16:OFFSET('Interior - Space-By-Space'!$AK$56,-1,0),$B150,'Interior - Space-By-Space'!$AM$16:OFFSET('Interior - Space-By-Space'!$AM$56,-1,0)),SUMIF('Interior - Space-By-Space'!$AO$16:OFFSET('Interior - Space-By-Space'!$AO$56,-1,0),$B150,'Interior - Space-By-Space'!$AQ$16:OFFSET('Interior - Space-By-Space'!$AQ$56,-1,0))),IF(ProjectMethod=BAM,SUM('Interior - Building Area Method'!$C161,'Interior - Building Area Method'!$E161,'Interior - Building Area Method'!$G161,'Interior - Building Area Method'!$I161,'Interior - Building Area Method'!$K161),0))+SUM(SUMIF(Exterior!$J$19:$J$69,$B150,Exterior!$K$19:$K$69),SUMIF(Exterior!$M$19:$M$69,$B150,Exterior!$N$19:$N$69),SUMIF(Exterior!$P$19:$P$69,$B150,Exterior!$Q$19:$Q$69),SUMIF(Exterior!$S$19:$S$69,$B150,Exterior!$T$19:$T$69),SUMIF(Exterior!$V$19:$V$69,$B150,Exterior!$W$19:$W$69))","v":0}]
[null,null,null,null,{"$f":"IF(ProjectMethod=SBS,SUM(SUMIF('Interior - Space-By-Space'!$M$16:OFFSET('Interior - Space-By-Space'!$M$56,-1,0),$B151,'Interior - Space-By-Space'!$O$16:OFFSET('Interior - Space-By-Space'!$O$56,-1,0)),SUMIF('Interior - Space-By-Space'!$Q$16:OFFSET('Interior - Space-By-Space'!$Q$56,-1,0),$B151,'Interior - Space-By-Space'!$S$16:OFFSET('Interior - Space-By-Space'!$S$56,-1,0)),SUMIF('Interior - Space-By-Space'!$U$16:OFFSET('Interior - Space-By-Space'!$U$56,-1,0),$B151,'Interior - Space-By-Space'!$W$16:OFFSET('Interior - Space-By-Space'!$W$56,-1,0)),SUMIF('Interior - Space-By-Space'!$Y$16:OFFSET('Interior - Space-By-Space'!$Y$56,-1,0),$B151,'Interior - Space-By-Space'!$AA$16:OFFSET('Interior - Space-By-Space'!$AA$56,-1,0)),SUMIF('Interior - Space-By-Space'!$AC$16:OFFSET('Interior - Space-By-Space'!$AC$56,-1,0),$B151,'Interior - Space-By-Space'!$AE$16:OFFSET('Interior - Space-By-Space'!$AE$56,-1,0)),SUMIF('Interior - Space-By-Space'!$AG$16:OFFSET('Interior - Space-By-Space'!$AG$56,-1,0),$B151,'Interior - Space-By-Space'!$AI$16:OFFSET('Interior - Space-By-Space'!$AI$56,-1,0)),SUMIF('Interior - Space-By-Space'!$AK$16:OFFSET('Interior - Space-By-Space'!$AK$56,-1,0),$B151,'Interior - Space-By-Space'!$AM$16:OFFSET('Interior - Space-By-Space'!$AM$56,-1,0)),SUMIF('Interior - Space-By-Space'!$AO$16:OFFSET('Interior - Space-By-Space'!$AO$56,-1,0),$B151,'Interior - Space-By-Space'!$AQ$16:OFFSET('Interior - Space-By-Space'!$AQ$56,-1,0))),IF(ProjectMethod=BAM,SUM('Interior - Building Area Method'!$C162,'Interior - Building Area Method'!$E162,'Interior - Building Area Method'!$G162,'Interior - Building Area Method'!$I162,'Interior - Building Area Method'!$K162),0))+SUM(SUMIF(Exterior!$J$19:$J$69,$B151,Exterior!$K$19:$K$69),SUMIF(Exterior!$M$19:$M$69,$B151,Exterior!$N$19:$N$69),SUMIF(Exterior!$P$19:$P$69,$B151,Exterior!$Q$19:$Q$69),SUMIF(Exterior!$S$19:$S$69,$B151,Exterior!$T$19:$T$69),SUMIF(Exterior!$V$19:$V$69,$B151,Exterior!$W$19:$W$69))","v":0}]
[null,null,null,null,{"$f":"IF(ProjectMethod=SBS,SUM(SUMIF('Interior - Space-By-Space'!$M$16:OFFSET('Interior - Space-By-Space'!$M$56,-1,0),$B152,'Interior - Space-By-Space'!$O$16:OFFSET('Interior - Space-By-Space'!$O$56,-1,0)),SUMIF('Interior - Space-By-Space'!$Q$16:OFFSET('Interior - Space-By-Space'!$Q$56,-1,0),$B152,'Interior - Space-By-Space'!$S$16:OFFSET('Interior - Space-By-Space'!$S$56,-1,0)),SUMIF('Interior - Space-By-Space'!$U$16:OFFSET('Interior - Space-By-Space'!$U$56,-1,0),$B152,'Interior - Space-By-Space'!$W$16:OFFSET('Interior - Space-By-Space'!$W$56,-1,0)),SUMIF('Interior - Space-By-Space'!$Y$16:OFFSET('Interior - Space-By-Space'!$Y$56,-1,0),$B152,'Interior - Space-By-Space'!$AA$16:OFFSET('Interior - Space-By-Space'!$AA$56,-1,0)),SUMIF('Interior - Space-By-Space'!$AC$16:OFFSET('Interior - Space-By-Space'!$AC$56,-1,0),$B152,'Interior - Space-By-Space'!$AE$16:OFFSET('Interior - Space-By-Space'!$AE$56,-1,0)),SUMIF('Interior - Space-By-Space'!$AG$16:OFFSET('Interior - Space-By-Space'!$AG$56,-1,0),$B152,'Interior - Space-By-Space'!$AI$16:OFFSET('Interior - Space-By-Space'!$AI$56,-1,0)),SUMIF('Interior - Space-By-Space'!$AK$16:OFFSET('Interior - Space-By-Space'!$AK$56,-1,0),$B152,'Interior - Space-By-Space'!$AM$16:OFFSET('Interior - Space-By-Space'!$AM$56,-1,0)),SUMIF('Interior - Space-By-Space'!$AO$16:OFFSET('Interior - Space-By-Space'!$AO$56,-1,0),$B152,'Interior - Space-By-Space'!$AQ$16:OFFSET('Interior - Space-By-Space'!$AQ$56,-1,0))),IF(ProjectMethod=BAM,SUM('Interior - Building Area Method'!$C163,'Interior - Building Area Method'!$E163,'Interior - Building Area Method'!$G163,'Interior - Building Area Method'!$I163,'Interior - Building Area Method'!$K163),0))+SUM(SUMIF(Exterior!$J$19:$J$69,$B152,Exterior!$K$19:$K$69),SUMIF(Exterior!$M$19:$M$69,$B152,Exterior!$N$19:$N$69),SUMIF(Exterior!$P$19:$P$69,$B152,Exterior!$Q$19:$Q$69),SUMIF(Exterior!$S$19:$S$69,$B152,Exterior!$T$19:$T$69),SUMIF(Exterior!$V$19:$V$69,$B152,Exterior!$W$19:$W$69))","v":0}]
[null,null,null,null,{"$f":"IF(ProjectMethod=SBS,SUM(SUMIF('Interior - Space-By-Space'!$M$16:OFFSET('Interior - Space-By-Space'!$M$56,-1,0),$B153,'Interior - Space-By-Space'!$O$16:OFFSET('Interior - Space-By-Space'!$O$56,-1,0)),SUMIF('Interior - Space-By-Space'!$Q$16:OFFSET('Interior - Space-By-Space'!$Q$56,-1,0),$B153,'Interior - Space-By-Space'!$S$16:OFFSET('Interior - Space-By-Space'!$S$56,-1,0)),SUMIF('Interior - Space-By-Space'!$U$16:OFFSET('Interior - Space-By-Space'!$U$56,-1,0),$B153,'Interior - Space-By-Space'!$W$16:OFFSET('Interior - Space-By-Space'!$W$56,-1,0)),SUMIF('Interior - Space-By-Space'!$Y$16:OFFSET('Interior - Space-By-Space'!$Y$56,-1,0),$B153,'Interior - Space-By-Space'!$AA$16:OFFSET('Interior - Space-By-Space'!$AA$56,-1,0)),SUMIF('Interior - Space-By-Space'!$AC$16:OFFSET('Interior - Space-By-Space'!$AC$56,-1,0),$B153,'Interior - Space-By-Space'!$AE$16:OFFSET('Interior - Space-By-Space'!$AE$56,-1,0)),SUMIF('Interior - Space-By-Space'!$AG$16:OFFSET('Interior - Space-By-Space'!$AG$56,-1,0),$B153,'Interior - Space-By-Space'!$AI$16:OFFSET('Interior - Space-By-Space'!$AI$56,-1,0)),SUMIF('Interior - Space-By-Space'!$AK$16:OFFSET('Interior - Space-By-Space'!$AK$56,-1,0),$B153,'Interior - Space-By-Space'!$AM$16:OFFSET('Interior - Space-By-Space'!$AM$56,-1,0)),SUMIF('Interior - Space-By-Space'!$AO$16:OFFSET('Interior - Space-By-Space'!$AO$56,-1,0),$B153,'Interior - Space-By-Space'!$AQ$16:OFFSET('Interior - Space-By-Space'!$AQ$56,-1,0))),IF(ProjectMethod=BAM,SUM('Interior - Building Area Method'!$C164,'Interior - Building Area Method'!$E164,'Interior - Building Area Method'!$G164,'Interior - Building Area Method'!$I164,'Interior - Building Area Method'!$K164),0))+SUM(SUMIF(Exterior!$J$19:$J$69,$B153,Exterior!$K$19:$K$69),SUMIF(Exterior!$M$19:$M$69,$B153,Exterior!$N$19:$N$69),SUMIF(Exterior!$P$19:$P$69,$B153,Exterior!$Q$19:$Q$69),SUMIF(Exterior!$S$19:$S$69,$B153,Exterior!$T$19:$T$69),SUMIF(Exterior!$V$19:$V$69,$B153,Exterior!$W$19:$W$69))","v":0}]
[null,null,null,null,{"$f":"IF(ProjectMethod=SBS,SUM(SUMIF('Interior - Space-By-Space'!$M$16:OFFSET('Interior - Space-By-Space'!$M$56,-1,0),$B154,'Interior - Space-By-Space'!$O$16:OFFSET('Interior - Space-By-Space'!$O$56,-1,0)),SUMIF('Interior - Space-By-Space'!$Q$16:OFFSET('Interior - Space-By-Space'!$Q$56,-1,0),$B154,'Interior - Space-By-Space'!$S$16:OFFSET('Interior - Space-By-Space'!$S$56,-1,0)),SUMIF('Interior - Space-By-Space'!$U$16:OFFSET('Interior - Space-By-Space'!$U$56,-1,0),$B154,'Interior - Space-By-Space'!$W$16:OFFSET('Interior - Space-By-Space'!$W$56,-1,0)),SUMIF('Interior - Space-By-Space'!$Y$16:OFFSET('Interior - Space-By-Space'!$Y$56,-1,0),$B154,'Interior - Space-By-Space'!$AA$16:OFFSET('Interior - Space-By-Space'!$AA$56,-1,0)),SUMIF('Interior - Space-By-Space'!$AC$16:OFFSET('Interior - Space-By-Space'!$AC$56,-1,0),$B154,'Interior - Space-By-Space'!$AE$16:OFFSET('Interior - Space-By-Space'!$AE$56,-1,0)),SUMIF('Interior - Space-By-Space'!$AG$16:OFFSET('Interior - Space-By-Space'!$AG$56,-1,0),$B154,'Interior - Space-By-Space'!$AI$16:OFFSET('Interior - Space-By-Space'!$AI$56,-1,0)),SUMIF('Interior - Space-By-Space'!$AK$16:OFFSET('Interior - Space-By-Space'!$AK$56,-1,0),$B154,'Interior - Space-By-Space'!$AM$16:OFFSET('Interior - Space-By-Space'!$AM$56,-1,0)),SUMIF('Interior - Space-By-Space'!$AO$16:OFFSET('Interior - Space-By-Space'!$AO$56,-1,0),$B154,'Interior - Space-By-Space'!$AQ$16:OFFSET('Interior - Space-By-Space'!$AQ$56,-1,0))),IF(ProjectMethod=BAM,SUM('Interior - Building Area Method'!$C165,'Interior - Building Area Method'!$E165,'Interior - Building Area Method'!$G165,'Interior - Building Area Method'!$I165,'Interior - Building Area Method'!$K165),0))+SUM(SUMIF(Exterior!$J$19:$J$69,$B154,Exterior!$K$19:$K$69),SUMIF(Exterior!$M$19:$M$69,$B154,Exterior!$N$19:$N$69),SUMIF(Exterior!$P$19:$P$69,$B154,Exterior!$Q$19:$Q$69),SUMIF(Exterior!$S$19:$S$69,$B154,Exterior!$T$19:$T$69),SUMIF(Exterior!$V$19:$V$69,$B154,Exterior!$W$19:$W$69))","v":0}]
[null,null,null,null,{"$f":"IF(ProjectMethod=SBS,SUM(SUMIF('Interior - Space-By-Space'!$M$16:OFFSET('Interior - Space-By-Space'!$M$56,-1,0),$B155,'Interior - Space-By-Space'!$O$16:OFFSET('Interior - Space-By-Space'!$O$56,-1,0)),SUMIF('Interior - Space-By-Space'!$Q$16:OFFSET('Interior - Space-By-Space'!$Q$56,-1,0),$B155,'Interior - Space-By-Space'!$S$16:OFFSET('Interior - Space-By-Space'!$S$56,-1,0)),SUMIF('Interior - Space-By-Space'!$U$16:OFFSET('Interior - Space-By-Space'!$U$56,-1,0),$B155,'Interior - Space-By-Space'!$W$16:OFFSET('Interior - Space-By-Space'!$W$56,-1,0)),SUMIF('Interior - Space-By-Space'!$Y$16:OFFSET('Interior - Space-By-Space'!$Y$56,-1,0),$B155,'Interior - Space-By-Space'!$AA$16:OFFSET('Interior - Space-By-Space'!$AA$56,-1,0)),SUMIF('Interior - Space-By-Space'!$AC$16:OFFSET('Interior - Space-By-Space'!$AC$56,-1,0),$B155,'Interior - Space-By-Space'!$AE$16:OFFSET('Interior - Space-By-Space'!$AE$56,-1,0)),SUMIF('Interior - Space-By-Space'!$AG$16:OFFSET('Interior - Space-By-Space'!$AG$56,-1,0),$B155,'Interior - Space-By-Space'!$AI$16:OFFSET('Interior - Space-By-Space'!$AI$56,-1,0)),SUMIF('Interior - Space-By-Space'!$AK$16:OFFSET('Interior - Space-By-Space'!$AK$56,-1,0),$B155,'Interior - Space-By-Space'!$AM$16:OFFSET('Interior - Space-By-Space'!$AM$56,-1,0)),SUMIF('Interior - Space-By-Space'!$AO$16:OFFSET('Interior - Space-By-Space'!$AO$56,-1,0),$B155,'Interior - Space-By-Space'!$AQ$16:OFFSET('Interior - Space-By-Space'!$AQ$56,-1,0))),IF(ProjectMethod=BAM,SUM('Interior - Building Area Method'!$C166,'Interior - Building Area Method'!$E166,'Interior - Building Area Method'!$G166,'Interior - Building Area Method'!$I166,'Interior - Building Area Method'!$K166),0))+SUM(SUMIF(Exterior!$J$19:$J$69,$B155,Exterior!$K$19:$K$69),SUMIF(Exterior!$M$19:$M$69,$B155,Exterior!$N$19:$N$69),SUMIF(Exterior!$P$19:$P$69,$B155,Exterior!$Q$19:$Q$69),SUMIF(Exterior!$S$19:$S$69,$B155,Exterior!$T$19:$T$69),SUMIF(Exterior!$V$19:$V$69,$B155,Exterior!$W$19:$W$69))","v":0}]
[null,null,null,null,{"$f":"IF(ProjectMethod=SBS,SUM(SUMIF('Interior - Space-By-Space'!$M$16:OFFSET('Interior - Space-By-Space'!$M$56,-1,0),$B156,'Interior - Space-By-Space'!$O$16:OFFSET('Interior - Space-By-Space'!$O$56,-1,0)),SUMIF('Interior - Space-By-Space'!$Q$16:OFFSET('Interior - Space-By-Space'!$Q$56,-1,0),$B156,'Interior - Space-By-Space'!$S$16:OFFSET('Interior - Space-By-Space'!$S$56,-1,0)),SUMIF('Interior - Space-By-Space'!$U$16:OFFSET('Interior - Space-By-Space'!$U$56,-1,0),$B156,'Interior - Space-By-Space'!$W$16:OFFSET('Interior - Space-By-Space'!$W$56,-1,0)),SUMIF('Interior - Space-By-Space'!$Y$16:OFFSET('Interior - Space-By-Space'!$Y$56,-1,0),$B156,'Interior - Space-By-Space'!$AA$16:OFFSET('Interior - Space-By-Space'!$AA$56,-1,0)),SUMIF('Interior - Space-By-Space'!$AC$16:OFFSET('Interior - Space-By-Space'!$AC$56,-1,0),$B156,'Interior - Space-By-Space'!$AE$16:OFFSET('Interior - Space-By-Space'!$AE$56,-1,0)),SUMIF('Interior - Space-By-Space'!$AG$16:OFFSET('Interior - Space-By-Space'!$AG$56,-1,0),$B156,'Interior - Space-By-Space'!$AI$16:OFFSET('Interior - Space-By-Space'!$AI$56,-1,0)),SUMIF('Interior - Space-By-Space'!$AK$16:OFFSET('Interior - Space-By-Space'!$AK$56,-1,0),$B156,'Interior - Space-By-Space'!$AM$16:OFFSET('Interior - Space-By-Space'!$AM$56,-1,0)),SUMIF('Interior - Space-By-Space'!$AO$16:OFFSET('Interior - Space-By-Space'!$AO$56,-1,0),$B156,'Interior - Space-By-Space'!$AQ$16:OFFSET('Interior - Space-By-Space'!$AQ$56,-1,0))),IF(ProjectMethod=BAM,SUM('Interior - Building Area Method'!$C167,'Interior - Building Area Method'!$E167,'Interior - Building Area Method'!$G167,'Interior - Building Area Method'!$I167,'Interior - Building Area Method'!$K167),0))+SUM(SUMIF(Exterior!$J$19:$J$69,$B156,Exterior!$K$19:$K$69),SUMIF(Exterior!$M$19:$M$69,$B156,Exterior!$N$19:$N$69),SUMIF(Exterior!$P$19:$P$69,$B156,Exterior!$Q$19:$Q$69),SUMIF(Exterior!$S$19:$S$69,$B156,Exterior!$T$19:$T$69),SUMIF(Exterior!$V$19:$V$69,$B156,Exterior!$W$19:$W$69))","v":0}]
[null,null,null,null,{"$f":"IF(ProjectMethod=SBS,SUM(SUMIF('Interior - Space-By-Space'!$M$16:OFFSET('Interior - Space-By-Space'!$M$56,-1,0),$B157,'Interior - Space-By-Space'!$O$16:OFFSET('Interior - Space-By-Space'!$O$56,-1,0)),SUMIF('Interior - Space-By-Space'!$Q$16:OFFSET('Interior - Space-By-Space'!$Q$56,-1,0),$B157,'Interior - Space-By-Space'!$S$16:OFFSET('Interior - Space-By-Space'!$S$56,-1,0)),SUMIF('Interior - Space-By-Space'!$U$16:OFFSET('Interior - Space-By-Space'!$U$56,-1,0),$B157,'Interior - Space-By-Space'!$W$16:OFFSET('Interior - Space-By-Space'!$W$56,-1,0)),SUMIF('Interior - Space-By-Space'!$Y$16:OFFSET('Interior - Space-By-Space'!$Y$56,-1,0),$B157,'Interior - Space-By-Space'!$AA$16:OFFSET('Interior - Space-By-Space'!$AA$56,-1,0)),SUMIF('Interior - Space-By-Space'!$AC$16:OFFSET('Interior - Space-By-Space'!$AC$56,-1,0),$B157,'Interior - Space-By-Space'!$AE$16:OFFSET('Interior - Space-By-Space'!$AE$56,-1,0)),SUMIF('Interior - Space-By-Space'!$AG$16:OFFSET('Interior - Space-By-Space'!$AG$56,-1,0),$B157,'Interior - Space-By-Space'!$AI$16:OFFSET('Interior - Space-By-Space'!$AI$56,-1,0)),SUMIF('Interior - Space-By-Space'!$AK$16:OFFSET('Interior - Space-By-Space'!$AK$56,-1,0),$B157,'Interior - Space-By-Space'!$AM$16:OFFSET('Interior - Space-By-Space'!$AM$56,-1,0)),SUMIF('Interior - Space-By-Space'!$AO$16:OFFSET('Interior - Space-By-Space'!$AO$56,-1,0),$B157,'Interior - Space-By-Space'!$AQ$16:OFFSET('Interior - Space-By-Space'!$AQ$56,-1,0))),IF(ProjectMethod=BAM,SUM('Interior - Building Area Method'!$C168,'Interior - Building Area Method'!$E168,'Interior - Building Area Method'!$G168,'Interior - Building Area Method'!$I168,'Interior - Building Area Method'!$K168),0))+SUM(SUMIF(Exterior!$J$19:$J$69,$B157,Exterior!$K$19:$K$69),SUMIF(Exterior!$M$19:$M$69,$B157,Exterior!$N$19:$N$69),SUMIF(Exterior!$P$19:$P$69,$B157,Exterior!$Q$19:$Q$69),SUMIF(Exterior!$S$19:$S$69,$B157,Exterior!$T$19:$T$69),SUMIF(Exterior!$V$19:$V$69,$B157,Exterior!$W$19:$W$69))","v":0}]

{"sheet":"Interior - Building Area Method","index":3,"n_rows":168,"n_cols":16,"rows_kept":168,"cut":false,"hidden":false,"merged":[[49,14,49,15],[10,1,10,4],[0,1,0,12],[1,1,1,12],[15,1,15,4],[16,13,16,15],[3,1,3,2],[17,14,17,15],[25,14,25,15],[33,14,33,15],[41,14,41,15],[6,2,6,4],[7,2,7,4],[8,2,8,4],[5,1,5,6]]}
[null,"New Construction Program"]
[null,"Lighting Calculator"]
[null,{"$f":"'Basic Lists'!A100","v":"NCP LC v.4.0"}]
[null,"Interior lighting calculator"]
[]
[null,"Interior totals"]
[null,"LPD savings",{"$f":"IF(SUM($C$14:$K$14)=0,0,(C8*1000)/SUM($C$14:$K$14))","v":0},null,null,null,{"$f":"IF(ProjectUnits=\"Imperial\",\"W/sqft\",\"W/sqm\")","v":"W/sqm"}]
[null,"Demand savings",{"$f":"O59-O61","v":0},null,null,null,"kW"]
[null,"Energy savings",{"$f":"O60-O62","v":0},null,null,null,"kWh"]
[]
[null,"Building type information"]
[null,null,"Primary type",null,"Type #2",null,"Type #3",null,"Type #4",null,"Type #5"]
[null,"Building type",{"$f":"IF(ISBLANK(ProjectBuilding),\"\",ProjectBuilding)","v":""}]
[null,{"$f":"IF(ProjectUnits=\"Imperial\",\"Type area (sqft)\",\"Type area (sqm)\")","v":"Type area (sqm)"}]
[null,{"$f":"IF(NOT(OR(C13=ASHRAE!$O$23,E13=ASHRAE!$O$23,G13=ASHRAE!$O$23,I13=ASHRAE!$O$23,K13=ASHRAE!$O$23,C13=NECB!$N$22,E13=NECB!$N$22,G13=NECB!$N$22,I13=NECB!$N$22,K13=NECB!$N$22)),\"\",'Basic Lists'!$A$103)","v":""}]
[null,"Luminaire quantities"]
[null,"Luminaire type",{"$f":"IF(ISBLANK(ProjectBuilding),\"\",$C$13)","v":""},"Tot. W",{"$f":"IF(ISBLANK($E$13),\"\",$E$13)","v":""},"Tot. W",{"$f":"IF(ISBLANK($G$13),\"\",$G$13)","v":""},"Tot. W",{"$f":"IF(ISBLANK($I$13),\"\",$I$13)","v":""},"Tot. W",{"$f":"IF(ISBLANK($K$13),\"\",$K$13)","v":""},"Tot. W",null,"Building type calculated values"]
[null,{"$f":"IF('Luminaire Schedule'!B7=\"\",\"\",'Luminaire Schedule'!B7)","v":""},null,{"$f":"IF($B18=\"\",\"\",$C18*INDEX(Luminaire_Table,MATCH($B18,Luminaire_Types,0),3))","v":""},null,{"$f":"IF($B18=\"\",\"\",$E18*INDEX(Luminaire_Table,MATCH($B18,Luminaire_Types,0),3))","v":""},null,{"$f":"IF($B18=\"\",\"\",$G18*INDEX(Luminaire_Table,MATCH($B18,Luminaire_Types,0),3))","v":""},null,{"$f":"IF($B18=\"\",\"\",$I18*INDEX(Luminaire_Table,MATCH($B18,Luminaire_Types,0),3))","v":""},null,{"$f":"IF($B18=\"\",\"\",$K18*INDEX(Luminaire_Table,MATCH($B18,Luminaire_Types,0),3))","v":""},null,"Primary building type",{"$f":"IF(ISBLANK(ProjectBuilding),\"\",ProjectBuilding)","v":""}]
[null,{"$f":"IF('Luminaire Schedule'!B8=\"\",\"\",'Luminaire Schedule'!B8)","v":""},null,{"$f":"IF($B19=\"\",\"\",$C19*INDEX(Luminaire_Table,MATCH($B19,Luminaire_Types,0),3))","v":""},null,{"$f":"IF($B19=\"\",\"\",$E19*INDEX(Luminaire_Table,MATCH($B19,Luminaire_Types,0),3))","v":""},null,{"$f":"IF($B19=\"\",\"\",$G19*INDEX(Luminaire_Table,MATCH($B19,Luminaire_Types,0),3))","v":""},null,{"$f":"IF($B19=\"\",\"\",$I19*INDEX(Luminaire_Table,MATCH($B19,Luminaire_Types,0),3))","v":""},null,{"$f":"IF($B19=\"\",\"\",$K19*INDEX(Luminaire_Table,MATCH($B19,Luminaire_Types,0),3))","v":""},null,"Annual operation hours",{"$f":"IF(ISBLANK(ProjectBuilding),\"\",IF(ProjectCode=NECB,INDEX(NECB_BuildingTable,MATCH($C13,NECB_BuildingTypes,0),4),IF(ProjectCode=ASHRAE,INDEX(ASHRAE_BuildingTable,MATCH($C13,ASHRAE_BuildingTypes,0),4),\"\")))","v":""},"hrs"]
[null,{"$f":"IF('Luminaire Schedule'!B9=\"\",\"\",'Luminaire Schedule'!B9)","v":""},null,{"$f":"IF($B20=\"\",\"\",$C20*INDEX(Luminaire_Table,MATCH($B20,Luminaire_Types,0),3))","v":""},null,{"$f":"IF($B20=\"\",\"\",$E20*INDEX(Luminaire_Table,MATCH($B20,Luminaire_Types,0),3))","v":""},null,{"$f":"IF($B20=\"\",\"\",$G20*INDEX(Luminaire_Table,MATCH($B20,Luminaire_Types,0),3))","v":""},null,{"$f":"IF($B20=\"\",\"\",$I20*INDEX(Luminaire_Table,MATCH($B20,Luminaire_Types,0),3))","v":""},null,{"$f":"IF($B20=\"\",\"\",$K20*INDEX(Luminaire_Table,MATCH($B20,Luminaire_Types,0),3))","v":""},null,"Baseline LPD",{"$f":"IF(ISBLANK(ProjectBuilding),\"\",IF(ProjectCode=NECB,INDEX(NECB_BuildingTable,MATCH($C13,NECB_BuildingTypes,0),3),IF(ProjectCode=ASHRAE,INDEX(ASHRAE_BuildingTable,MATCH($C13,ASHRAE_BuildingTypes,0),3),\"\")))","v":""},{"$f":"IF(ProjectUnits=\"Imperial\",\"W/sqft\",\"W/sqm\")","v":"W/sqm"}]
[null,{"$f":"IF('Luminaire Schedule'!B10=\"\",\"\",'Luminaire Schedule'!B10)","v":""},null,{"$f":"IF($B21=\"\",\"\",$C21*INDEX(Luminaire_Table,MATCH($B21,Luminaire_Types,0),3))","v":""},null,{"$f":"IF($B21=\"\",\"\",$E21*INDEX(Luminaire_Table,MATCH($B21,Luminaire_Types,0),3))","v":""},null,{"$f":"IF($B21=\"\",\"\",$G21*INDEX(Luminaire_Table,MATCH($B21,Luminaire_Types,0),3))","v":""},null,{"$f":"IF($B21=\"\",\"\",$I21*INDEX(Luminaire_Table,MATCH($B21,Luminaire_Types,0),3))","v":""},null,{"$f":"IF($B21=\"\",\"\",$K21*INDEX(Luminaire_Table,MATCH($B21,Luminaire_Types,0),3))","v":""},null,"Baseline demand",{"$f":"IF(ISBLANK(ProjectBuilding),\"\",ROUND(O20*C14/1000,2))","v":""},"kW"]
[null,{"$f":"IF('Luminaire Schedule'!B11=\"\",\"\",'Luminaire Schedule'!B11)","v":""},null,{"$f":"IF($B22=\"\",\"\",$C22*INDEX(Luminaire_Table,MATCH($B22,Luminaire_Types,0),3))","v":""},null,{"$f":"IF($B22=\"\",\"\",$E22*INDEX(Luminaire_Table,MATCH($B22,Luminaire_Types,0),3))","v":""},null,{"$f":"IF($B22=\"\",\"\",$G22*INDEX(Luminaire_Table,MATCH($B22,Luminaire_Types,0),3))","v":""},null,{"$f":"IF($B22=\"\",\"\",$I22*INDEX(Luminaire_Table,MATCH($B22,Luminaire_Types,0),3))","v":""},null,{"$f":"IF($B22=\"\",\"\",$K22*INDEX(Luminaire_Table,MATCH($B22,Luminaire_Types,0),3))","v":""},null,"Baseline lighting energy",{"$f":"IF(ISBLANK(ProjectBuilding),\"\",O21*O19)","v":""},"kWh"]
[null,{"$f":"IF('Luminaire Schedule'!B12=\"\",\"\",'Luminaire Schedule'!B12)","v":""},null,{"$f":"IF($B23=\"\",\"\",$C23*INDEX(Luminaire_Table,MATCH($B23,Luminaire_Types,0),3))","v":""},null,{"$f":"IF($B23=\"\",\"\",$E23*INDEX(Luminaire_Table,MATCH($B23,Luminaire_Types,0),3))","v":""},null,{"$f":"IF($B23=\"\",\"\",$G23*INDEX(Luminaire_Table,MATCH($B23,Luminaire_Types,0),3))","v":""},null,{"$f":"IF($B23=\"\",\"\",$I23*INDEX(Luminaire_Table,MATCH($B23,Luminaire_Types,0),3))","v":""},null,{"$f":"IF($B23=\"\",\"\",$K23*INDEX(Luminaire_Table,MATCH($B23,Luminaire_Types,0),3))","v":""},null,"Design LPD",{"$f":"IF(ISBLANK(ProjectBuilding),\"\",(O24*1000)/C14)","v":""},{"$f":"IF(ProjectUnits=\"Imperial\",\"W/sqft\",\"W/sqm\")","v":"W/sqm"}]
[null,{"$f":"IF('Luminaire Schedule'!B13=\"\",\"\",'Luminaire Schedule'!B13)","v":""},null,{"$f":"IF($B24=\"\",\"\",$C24*INDEX(Luminaire_Table,MATCH($B24,Luminaire_Types,0),3))","v":""},null,{"$f":"IF($B24=\"\",\"\",$E24*INDEX(Luminaire_Table,MATCH($B24,Luminaire_Types,0),3))","v":""},null,{"$f":"IF($B24=\"\",\"\",$G24*INDEX(Luminaire_Table,MATCH($B24,Luminaire_Types,0),3))","v":""},null,{"$f":"IF($B24=\"\",\"\",$I24*INDEX(Luminaire_Table,MATCH($B24,Luminaire_Types,0),3))","v":""},null,{"$f":"IF($B24=\"\",\"\",$K24*INDEX(Luminaire_Table,MATCH($B24,Luminaire_Types,0),3))","v":""},null,"Design demand",{"$f":"IF(ISBLANK(ProjectBuilding),\"\",ROUND(SUM($D$18:$D$168)/1000,2))","v":""},"kW"]
[null,{"$f":"IF('Luminaire Schedule'!B14=\"\",\"\",'Luminaire Schedule'!B14)","v":""},null,{"$f":"IF($B25=\"\",\"\",$C25*INDEX(Luminaire_Table,MATCH($B25,Luminaire_Types,0),3))","v":""},null,{"$f":"IF($B25=\"\",\"\",$E25*INDEX(Luminaire_Table,MATCH($B25,Luminaire_Types,0),3))","v":""},null,{"$f":"IF($B25=\"\",\"\",$G25*INDEX(Luminaire_Table,MATCH($B25,Luminaire_Types,0),3))","v":""},null,{"$f":"IF($B25=\"\",\"\",$I25*INDEX(Luminaire_Table,MATCH($B25,Luminaire_Types,0),3))","v":""},null,{"$f":"IF($B25=\"\",\"\",$K25*INDEX(Luminaire_Table,MATCH($B25,Luminaire_Types,0),3))","v":""},null,"Design lighting energy",{"$f":"IF(ISBLANK(ProjectBuilding),\"\",O24*O19)","v":""},"kWh"]
[null,{"$f":"IF('Luminaire Schedule'!B15=\"\",\"\",'Luminaire Schedule'!B15)","v":""},null,{"$f":"IF($B26=\"\",\"\",$C26*INDEX(Luminaire_Table,MATCH($B26,Luminaire_Types,0),3))","v":""},null,{"$f":"IF($B26=\"\",\"\",$E26*INDEX(Luminaire_Table,MATCH($B26,Luminaire_Types,0),3))","v":""},null,{"$f":"IF($B26=\"\",\"\",$G26*INDEX(Luminaire_Table,MATCH($B26,Luminaire_Types,0),3))","v":""},null,{"$f":"IF($B26=\"\",\"\",$I26*INDEX(Luminaire_Table,MATCH($B26,Luminaire_Types,0),3))","v":""},null,{"$f":"IF($B26=\"\",\"\",$K26*INDEX(Luminaire_Table,MATCH($B26,Luminaire_Types,0),3))","v":""},null,"Building type #2",{"$f":"IF(ISBLANK($E$13),\"\",$E$13)","v":""}]
[null,{"$f":"IF('Luminaire Schedule'!B16=\"\",\"\",'Luminaire Schedule'!B16)","v":""},null,{"$f":"IF($B27=\"\",\"\",$C27*INDEX(Luminaire_Table,MATCH($B27,Luminaire_Types,0),3))","v":""},null,{"$f":"IF($B27=\"\",\"\",$E27*INDEX(Luminaire_Table,MATCH($B27,Luminaire_Types,0),3))","v":""},null,{"$f":"IF($B27=\"\",\"\",$G27*INDEX(Luminaire_Table,MATCH($B27,Luminaire_Types,0),3))","v":""},null,{"$f":"IF($B27=\"\",\"\",$I27*INDEX(Luminaire_Table,MATCH($B27,Luminaire_Types,0),3))","v":""},null,{"$f":"IF($B27=\"\",\"\",$K27*INDEX(Luminaire_Table,MATCH($B27,Luminaire_Types,0),3))","v":""},null,"Annual operation hours",{"$f":"IF(ISBLANK(E13),\"\",IF(ProjectCode=NECB,INDEX(NECB_BuildingTable,MATCH($E13,NECB_BuildingTypes,0),4),IF(ProjectCode=ASHRAE,INDEX(ASHRAE_BuildingTable,MATCH($E13,ASHRAE_BuildingTypes,0),4),\"\")))","v":""},"hrs"]
[null,{"$f":"IF('Luminaire Schedule'!B17=\"\",\"\",'Luminaire Schedule'!B17)","v":""},null,{"$f":"IF($B28=\"\",\"\",$C28*INDEX(Luminaire_Table,MATCH($B28,Luminaire_Types,0),3))","v":""},null,{"$f":"IF($B28=\"\",\"\",$E28*INDEX(Luminaire_Table,MATCH($B28,Luminaire_Types,0),3))","v":""},null,{"$f":"IF($B28=\"\",\"\",$G28*INDEX(Luminaire_Table,MATCH($B28,Luminaire_Types,0),3))","v":""},null,{"$f":"IF($B28=\"\",\"\",$I28*INDEX(Luminaire_Table,MATCH($B28,Luminaire_Types,0),3))","v":""},null,{"$f":"IF($B28=\"\",\"\",$K28*INDEX(Luminaire_Table,MATCH($B28,Luminaire_Types,0),3))","v":""},null,"Baseline LPD",{"$f":"IF(ISBLANK(E13),\"\",IF(ProjectCode=NECB,INDEX(NECB_BuildingTable,MATCH($E13,NECB_BuildingTypes,0),3),IF(ProjectCode=ASHRAE,INDEX(ASHRAE_BuildingTable,MATCH($E13,ASHRAE_BuildingTypes,0),3),\"\")))","v":""},{"$f":"IF(ProjectUnits=\"Imperial\",\"W/sqft\",\"W/sqm\")","v":"W/sqm"}]
[null,{"$f":"IF('Luminaire Schedule'!B18=\"\",\"\",'Luminaire Schedule'!B18)","v":""},null,{"$f":"IF($B29=\"\",\"\",$C29*INDEX(Luminaire_Table,MATCH($B29,Luminaire_Types,0),3))","v":""},null,{"$f":"IF($B29=\"\",\"\",$E29*INDEX(Luminaire_Table,MATCH($B29,Luminaire_Types,0),3))","v":""},null,{"$f":"IF($B29=\"\",\"\",$G29*INDEX(Luminaire_Table,MATCH($B29,Luminaire_Types,0),3))","v":""},null,{"$f":"IF($B29=\"\",\"\",$I29*INDEX(Luminaire_Table,MATCH($B29,Luminaire_Types,0),3))","v":""},null,{"$f":"IF($B29=\"\",\"\",$K29*INDEX(Luminaire_Table,MATCH($B29,Luminaire_Types,0),3))","v":""},null,"Baseline demand",{"$f":"IF(ISBLANK(E13),\"\",ROUND(O28*E14/1000,2))","v":""},"kW"]
[null,{"$f":"IF('Luminaire Schedule'!B19=\"\",\"\",'Luminaire Schedule'!B19)","v":""},null,{"$f":"IF($B30=\"\",\"\",$C30*INDEX(Luminaire_Table,MATCH($B30,Luminaire_Types,0),3))","v":""},null,{"$f":"IF($B30=\"\",\"\",$E30*INDEX(Luminaire_Table,MATCH($B30,Luminaire_Types,0),3))","v":""},null,{"$f":"IF($B30=\"\",\"\",$G30*INDEX(Luminaire_Table,MATCH($B30,Luminaire_Types,0),3))","v":""},null,{"$f":"IF($B30=\"\",\"\",$I30*INDEX(Luminaire_Table,MATCH($B30,Luminaire_Types,0),3))","v":""},null,{"$f":"IF($B30=\"\",\"\",$K30*INDEX(Luminaire_Table,MATCH($B30,Luminaire_Types,0),3))","v":""},null,"Baseline lighting energy",{"$f":"IF(ISBLANK(E13),\"\",O29*O27)","v":""},"kWh"]
[null,{"$f":"IF('Luminaire Schedule'!B20=\"\",\"\",'Luminaire Schedule'!B20)","v":""},null,{"$f":"IF($B31=\"\",\"\",$C31*INDEX(Luminaire_Table,MATCH($B31,Luminaire_Types,0),3))","v":""},null,{"$f":"IF($B31=\"\",\"\",$E31*INDEX(Luminaire_Table,MATCH($B31,Luminaire_Types,0),3))","v":""},null,{"$f":"IF($B31=\"\",\"\",$G31*INDEX(Luminaire_Table,MATCH($B31,Luminaire_Types,0),3))","v":""},null,{"$f":"IF($B31=\"\",\"\",$I31*INDEX(Luminaire_Table,MATCH($B31,Luminaire_Types,0),3))","v":""},null,{"$f":"IF($B31=\"\",\"\",$K31*INDEX(Luminaire_Table,MATCH($B31,Luminaire_Types,0),3))","v":""},null,"Design LPD",{"$f":"IF(ISBLANK(E13),\"\",(O32*1000)/E14)","v":""},{"$f":"IF(ProjectUnits=\"Imperial\",\"W/sqft\",\"W/sqm\")","v":"W/sqm"}]
[null,{"$f":"IF('Luminaire Schedule'!B21=\"\",\"\",'Luminaire Schedule'!B21)","v":""},null,{"$f":"IF($B32=\"\",\"\",$C32*INDEX(Luminaire_Table,MATCH($B32,Luminaire_Types,0),3))","v":""},null,{"$f":"IF($B32=\"\",\"\",$E32*INDEX(Luminaire_Table,MATCH($B32,Luminaire_Types,0),3))","v":""},null,{"$f":"IF($B32=\"\",\"\",$G32*INDEX(Luminaire_Table,MATCH($B32,Luminaire_Types,0),3))","v":""},null,{"$f":"IF($B32=\"\",\"\",$I32*INDEX(Luminaire_Table,MATCH($B32,Luminaire_Types,0),3))","v":""},null,{"$f":"IF($B32=\"\",\"\",$K32*INDEX(Luminaire_Table,MATCH($B32,Luminaire_Types,0),3))","v":""},null,"Design demand",{"$f":"IF(ISBLANK(E13),\"\",ROUND(SUM($F$18:$F$168)/1000,2))","v":""},"kW"]
[null,{"$f":"IF('Luminaire Schedule'!B22=\"\",\"\",'Luminaire Schedule'!B22)","v":""},null,{"$f":"IF($B33=\"\",\"\",$C33*INDEX(Luminaire_Table,MATCH($B33,Luminaire_Types,0),3))","v":""},null,{"$f":"IF($B33=\"\",\"\",$E33*INDEX(Luminaire_Table,MATCH($B33,Luminaire_Types,0),3))","v":""},null,{"$f":"IF($B33=\"\",\"\",$G33*INDEX(Luminaire_Table,MATCH($B33,Luminaire_Types,0),3))","v":""},null,{"$f":"IF($B33=\"\",\"\",$I33*INDEX(Luminaire_Table,MATCH($B33,Luminaire_Types,0),3))","v":""},null,{"$f":"IF($B33=\"\",\"\",$K33*INDEX(Luminaire_Table,MATCH($B33,Luminaire_Types,0),3))","v":""},null,"Design lighting energy",{"$f":"IF(ISBLANK(E13),\"\",O32*O27)","v":""},"kWh"]
[null,{"$f":"IF('Luminaire Schedule'!B23=\"\",\"\",'Luminaire Schedule'!B23)","v":""},null,{"$f":"IF($B34=\"\",\"\",$C34*INDEX(Luminaire_Table,MATCH($B34,Luminaire_Types,0),3))","v":""},null,{"$f":"IF($B34=\"\",\"\",$E34*INDEX(Luminaire_Table,MATCH($B34,Luminaire_Types,0),3))","v":""},null,{"$f":"IF($B34=\"\",\"\",$G34*INDEX(Luminaire_Table,MATCH($B34,Luminaire_Types,0),3))","v":""},null,{"$f":"IF($B34=\"\",\"\",$I34*INDEX(Luminaire_Table,MATCH($B34,Luminaire_Types,0),3))","v":""},null,{"$f":"IF($B34=\"\",\"\",$K34*INDEX(Luminaire_Table,MATCH($B34,Luminaire_Types,0),3))","v":""},null,"Building type #3",{"$f":"IF(ISBLANK($G$13),\"\",$G$13)","v":""}]
[null,{"$f":"IF('Luminaire Schedule'!B24=\"\",\"\",'Luminaire Schedule'!B24)","v":""},null,{"$f":"IF($B35=\"\",\"\",$C35*INDEX(Luminaire_Table,MATCH($B35,Luminaire_Types,0),3))","v":""},null,{"$f":"IF($B35=\"\",\"\",$E35*INDEX(Luminaire_Table,MATCH($B35,Luminaire_Types,0),3))","v":""},null,{"$f":"IF($B35=\"\",\"\",$G35*INDEX(Luminaire_Table,MATCH($B35,Luminaire_Types,0),3))","v":""},null,{"$f":"IF($B35=\"\",\"\",$I35*INDEX(Luminaire_Table,MATCH($B35,Luminaire_Types,0),3))","v":""},null,{"$f":"IF($B35=\"\",\"\",$K35*INDEX(Luminaire_Table,MATCH($B35,Luminaire_Types,0),3))","v":""},null,"Annual operation hours",{"$f":"IF(ISBLANK(G13),\"\",IF(ProjectCode=NECB,INDEX(NECB_BuildingTable,MATCH($G13,NECB_BuildingTypes,0),4),IF(ProjectCode=ASHRAE,INDEX(ASHRAE_BuildingTable,MATCH($G13,ASHRAE_BuildingTypes,0),4),\"\")))","v":""},"hrs"]
[null,{"$f":"IF('Luminaire Schedule'!B25=\"\",\"\",'Luminaire Schedule'!B25)","v":""},null,{"$f":"IF($B36=\"\",\"\",$C36*INDEX(Luminaire_Table,MATCH($B36,Luminaire_Types,0),3))","v":""},null,{"$f":"IF($B36=\"\",\"\",$E36*INDEX(Luminaire_Table,MATCH($B36,Luminaire_Types,0),3))","v":""},null,{"$f":"IF($B36=\"\",\"\",$G36*INDEX(Luminaire_Table,MATCH($B36,Luminaire_Types,0),3))","v":""},null,{"$f":"IF($B36=\"\",\"\",$I36*INDEX(Luminaire_Table,MATCH($B36,Luminaire_Types,0),3))","v":""},null,{"$f":"IF($B36=\"\",\"\",$K36*INDEX(Luminaire_Table,MATCH($B36,Luminaire_Types,0),3))","v":""},null,"Baseline LPD",{"$f":"IF(ISBLANK(G13),\"\",IF(ProjectCode=NECB,INDEX(NECB_BuildingTable,MATCH($G13,NECB_BuildingTypes,0),3),IF(ProjectCode=ASHRAE,INDEX(ASHRAE_BuildingTable,MATCH($G13,ASHRAE_BuildingTypes,0),3),\"\")))","v":""},{"$f":"IF(ProjectUnits=\"Imperial\",\"W/sqft\",\"W/sqm\")","v":"W/sqm"}]
[null,{"$f":"IF('Luminaire Schedule'!B26=\"\",\"\",'Luminaire Schedule'!B26)","v":""},null,{"$f":"IF($B37=\"\",\"\",$C37*INDEX(Luminaire_Table,MATCH($B37,Luminaire_Types,0),3))","v":""},null,{"$f":"IF($B37=\"\",\"\",$E37*INDEX(Luminaire_Table,MATCH($B37,Luminaire_Types,0),3))","v":""},null,{"$f":"IF($B37=\"\",\"\",$G37*INDEX(Luminaire_Table,MATCH($B37,Luminaire_Types,0),3))","v":""},null,{"$f":"IF($B37=\"\",\"\",$I37*INDEX(Luminaire_Table,MATCH($B37,Luminaire_Types,0),3))","v":""},null,{"$f":"IF($B37=\"\",\"\",$K37*INDEX(Luminaire_Table,MATCH($B37,Luminaire_Types,0),3))","v":""},null,"Baseline demand",{"$f":"IF(ISBLANK(G13),\"\",ROUND(O36*G14/1000,2))","v":""},"kW"]
[null,{"$f":"IF('Luminaire Schedule'!B27=\"\",\"\",'Luminaire Schedule'!B27)","v":""},null,{"$f":"IF($B38=\"\",\"\",$C38*INDEX(Luminaire_Table,MATCH($B38,Luminaire_Types,0),3))","v":""},null,{"$f":"IF($B38=\"\",\"\",$E38*INDEX(Luminaire_Table,MATCH($B38,Luminaire_Types,0),3))","v":""},null,{"$f":"IF($B38=\"\",\"\",$G38*INDEX(Luminaire_Table,MATCH($B38,Luminaire_Types,0),3))","v":""},null,{"$f":"IF($B38=\"\",\"\",$I38*INDEX(Luminaire_Table,MATCH($B38,Luminaire_Types,0),3))","v":""},null,{"$f":"IF($B38=\"\",\"\",$K38*INDEX(Luminaire_Table,MATCH($B38,Luminaire_Types,0),3))","v":""},null,"Baseline lighting energy",{"$f":"IF(ISBLANK(G13),\"\",O37*O35)","v":""},"kWh"]
[null,{"$f":"IF('Luminaire Schedule'!B28=\"\",\"\",'Luminaire Schedule'!B28)","v":""},null,{"$f":"IF($B39=\"\",\"\",$C39*INDEX(Luminaire_Table,MATCH($B39,Luminaire_Types,0),3))","v":""},null,{"$f":"IF($B39=\"\",\"\",$E39*INDEX(Luminaire_Table,MATCH($B39,Luminaire_Types,0),3))","v":""},null,{"$f":"IF($B39=\"\",\"\",$G39*INDEX(Luminaire_Table,MATCH($B39,Luminaire_Types,0),3))","v":""},null,{"$f":"IF($B39=\"\",\"\",$I39*INDEX(Luminaire_Table,MATCH($B39,Luminaire_Types,0),3))","v":""},null,{"$f":"IF($B39=\"\",\"\",$K39*INDEX(Luminaire_Table,MATCH($B39,Luminaire_Types,0),3))","v":""},null,"Design LPD",{"$f":"IF(ISBLANK(G13),\"\",(O40*1000)/G14)","v":""},{"$f":"IF(ProjectUnits=\"Imperial\",\"W/sqft\",\"W/sqm\")","v":"W/sqm"}]
[null,{"$f":"IF('Luminaire Schedule'!B29=\"\",\"\",'Luminaire Schedule'!B29)","v":""},null,{"$f":"IF($B40=\"\",\"\",$C40*INDEX(Luminaire_Table,MATCH($B40,Luminaire_Types,0),3))","v":""},null,{"$f":"IF($B40=\"\",\"\",$E40*INDEX(Luminaire_Table,MATCH($B40,Luminaire_Types,0),3))","v":""},null,{"$f":"IF($B40=\"\",\"\",$G40*INDEX(Luminaire_Table,MATCH($B40,Luminaire_Types,0),3))","v":""},null,{"$f":"IF($B40=\"\",\"\",$I40*INDEX(Luminaire_Table,MATCH($B40,Luminaire_Types,0),3))","v":""},null,{"$f":"IF($B40=\"\",\"\",$K40*INDEX(Luminaire_Table,MATCH($B40,Luminaire_Types,0),3))","v":""},null,"Design demand",{"$f":"IF(ISBLANK(G13),\"\",ROUND(SUM($H$18:$H$168)/1000,2))","v":""},"kW"]
[null,{"$f":"IF('Luminaire Schedule'!B30=\"\",\"\",'Luminaire Schedule'!B30)","v":""},null,{"$f":"IF($B41=\"\",\"\",$C41*INDEX(Luminaire_Table,MATCH($B41,Luminaire_Types,0),3))","v":""},null,{"$f":"IF($B41=\"\",\"\",$E41*INDEX(Luminaire_Table,MATCH($B41,Luminaire_Types,0),3))","v":""},null,{"$f":"IF($B41=\"\",\"\",$G41*INDEX(Luminaire_Table,MATCH($B41,Luminaire_Types,0),3))","v":""},null,{"$f":"IF($B41=\"\",\"\",$I41*INDEX(Luminaire_Table,MATCH($B41,Luminaire_Types,0),3))","v":""},null,{"$f":"IF($B41=\"\",\"\",$K41*INDEX(Luminaire_Table,MATCH($B41,Luminaire_Types,0),3))","v":""},null,"Design lighting energy",{"$f":"IF(ISBLANK(G13),\"\",O40*O35)","v":""},"kWh"]
[null,{"$f":"IF('Luminaire Schedule'!B31=\"\",\"\",'Luminaire Schedule'!B31)","v":""},null,{"$f":"IF($B42=\"\",\"\",$C42*INDEX(Luminaire_Table,MATCH($B42,Luminaire_Types,0),3))","v":""},null,{"$f":"IF($B42=\"\",\"\",$E42*INDEX(Luminaire_Table,MATCH($B42,Luminaire_Types,0),3))","v":""},null,{"$f":"IF($B42=\"\",\"\",$G42*INDEX(Luminaire_Table,MATCH($B42,Luminaire_Types,0),3))","v":""},null,{"$f":"IF($B42=\"\",\"\",$I42*INDEX(Luminaire_Table,MATCH($B42,Luminaire_Types,0),3))","v":""},null,{"$f":"IF($B42=\"\",\"\",$K42*INDEX(Luminaire_Table,MATCH($B42,Luminaire_Types,0),3))","v":""},null,"Building type #4",{"$f":"IF(ISBLANK($I$13),\"\",$I$13)","v":""}]
[null,{"$f":"IF('Luminaire Schedule'!B32=\"\",\"\",'Luminaire Schedule'!B32)","v":""},null,{"$f":"IF($B43=\"\",\"\",$C43*INDEX(Luminaire_Table,MATCH($B43,Luminaire_Types,0),3))","v":""},null,{"$f":"IF($B43=\"\",\"\",$E43*INDEX(Luminaire_Table,MATCH($B43,Luminaire_Types,0),3))","v":""},null,{"$f":"IF($B43=\"\",\"\",$G43*INDEX(Luminaire_Table,MATCH($B43,Luminaire_Types,0),3))","v":""},null,{"$f":"IF($B43=\"\",\"\",$I43*INDEX(Luminaire_Table,MATCH($B43,Luminaire_Types,0),3))","v":""},null,{"$f":"IF($B43=\"\",\"\",$K43*INDEX(Luminaire_Table,MATCH($B43,Luminaire_Types,0),3))","v":""},null,"Annual operation hours",{"$f":"IF(ISBLANK(I13),\"\",IF(ProjectCode=NECB,INDEX(NECB_BuildingTable,MATCH($I13,NECB_BuildingTypes,0),4),IF(ProjectCode=ASHRAE,INDEX(ASHRAE_BuildingTable,MATCH($I13,ASHRAE_BuildingTypes,0),4),\"\")))","v":""},"hrs"]
[null,{"$f":"IF('Luminaire Schedule'!B33=\"\",\"\",'Luminaire Schedule'!B33)","v":""},null,{"$f":"IF($B44=\"\",\"\",$C44*INDEX(Luminaire_Table,MATCH($B44,Luminaire_Types,0),3))","v":""},null,{"$f":"IF($B44=\"\",\"\",$E44*INDEX(Luminaire_Table,MATCH($B44,Luminaire_Types,0),3))","v":""},null,{"$f":"IF($B44=\"\",\"\",$G44*INDEX(Luminaire_Table,MATCH($B44,Luminaire_Types,0),3))","v":""},null,{"$f":"IF($B44=\"\",\"\",$I44*INDEX(Luminaire_Table,MATCH($B44,Luminaire_Types,0),3))","v":""},null,{"$f":"IF($B44=\"\",\"\",$K44*INDEX(Luminaire_Table,MATCH($B44,Luminaire_Types,0),3))","v":""},null,"Baseline LPD",{"$f":"IF(ISBLANK(I13),\"\",IF(ProjectCode=NECB,INDEX(NECB_BuildingTable,MATCH($I13,NECB_BuildingTypes,0),3),IF(ProjectCode=ASHRAE,INDEX(ASHRAE_BuildingTable,MATCH($I13,ASHRAE_BuildingTypes,0),3),\"\")))","v":""},{"$f":"IF(ProjectUnits=\"Imperial\",\"W/sqft\",\"W/sqm\")","v":"W/sqm"}]
[null,{"$f":"IF('Luminaire Schedule'!B34=\"\",\"\",'Luminaire Schedule'!B34)","v":""},null,{"$f":"IF($B45=\"\",\"\",$C45*INDEX(Luminaire_Table,MATCH($B45,Luminaire_Types,0),3))","v":""},null,{"$f":"IF($B45=\"\",\"\",$E45*INDEX(Luminaire_Table,MATCH($B45,Luminaire_Types,0),3))","v":""},null,{"$f":"IF($B45=\"\",\"\",$G45*INDEX(Luminaire_Table,MATCH($B45,Luminaire_Types,0),3))","v":""},null,{"$f":"IF($B45=\"\",\"\",$I45*INDEX(Luminaire_Table,MATCH($B45,Luminaire_Types,0),3))","v":""},null,{"$f":"IF($B45=\"\",\"\",$K45*INDEX(Luminaire_Table,MATCH($B45,Luminaire_Types,0),3))","v":""},null,"Baseline demand",{"$f":"IF(ISBLANK(I13),\"\",ROUND(O44*I14/1000,2))","v":""},"kW"]
[null,{"$f":"IF('Luminaire Schedule'!B35=\"\",\"\",'Luminaire Schedule'!B35)","v":""},null,{"$f":"IF($B46=\"\",\"\",$C46*INDEX(Luminaire_Table,MATCH($B46,Luminaire_Types,0),3))","v":""},null,{"$f":"IF($B46=\"\",\"\",$E46*INDEX(Luminaire_Table,MATCH($B46,Luminaire_Types,0),3))","v":""},null,{"$f":"IF($B46=\"\",\"\",$G46*INDEX(Luminaire_Table,MATCH($B46,Luminaire_Types,0),3))","v":""},null,{"$f":"IF($B46=\"\",\"\",$I46*INDEX(Luminaire_Table,MATCH($B46,Luminaire_Types,0),3))","v":""},null,{"$f":"IF($B46=\"\",\"\",$K46*INDEX(Luminaire_Table,MATCH($B46,Luminaire_Types,0),3))","v":""},null,"Baseline lighting energy",{"$f":"IF(ISBLANK(I13),\"\",O45*O43)","v":""},"kWh"]
[null,{"$f":"IF('Luminaire Schedule'!B36=\"\",\"\",'Luminaire Schedule'!B36)","v":""},null,{"$f":"IF($B47=\"\",\"\",$C47*INDEX(Luminaire_Table,MATCH($B47,Luminaire_Types,0),3))","v":""},null,{"$f":"IF($B47=\"\",\"\",$E47*INDEX(Luminaire_Table,MATCH($B47,Luminaire_Types,0),3))","v":""},null,{"$f":"IF($B47=\"\",\"\",$G47*INDEX(Luminaire_Table,MATCH($B47,Luminaire_Types,0),3))","v":""},null,{"$f":"IF($B47=\"\",\"\",$I47*INDEX(Luminaire_Table,MATCH($B47,Luminaire_Types,0),3))","v":""},null,{"$f":"IF($B47=\"\",\"\",$K47*INDEX(Luminaire_Table,MATCH($B47,Luminaire_Types,0),3))","v":""},null,"Design LPD",{"$f":"IF(ISBLANK(I13),\"\",(O48*1000)/I14)","v":""},{"$f":"IF(ProjectUnits=\"Imperial\",\"W/sqft\",\"W/sqm\")","v":"W/sqm"}]
[null,{"$f":"IF('Luminaire Schedule'!B37=\"\",\"\",'Luminaire Schedule'!B37)","v":""},null,{"$f":"IF($B48=\"\",\"\",$C48*INDEX(Luminaire_Table,MATCH($B48,Luminaire_Types,0),3))","v":""},null,{"$f":"IF($B48=\"\",\"\",$E48*INDEX(Luminaire_Table,MATCH($B48,Luminaire_Types,0),3))","v":""},null,{"$f":"IF($B48=\"\",\"\",$G48*INDEX(Luminaire_Table,MATCH($B48,Luminaire_Types,0),3))","v":""},null,{"$f":"IF($B48=\"\",\"\",$I48*INDEX(Luminaire_Table,MATCH($B48,Luminaire_Types,0),3))","v":""},null,{"$f":"IF($B48=\"\",\"\",$K48*INDEX(Luminaire_Table,MATCH($B48,Luminaire_Types,0),3))","v":""},null,"Design demand",{"$f":"IF(ISBLANK(I13),\"\",ROUND(SUM($J$18:$J$168)/1000,2))","v":""},"kW"]
[null,{"$f":"IF('Luminaire Schedule'!B38=\"\",\"\",'Luminaire Schedule'!B38)","v":""},null,{"$f":"IF($B49=\"\",\"\",$C49*INDEX(Luminaire_Table,MATCH($B49,Luminaire_Types,0),3))","v":""},null,{"$f":"IF($B49=\"\",\"\",$E49*INDEX(Luminaire_Table,MATCH($B49,Luminaire_Types,0),3))","v":""},null,{"$f":"IF($B49=\"\",\"\",$G49*INDEX(Luminaire_Table,MATCH($B49,Luminaire_Types,0),3))","v":""},null,{"$f":"IF($B49=\"\",\"\",$I49*INDEX(Luminaire_Table,MATCH($B49,Luminaire_Types,0),3))","v":""},null,{"$f":"IF($B49=\"\",\"\",$K49*INDEX(Luminaire_Table,MATCH($B49,Luminaire_Types,0),3))","v":""},null,"Design lighting energy",{"$f":"IF(ISBLANK(I13),\"\",O48*O43)","v":""},"kWh"]
[null,{"$f":"IF('Luminaire Schedule'!B39=\"\",\"\",'Luminaire Schedule'!B39)","v":""},null,{"$f":"IF($B50=\"\",\"\",$C50*INDEX(Luminaire_Table,MATCH($B50,Luminaire_Types,0),3))","v":""},null,{"$f":"IF($B50=\"\",\"\",$E50*INDEX(Luminaire_Table,MATCH($B50,Luminaire_Types,0),3))","v":""},null,{"$f":"IF($B50=\"\",\"\",$G50*INDEX(Luminaire_Table,MATCH($B50,Luminaire_Types,0),3))","v":""},null,{"$f":"IF($B50=\"\",\"\",$I50*INDEX(Luminaire_Table,MATCH($B50,Luminaire_Types,0),3))","v":""},null,{"$f":"IF($B50=\"\",\"\",$K50*INDEX(Luminaire_Table,MATCH($B50,Luminaire_Types,0),3))","v":""},null,"Building type #5",{"$f":"IF(ISBLANK($K$13),\"\",$K$13)","v":""}]
[null,{"$f":"IF('Luminaire Schedule'!B40=\"\",\"\",'Luminaire Schedule'!B40)","v":""},null,{"$f":"IF($B51=\"\",\"\",$C51*INDEX(Luminaire_Table,MATCH($B51,Luminaire_Types,0),3))","v":""},null,{"$f":"IF($B51=\"\",\"\",$E51*INDEX(Luminaire_Table,MATCH($B51,Luminaire_Types,0),3))","v":""},null,{"$f":"IF($B51=\"\",\"\",$G51*INDEX(Luminaire_Table,MATCH($B51,Luminaire_Types,0),3))","v":""},null,{"$f":"IF($B51=\"\",\"\",$I51*INDEX(Luminaire_Table,MATCH($B51,Luminaire_Types,0),3))","v":""},null,{"$f":"IF($B51=\"\",\"\",$K51*INDEX(Luminaire_Table,MATCH($B51,Luminaire_Types,0),3))","v":""},null,"Annual operation hours",{"$f":"IF(ISBLANK(K13),\"\",IF(ProjectCode=NECB,INDEX(NECB_BuildingTable,MATCH($K13,NECB_BuildingTypes,0),4),IF(ProjectCode=ASHRAE,INDEX(ASHRAE_BuildingTable,MATCH($K13,ASHRAE_BuildingTypes,0),4),\"\")))","v":""},"hrs"]
[null,{"$f":"IF('Luminaire Schedule'!B41=\"\",\"\",'Luminaire Schedule'!B41)","v":""},null,{"$f":"IF($B52=\"\",\"\",$C52*INDEX(Luminaire_Table,MATCH($B52,Luminaire_Types,0),3))","v":""},null,{"$f":"IF($B52=\"\",\"\",$E52*INDEX(Luminaire_Table,MATCH($B52,Luminaire_Types,0),3))","v":""},null,{"$f":"IF($B52=\"\",\"\",$G52*INDEX(Luminaire_Table,MATCH($B52,Luminaire_Types,0),3))","v":""},null,{"$f":"IF($B52=\"\",\"\",$I52*INDEX(Luminaire_Table,MATCH($B52,Luminaire_Types,0),3))","v":""},null,{"$f":"IF($B52=\"\",\"\",$K52*INDEX(Luminaire_Table,MATCH($B52,Luminaire_Types,0),3))","v":""},null,"Baseline LPD",{"$f":"IF(ISBLANK(K13),\"\",IF(ProjectCode=NECB,INDEX(NECB_BuildingTable,MATCH($K13,NECB_BuildingTypes,0),3),IF(ProjectCode=ASHRAE,INDEX(ASHRAE_BuildingTable,MATCH($K13,ASHRAE_BuildingTypes,0),3),\"\")))","v":""},{"$f":"IF(ProjectUnits=\"Imperial\",\"W/sqft\",\"W/sqm\")","v":"W/sqm"}]
[null,{"$f":"IF('Luminaire Schedule'!B42=\"\",\"\",'Luminaire Schedule'!B42)","v":""},null,{"$f":"IF($B53=\"\",\"\",$C53*INDEX(Luminaire_Table,MATCH($B53,Luminaire_Types,0),3))","v":""},null,{"$f":"IF($B53=\"\",\"\",$E53*INDEX(Luminaire_Table,MATCH($B53,Luminaire_Types,0),3))","v":""},null,{"$f":"IF($B53=\"\",\"\",$G53*INDEX(Luminaire_Table,MATCH($B53,Luminaire_Types,0),3))","v":""},null,{"$f":"IF($B53=\"\",\"\",$I53*INDEX(Luminaire_Table,MATCH($B53,Luminaire_Types,0),3))","v":""},null,{"$f":"IF($B53=\"\",\"\",$K53*INDEX(Luminaire_Table,MATCH($B53,Luminaire_Types,0),3))","v":""},null,"Baseline demand",{"$f":"IF(ISBLANK(K13),\"\",ROUND(O52*K14/1000,2))","v":""},"kW"]
[null,{"$f":"IF('Luminaire Schedule'!B43=\"\",\"\",'Luminaire Schedule'!B43)","v":""},null,{"$f":"IF($B54=\"\",\"\",$C54*INDEX(Luminaire_Table,MATCH($B54,Luminaire_Types,0),3))","v":""},null,{"$f":"IF($B54=\"\",\"\",$E54*INDEX(Luminaire_Table,MATCH($B54,Luminaire_Types,0),3))","v":""},null,{"$f":"IF($B54=\"\",\"\",$G54*INDEX(Luminaire_Table,MATCH($B54,Luminaire_Types,0),3))","v":""},null,{"$f":"IF($B54=\"\",\"\",$I54*INDEX(Luminaire_Table,MATCH($B54,Luminaire_Types,0),3))","v":""},null,{"$f":"IF($B54=\"\",\"\",$K54*INDEX(Luminaire_Table,MATCH($B54,Luminaire_Types,0),3))","v":""},null,"Baseline lighting energy",{"$f":"IF(ISBLANK(K13),\"\",O53*O51)","v":""},"kWh"]
[null,{"$f":"IF('Luminaire Schedule'!B44=\"\",\"\",'Luminaire Schedule'!B44)","v":""},null,{"$f":"IF($B55=\"\",\"\",$C55*INDEX(Luminaire_Table,MATCH($B55,Luminaire_Types,0),3))","v":""},null,{"$f":"IF($B55=\"\",\"\",$E55*INDEX(Luminaire_Table,MATCH($B55,Luminaire_Types,0),3))","v":""},null,{"$f":"IF($B55=\"\",\"\",$G55*INDEX(Luminaire_Table,MATCH($B55,Luminaire_Types,0),3))","v":""},null,{"$f":"IF($B55=\"\",\"\",$I55*INDEX(Luminaire_Table,MATCH($B55,Luminaire_Types,0),3))","v":""},null,{"$f":"IF($B55=\"\",\"\",$K55*INDEX(Luminaire_Table,MATCH($B55,Luminaire_Types,0),3))","v":""},null,"Design LPD",{"$f":"IF(ISBLANK(K13),\"\",(O56*1000)/K14)","v":""},{"$f":"IF(ProjectUnits=\"Imperial\",\"W/sqft\",\"W/sqm\")","v":"W/sqm"}]
[null,{"$f":"IF('Luminaire Schedule'!B45=\"\",\"\",'Luminaire Schedule'!B45)","v":""},null,{"$f":"IF($B56=\"\",\"\",$C56*INDEX(Luminaire_Table,MATCH($B56,Luminaire_Types,0),3))","v":""},null,{"$f":"IF($B56=\"\",\"\",$E56*INDEX(Luminaire_Table,MATCH($B56,Luminaire_Types,0),3))","v":""},null,{"$f":"IF($B56=\"\",\"\",$G56*INDEX(Luminaire_Table,MATCH($B56,Luminaire_Types,0),3))","v":""},null,{"$f":"IF($B56=\"\",\"\",$I56*INDEX(Luminaire_Table,MATCH($B56,Luminaire_Types,0),3))","v":""},null,{"$f":"IF($B56=\"\",\"\",$K56*INDEX(Luminaire_Table,MATCH($B56,Luminaire_Types,0),3))","v":""},null,"Design demand",{"$f":"IF(ISBLANK(K13),\"\",ROUND(SUM($L$18:$L$168)/1000,2))","v":""},"kW"]
[null,{"$f":"IF('Luminaire Schedule'!B46=\"\",\"\",'Luminaire Schedule'!B46)","v":""},null,{"$f":"IF($B57=\"\",\"\",$C57*INDEX(Luminaire_Table,MATCH($B57,Luminaire_Types,0),3))","v":""},null,{"$f":"IF($B57=\"\",\"\",$E57*INDEX(Luminaire_Table,MATCH($B57,Luminaire_Types,0),3))","v":""},null,{"$f":"IF($B57=\"\",\"\",$G57*INDEX(Luminaire_Table,MATCH($B57,Luminaire_Types,0),3))","v":""},null,{"$f":"IF($B57=\"\",\"\",$I57*INDEX(Luminaire_Table,MATCH($B57,Luminaire_Types,0),3))","v":""},null,{"$f":"IF($B57=\"\",\"\",$K57*INDEX(Luminaire_Table,MATCH($B57,Luminaire_Types,0),3))","v":""},null,"Design lighting energy",{"$f":"IF(ISBLANK(K13),\"\",O56*O51)","v":""},"kWh"]
[null,{"$f":"IF('Luminaire Schedule'!B47=\"\",\"\",'Luminaire Schedule'!B47)","v":""},null,{"$f":"IF($B58=\"\",\"\",$C58*INDEX(Luminaire_Table,MATCH($B58,Luminaire_Types,0),3))","v":""},null,{"$f":"IF($B58=\"\",\"\",$E58*INDEX(Luminaire_Table,MATCH($B58,Luminaire_Types,0),3))","v":""},null,{"$f":"IF($B58=\"\",\"\",$G58*INDEX(Luminaire_Table,MATCH($B58,Luminaire_Types,0),3))","v":""},null,{"$f":"IF($B58=\"\",\"\",$I58*INDEX(Luminaire_Table,MATCH($B58,Luminaire_Types,0),3))","v":""},null,{"$f":"IF($B58=\"\",\"\",$K58*INDEX(Luminaire_Table,MATCH($B58,Luminaire_Types,0),3))","v":""}]
[null,{"$f":"IF('Luminaire Schedule'!B48=\"\",\"\",'Luminaire Schedule'!B48)","v":""},null,{"$f":"IF($B59=\"\",\"\",$C59*INDEX(Luminaire_Table,MATCH($B59,Luminaire_Types,0),3))","v":""},null,{"$f":"IF($B59=\"\",\"\",$E59*INDEX(Luminaire_Table,MATCH($B59,Luminaire_Types,0),3))","v":""},null,{"$f":"IF($B59=\"\",\"\",$G59*INDEX(Luminaire_Table,MATCH($B59,Luminaire_Types,0),3))","v":""},null,{"$f":"IF($B59=\"\",\"\",$I59*INDEX(Luminaire_Table,MATCH($B59,Luminaire_Types,0),3))","v":""},null,{"$f":"IF($B59=\"\",\"\",$K59*INDEX(Luminaire_Table,MATCH($B59,Luminaire_Types,0),3))","v":""},null,"Total baseline demand",{"$f":"SUM(O21,O29,O37,O45,O53)","v":0},"kW"]
[null,{"$f":"IF('Luminaire Schedule'!B49=\"\",\"\",'Luminaire Schedule'!B49)","v":""},null,{"$f":"IF($B60=\"\",\"\",$C60*INDEX(Luminaire_Table,MATCH($B60,Luminaire_Types,0),3))","v":""},null,{"$f":"IF($B60=\"\",\"\",$E60*INDEX(Luminaire_Table,MATCH($B60,Luminaire_Types,0),3))","v":""},null,{"$f":"IF($B60=\"\",\"\",$G60*INDEX(Luminaire_Table,MATCH($B60,Luminaire_Types,0),3))","v":""},null,{"$f":"IF($B60=\"\",\"\",$I60*INDEX(Luminaire_Table,MATCH($B60,Luminaire_Types,0),3))","v":""},null,{"$f":"IF($B60=\"\",\"\",$K60*INDEX(Luminaire_Table,MATCH($B60,Luminaire_Types,0),3))","v":""},null,"Total baseline energy",{"$f":"SUM(O22,O30,O38,O46,O54,)","v":0},"kWh"]
[null,{"$f":"IF('Luminaire Schedule'!B50=\"\",\"\",'Luminaire Schedule'!B50)","v":""},null,{"$f":"IF($B61=\"\",\"\",$C61*INDEX(Luminaire_Table,MATCH($B61,Luminaire_Types,0),3))","v":""},null,{"$f":"IF($B61=\"\",\"\",$E61*INDEX(Luminaire_Table,MATCH($B61,Luminaire_Types,0),3))","v":""},null,{"$f":"IF($B61=\"\",\"\",$G61*INDEX(Luminaire_Table,MATCH($B61,Luminaire_Types,0),3))","v":""},null,{"$f":"IF($B61=\"\",\"\",$I61*INDEX(Luminaire_Table,MATCH($B61,Luminaire_Types,0),3))","v":""},null,{"$f":"IF($B61=\"\",\"\",$K61*INDEX(Luminaire_Table,MATCH($B61,Luminaire_Types,0),3))","v":""},null,"Total design demand",{"$f":"SUM(O24,O32,O40,O48,O56)","v":0},"kW"]
[null,{"$f":"IF('Luminaire Schedule'!B51=\"\",\"\",'Luminaire Schedule'!B51)","v":""},null,{"$f":"IF($B62=\"\",\"\",$C62*INDEX(Luminaire_Table,MATCH($B62,Luminaire_Types,0),3))","v":""},null,{"$f":"IF($B62=\"\",\"\",$E62*INDEX(Luminaire_Table,MATCH($B62,Luminaire_Types,0),3))","v":""},null,{"$f":"IF($B62=\"\",\"\",$G62*INDEX(Luminaire_Table,MATCH($B62,Luminaire_Types,0),3))","v":""},null,{"$f":"IF($B62=\"\",\"\",$I62*INDEX(Luminaire_Table,MATCH($B62,Luminaire_Types,0),3))","v":""},null,{"$f":"IF($B62=\"\",\"\",$K62*INDEX(Luminaire_Table,MATCH($B62,Luminaire_Types,0),3))","v":""},null,"Total design energy",{"$f":"SUM(O25,O33,O41,O49,O57)","v":0},"kWh"]
[null,{"$f":"IF('Luminaire Schedule'!B52=\"\",\"\",'Luminaire Schedule'!B52)","v":""},null,{"$f":"IF($B63=\"\",\"\",$C63*INDEX(Luminaire_Table,MATCH($B63,Luminaire_Types,0),3))","v":""},null,{"$f":"IF($B63=\"\",\"\",$E63*INDEX(Luminaire_Table,MATCH($B63,Luminaire_Types,0),3))","v":""},null,{"$f":"IF($B63=\"\",\"\",$G63*INDEX(Luminaire_Table,MATCH($B63,Luminaire_Types,0),3))","v":""},null,{"$f":"IF($B63=\"\",\"\",$I63*INDEX(Luminaire_Table,MATCH($B63,Luminaire_Types,0),3))","v":""},null,{"$f":"IF($B63=\"\",\"\",$K63*INDEX(Luminaire_Table,MATCH($B63,Luminaire_Types,0),3))","v":""}]
[null,{"$f":"IF('Luminaire Schedule'!B53=\"\",\"\",'Luminaire Schedule'!B53)","v":""},null,{"$f":"IF($B64=\"\",\"\",$C64*INDEX(Luminaire_Table,MATCH($B64,Luminaire_Types,0),3))","v":""},null,{"$f":"IF($B64=\"\",\"\",$E64*INDEX(Luminaire_Table,MATCH($B64,Luminaire_Types,0),3))","v":""},null,{"$f":"IF($B64=\"\",\"\",$G64*INDEX(Luminaire_Table,MATCH($B64,Luminaire_Types,0),3))","v":""},null,{"$f":"IF($B64=\"\",\"\",$I64*INDEX(Luminaire_Table,MATCH($B64,Luminaire_Types,0),3))","v":""},null,{"$f":"IF($B64=\"\",\"\",$K64*INDEX(Luminaire_Table,MATCH($B64,Luminaire_Types,0),3))","v":""}]
[null,{"$f":"IF('Luminaire Schedule'!B54=\"\",\"\",'Luminaire Schedule'!B54)","v":""},null,{"$f":"IF($B65=\"\",\"\",$C65*INDEX(Luminaire_Table,MATCH($B65,Luminaire_Types,0),3))","v":""},null,{"$f":"IF($B65=\"\",\"\",$E65*INDEX(Luminaire_Table,MATCH($B65,Luminaire_Types,0),3))","v":""},null,{"$f":"IF($B65=\"\",\"\",$G65*INDEX(Luminaire_Table,MATCH($B65,Luminaire_Types,0),3))","v":""},null,{"$f":"IF($B65=\"\",\"\",$I65*INDEX(Luminaire_Table,MATCH($B65,Luminaire_Types,0),3))","v":""},null,{"$f":"IF($B65=\"\",\"\",$K65*INDEX(Luminaire_Table,MATCH($B65,Luminaire_Types,0),3))","v":""}]
[null,{"$f":"IF('Luminaire Schedule'!B55=\"\",\"\",'Luminaire Schedule'!B55)","v":""},null,{"$f":"IF($B66=\"\",\"\",$C66*INDEX(Luminaire_Table,MATCH($B66,Luminaire_Types,0),3))","v":""},null,{"$f":"IF($B66=\"\",\"\",$E66*INDEX(Luminaire_Table,MATCH($B66,Luminaire_Types,0),3))","v":""},null,{"$f":"IF($B66=\"\",\"\",$G66*INDEX(Luminaire_Table,MATCH($B66,Luminaire_Types,0),3))","v":""},null,{"$f":"IF($B66=\"\",\"\",$I66*INDEX(Luminaire_Table,MATCH($B66,Luminaire_Types,0),3))","v":""},null,{"$f":"IF($B66=\"\",\"\",$K66*INDEX(Luminaire_Table,MATCH($B66,Luminaire_Types,0),3))","v":""}]
[null,{"$f":"IF('Luminaire Schedule'!B56=\"\",\"\",'Luminaire Schedule'!B56)","v":""},null,{"$f":"IF($B67=\"\",\"\",$C67*INDEX(Luminaire_Table,MATCH($B67,Luminaire_Types,0),3))","v":""},null,{"$f":"IF($B67=\"\",\"\",$E67*INDEX(Luminaire_Table,MATCH($B67,Luminaire_Types,0),3))","v":""},null,{"$f":"IF($B67=\"\",\"\",$G67*INDEX(Luminaire_Table,MATCH($B67,Luminaire_Types,0),3))","v":""},null,{"$f":"IF($B67=\"\",\"\",$I67*INDEX(Luminaire_Table,MATCH($B67,Luminaire_Types,0),3))","v":""},null,{"$f":"IF($B67=\"\",\"\",$K67*INDEX(Luminaire_Table,MATCH($B67,Luminaire_Types,0),3))","v":""}]
[null,{"$f":"IF('Luminaire Schedule'!B57=\"\",\"\",'Luminaire Schedule'!B57)","v":""},null,{"$f":"IF($B68=\"\",\"\",$C68*INDEX(Luminaire_Table,MATCH($B68,Luminaire_Types,0),3))","v":""},null,{"$f":"IF($B68=\"\",\"\",$E68*INDEX(Luminaire_Table,MATCH($B68,Luminaire_Types,0),3))","v":""},null,{"$f":"IF($B68=\"\",\"\",$G68*INDEX(Luminaire_Table,MATCH($B68,Luminaire_Types,0),3))","v":""},null,{"$f":"IF($B68=\"\",\"\",$I68*INDEX(Luminaire_Table,MATCH($B68,Luminaire_Types,0),3))","v":""},null,{"$f":"IF($B68=\"\",\"\",$K68*INDEX(Luminaire_Table,MATCH($B68,Luminaire_Types,0),3))","v":""}]
[null,{"$f":"IF('Luminaire Schedule'!B58=\"\",\"\",'Luminaire Schedule'!B58)","v":""},null,{"$f":"IF($B69=\"\",\"\",$C69*INDEX(Luminaire_Table,MATCH($B69,Luminaire_Types,0),3))","v":""},null,{"$f":"IF($B69=\"\",\"\",$E69*INDEX(Luminaire_Table,MATCH($B69,Luminaire_Types,0),3))","v":""},null,{"$f":"IF($B69=\"\",\"\",$G69*INDEX(Luminaire_Table,MATCH($B69,Luminaire_Types,0),3))","v":""},null,{"$f":"IF($B69=\"\",\"\",$I69*INDEX(Luminaire_Table,MATCH($B69,Luminaire_Types,0),3))","v":""},null,{"$f":"IF($B69=\"\",\"\",$K69*INDEX(Luminaire_Table,MATCH($B69,Luminaire_Types,0),3))","v":""}]
[null,{"$f":"IF('Luminaire Schedule'!B59=\"\",\"\",'Luminaire Schedule'!B59)","v":""},null,{"$f":"IF($B70=\"\",\"\",$C70*INDEX(Luminaire_Table,MATCH($B70,Luminaire_Types,0),3))","v":""},null,{"$f":"IF($B70=\"\",\"\",$E70*INDEX(Luminaire_Table,MATCH($B70,Luminaire_Types,0),3))","v":""},null,{"$f":"IF($B70=\"\",\"\",$G70*INDEX(Luminaire_Table,MATCH($B70,Luminaire_Types,0),3))","v":""},null,{"$f":"IF($B70=\"\",\"\",$I70*INDEX(Luminaire_Table,MATCH($B70,Luminaire_Types,0),3))","v":""},null,{"$f":"IF($B70=\"\",\"\",$K70*INDEX(Luminaire_Table,MATCH($B70,Luminaire_Types,0),3))","v":""}]
[null,{"$f":"IF('Luminaire Schedule'!B60=\"\",\"\",'Luminaire Schedule'!B60)","v":""},null,{"$f":"IF($B71=\"\",\"\",$C71*INDEX(Luminaire_Table,MATCH($B71,Luminaire_Types,0),3))","v":""},null,{"$f":"IF($B71=\"\",\"\",$E71*INDEX(Luminaire_Table,MATCH($B71,Luminaire_Types,0),3))","v":""},null,{"$f":"IF($B71=\"\",\"\",$G71*INDEX(Luminaire_Table,MATCH($B71,Luminaire_Types,0),3))","v":""},null,{"$f":"IF($B71=\"\",\"\",$I71*INDEX(Luminaire_Table,MATCH($B71,Luminaire_Types,0),3))","v":""},null,{"$f":"IF($B71=\"\",\"\",$K71*INDEX(Luminaire_Table,MATCH($B71,Luminaire_Types,0),3))","v":""}]
[null,{"$f":"IF('Luminaire Schedule'!B61=\"\",\"\",'Luminaire Schedule'!B61)","v":""},null,{"$f":"IF($B72=\"\",\"\",$C72*INDEX(Luminaire_Table,MATCH($B72,Luminaire_Types,0),3))","v":""},null,{"$f":"IF($B72=\"\",\"\",$E72*INDEX(Luminaire_Table,MATCH($B72,Luminaire_Types,0),3))","v":""},null,{"$f":"IF($B72=\"\",\"\",$G72*INDEX(Luminaire_Table,MATCH($B72,Luminaire_Types,0),3))","v":""},null,{"$f":"IF($B72=\"\",\"\",$I72*INDEX(Luminaire_Table,MATCH($B72,Luminaire_Types,0),3))","v":""},null,{"$f":"IF($B72=\"\",\"\",$K72*INDEX(Luminaire_Table,MATCH($B72,Luminaire_Types,0),3))","v":""}]
[null,{"$f":"IF('Luminaire Schedule'!B62=\"\",\"\",'Luminaire Schedule'!B62)","v":""},null,{"$f":"IF($B73=\"\",\"\",$C73*INDEX(Luminaire_Table,MATCH($B73,Luminaire_Types,0),3))","v":""},null,{"$f":"IF($B73=\"\",\"\",$E73*INDEX(Luminaire_Table,MATCH($B73,Luminaire_Types,0),3))","v":""},null,{"$f":"IF($B73=\"\",\"\",$G73*INDEX(Luminaire_Table,MATCH($B73,Luminaire_Types,0),3))","v":""},null,{"$f":"IF($B73=\"\",\"\",$I73*INDEX(Luminaire_Table,MATCH($B73,Luminaire_Types,0),3))","v":""},null,{"$f":"IF($B73=\"\",\"\",$K73*INDEX(Luminaire_Table,MATCH($B73,Luminaire_Types,0),3))","v":""}]
[null,{"$f":"IF('Luminaire Schedule'!B63=\"\",\"\",'Luminaire Schedule'!B63)","v":""},null,{"$f":"IF($B74=\"\",\"\",$C74*INDEX(Luminaire_Table,MATCH($B74,Luminaire_Types,0),3))","v":""},null,{"$f":"IF($B74=\"\",\"\",$E74*INDEX(Luminaire_Table,MATCH($B74,Luminaire_Types,0),3))","v":""},null,{"$f":"IF($B74=\"\",\"\",$G74*INDEX(Luminaire_Table,MATCH($B74,Luminaire_Types,0),3))","v":""},null,{"$f":"IF($B74=\"\",\"\",$I74*INDEX(Luminaire_Table,MATCH($B74,Luminaire_Types,0),3))","v":""},null,{"$f":"IF($B74=\"\",\"\",$K74*INDEX(Luminaire_Table,MATCH($B74,Luminaire_Types,0),3))","v":""}]
[null,{"$f":"IF('Luminaire Schedule'!B64=\"\",\"\",'Luminaire Schedule'!B64)","v":""},null,{"$f":"IF($B75=\"\",\"\",$C75*INDEX(Luminaire_Table,MATCH($B75,Luminaire_Types,0),3))","v":""},null,{"$f":"IF($B75=\"\",\"\",$E75*INDEX(Luminaire_Table,MATCH($B75,Luminaire_Types,0),3))","v":""},null,{"$f":"IF($B75=\"\",\"\",$G75*INDEX(Luminaire_Table,MATCH($B75,Luminaire_Types,0),3))","v":""},null,{"$f":"IF($B75=\"\",\"\",$I75*INDEX(Luminaire_Table,MATCH($B75,Luminaire_Types,0),3))","v":""},null,{"$f":"IF($B75=\"\",\"\",$K75*INDEX(Luminaire_Table,MATCH($B75,Luminaire_Types,0),3))","v":""}]
[null,{"$f":"IF('Luminaire Schedule'!B65=\"\",\"\",'Luminaire Schedule'!B65)","v":""},null,{"$f":"IF($B76=\"\",\"\",$C76*INDEX(Luminaire_Table,MATCH($B76,Luminaire_Types,0),3))","v":""},null,{"$f":"IF($B76=\"\",\"\",$E76*INDEX(Luminaire_Table,MATCH($B76,Luminaire_Types,0),3))","v":""},null,{"$f":"IF($B76=\"\",\"\",$G76*INDEX(Luminaire_Table,MATCH($B76,Luminaire_Types,0),3))","v":""},null,{"$f":"IF($B76=\"\",\"\",$I76*INDEX(Luminaire_Table,MATCH($B76,Luminaire_Types,0),3))","v":""},null,{"$f":"IF($B76=\"\",\"\",$K76*INDEX(Luminaire_Table,MATCH($B76,Luminaire_Types,0),3))","v":""}]
[null,{"$f":"IF('Luminaire Schedule'!B66=\"\",\"\",'Luminaire Schedule'!B66)","v":""},null,{"$f":"IF($B77=\"\",\"\",$C77*INDEX(Luminaire_Table,MATCH($B77,Luminaire_Types,0),3))","v":""},null,{"$f":"IF($B77=\"\",\"\",$E77*INDEX(Luminaire_Table,MATCH($B77,Luminaire_Types,0),3))","v":""},null,{"$f":"IF($B77=\"\",\"\",$G77*INDEX(Luminaire_Table,MATCH($B77,Luminaire_Types,0),3))","v":""},null,{"$f":"IF($B77=\"\",\"\",$I77*INDEX(Luminaire_Table,MATCH($B77,Luminaire_Types,0),3))","v":""},null,{"$f":"IF($B77=\"\",\"\",$K77*INDEX(Luminaire_Table,MATCH($B77,Luminaire_Types,0),3))","v":""}]
[null,{"$f":"IF('Luminaire Schedule'!B67=\"\",\"\",'Luminaire Schedule'!B67)","v":""},null,{"$f":"IF($B78=\"\",\"\",$C78*INDEX(Luminaire_Table,MATCH($B78,Luminaire_Types,0),3))","v":""},null,{"$f":"IF($B78=\"\",\"\",$E78*INDEX(Luminaire_Table,MATCH($B78,Luminaire_Types,0),3))","v":""},null,{"$f":"IF($B78=\"\",\"\",$G78*INDEX(Luminaire_Table,MATCH($B78,Luminaire_Types,0),3))","v":""},null,{"$f":"IF($B78=\"\",\"\",$I78*INDEX(Luminaire_Table,MATCH($B78,Luminaire_Types,0),3))","v":""},null,{"$f":"IF($B78=\"\",\"\",$K78*INDEX(Luminaire_Table,MATCH($B78,Luminaire_Types,0),3))","v":""}]
[null,{"$f":"IF('Luminaire Schedule'!B68=\"\",\"\",'Luminaire Schedule'!B68)","v":""},null,{"$f":"IF($B79=\"\",\"\",$C79*INDEX(Luminaire_Table,MATCH($B79,Luminaire_Types,0),3))","v":""},null,{"$f":"IF($B79=\"\",\"\",$E79*INDEX(Luminaire_Table,MATCH($B79,Luminaire_Types,0),3))","v":""},null,{"$f":"IF($B79=\"\",\"\",$G79*INDEX(Luminaire_Table,MATCH($B79,Luminaire_Types,0),3))","v":""},null,{"$f":"IF($B79=\"\",\"\",$I79*INDEX(Luminaire_Table,MATCH($B79,Luminaire_Types,0),3))","v":""},null,{"$f":"IF($B79=\"\",\"\",$K79*INDEX(Luminaire_Table,MATCH($B79,Luminaire_Types,0),3))","v":""}]
[null,{"$f":"IF('Luminaire Schedule'!B69=\"\",\"\",'Luminaire Schedule'!B69)","v":""},null,{"$f":"IF($B80=\"\",\"\",$C80*INDEX(Luminaire_Table,MATCH($B80,Luminaire_Types,0),3))","v":""},null,{"$f":"IF($B80=\"\",\"\",$E80*INDEX(Luminaire_Table,MATCH($B80,Luminaire_Types,0),3))","v":""},null,{"$f":"IF($B80=\"\",\"\",$G80*INDEX(Luminaire_Table,MATCH($B80,Luminaire_Types,0),3))","v":""},null,{"$f":"IF($B80=\"\",\"\",$I80*INDEX(Luminaire_Table,MATCH($B80,Luminaire_Types,0),3))","v":""},null,{"$f":"IF($B80=\"\",\"\",$K80*INDEX(Luminaire_Table,MATCH($B80,Luminaire_Types,0),3))","v":""}]
[null,{"$f":"IF('Luminaire Schedule'!B70=\"\",\"\",'Luminaire Schedule'!B70)","v":""},null,{"$f":"IF($B81=\"\",\"\",$C81*INDEX(Luminaire_Table,MATCH($B81,Luminaire_Types,0),3))","v":""},null,{"$f":"IF($B81=\"\",\"\",$E81*INDEX(Luminaire_Table,MATCH($B81,Luminaire_Types,0),3))","v":""},null,{"$f":"IF($B81=\"\",\"\",$G81*INDEX(Luminaire_Table,MATCH($B81,Luminaire_Types,0),3))","v":""},null,{"$f":"IF($B81=\"\",\"\",$I81*INDEX(Luminaire_Table,MATCH($B81,Luminaire_Types,0),3))","v":""},null,{"$f":"IF($B81=\"\",\"\",$K81*INDEX(Luminaire_Table,MATCH($B81,Luminaire_Types,0),3))","v":""}]
[null,{"$f":"IF('Luminaire Schedule'!B71=\"\",\"\",'Luminaire Schedule'!B71)","v":""},null,{"$f":"IF($B82=\"\",\"\",$C82*INDEX(Luminaire_Table,MATCH($B82,Luminaire_Types,0),3))","v":""},null,{"$f":"IF($B82=\"\",\"\",$E82*INDEX(Luminaire_Table,MATCH($B82,Luminaire_Types,0),3))","v":""},null,{"$f":"IF($B82=\"\",\"\",$G82*INDEX(Luminaire_Table,MATCH($B82,Luminaire_Types,0),3))","v":""},null,{"$f":"IF($B82=\"\",\"\",$I82*INDEX(Luminaire_Table,MATCH($B82,Luminaire_Types,0),3))","v":""},null,{"$f":"IF($B82=\"\",\"\",$K82*INDEX(Luminaire_Table,MATCH($B82,Luminaire_Types,0),3))","v":""}]
[null,{"$f":"IF('Luminaire Schedule'!B72=\"\",\"\",'Luminaire Schedule'!B72)","v":""},null,{"$f":"IF($B83=\"\",\"\",$C83*INDEX(Luminaire_Table,MATCH($B83,Luminaire_Types,0),3))","v":""},null,{"$f":"IF($B83=\"\",\"\",$E83*INDEX(Luminaire_Table,MATCH($B83,Luminaire_Types,0),3))","v":""},null,{"$f":"IF($B83=\"\",\"\",$G83*INDEX(Luminaire_Table,MATCH($B83,Luminaire_Types,0),3))","v":""},null,{"$f":"IF($B83=\"\",\"\",$I83*INDEX(Luminaire_Table,MATCH($B83,Luminaire_Types,0),3))","v":""},null,{"$f":"IF($B83=\"\",\"\",$K83*INDEX(Luminaire_Table,MATCH($B83,Luminaire_Types,0),3))","v":""}]
[null,{"$f":"IF('Luminaire Schedule'!B73=\"\",\"\",'Luminaire Schedule'!B73)","v":""},null,{"$f":"IF($B84=\"\",\"\",$C84*INDEX(Luminaire_Table,MATCH($B84,Luminaire_Types,0),3))","v":""},null,{"$f":"IF($B84=\"\",\"\",$E84*INDEX(Luminaire_Table,MATCH($B84,Luminaire_Types,0),3))","v":""},null,{"$f":"IF($B84=\"\",\"\",$G84*INDEX(Luminaire_Table,MATCH($B84,Luminaire_Types,0),3))","v":""},null,{"$f":"IF($B84=\"\",\"\",$I84*INDEX(Luminaire_Table,MATCH($B84,Luminaire_Types,0),3))","v":""},null,{"$f":"IF($B84=\"\",\"\",$K84*INDEX(Luminaire_Table,MATCH($B84,Luminaire_Types,0),3))","v":""}]
[null,{"$f":"IF('Luminaire Schedule'!B74=\"\",\"\",'Luminaire Schedule'!B74)","v":""},null,{"$f":"IF($B85=\"\",\"\",$C85*INDEX(Luminaire_Table,MATCH($B85,Luminaire_Types,0),3))","v":""},null,{"$f":"IF($B85=\"\",\"\",$E85*INDEX(Luminaire_Table,MATCH($B85,Luminaire_Types,0),3))","v":""},null,{"$f":"IF($B85=\"\",\"\",$G85*INDEX(Luminaire_Table,MATCH($B85,Luminaire_Types,0),3))","v":""},null,{"$f":"IF($B85=\"\",\"\",$I85*INDEX(Luminaire_Table,MATCH($B85,Luminaire_Types,0),3))","v":""},null,{"$f":"IF($B85=\"\",\"\",$K85*INDEX(Luminaire_Table,MATCH($B85,Luminaire_Types,0),3))","v":""}]
[null,{"$f":"IF('Luminaire Schedule'!B75=\"\",\"\",'Luminaire Schedule'!B75)","v":""},null,{"$f":"IF($B86=\"\",\"\",$C86*INDEX(Luminaire_Table,MATCH($B86,Luminaire_Types,0),3))","v":""},null,{"$f":"IF($B86=\"\",\"\",$E86*INDEX(Luminaire_Table,MATCH($B86,Luminaire_Types,0),3))","v":""},null,{"$f":"IF($B86=\"\",\"\",$G86*INDEX(Luminaire_Table,MATCH($B86,Luminaire_Types,0),3))","v":""},null,{"$f":"IF($B86=\"\",\"\",$I86*INDEX(Luminaire_Table,MATCH($B86,Luminaire_Types,0),3))","v":""},null,{"$f":"IF($B86=\"\",\"\",$K86*INDEX(Luminaire_Table,MATCH($B86,Luminaire_Types,0),3))","v":""}]
[null,{"$f":"IF('Luminaire Schedule'!B76=\"\",\"\",'Luminaire Schedule'!B76)","v":""},null,{"$f":"IF($B87=\"\",\"\",$C87*INDEX(Luminaire_Table,MATCH($B87,Luminaire_Types,0),3))","v":""},null,{"$f":"IF($B87=\"\",\"\",$E87*INDEX(Luminaire_Table,MATCH($B87,Luminaire_Types,0),3))","v":""},null,{"$f":"IF($B87=\"\",\"\",$G87*INDEX(Luminaire_Table,MATCH($B87,Luminaire_Types,0),3))","v":""},null,{"$f":"IF($B87=\"\",\"\",$I87*INDEX(Luminaire_Table,MATCH($B87,Luminaire_Types,0),3))","v":""},null,{"$f":"IF($B87=\"\",\"\",$K87*INDEX(Luminaire_Table,MATCH($B87,Luminaire_Types,0),3))","v":""}]
[null,{"$f":"IF('Luminaire Schedule'!B77=\"\",\"\",'Luminaire Schedule'!B77)","v":""},null,{"$f":"IF($B88=\"\",\"\",$C88*INDEX(Luminaire_Table,MATCH($B88,Luminaire_Types,0),3))","v":""},null,{"$f":"IF($B88=\"\",\"\",$E88*INDEX(Luminaire_Table,MATCH($B88,Luminaire_Types,0),3))","v":""},null,{"$f":"IF($B88=\"\",\"\",$G88*INDEX(Luminaire_Table,MATCH($B88,Luminaire_Types,0),3))","v":""},null,{"$f":"IF($B88=\"\",\"\",$I88*INDEX(Luminaire_Table,MATCH($B88,Luminaire_Types,0),3))","v":""},null,{"$f":"IF($B88=\"\",\"\",$K88*INDEX(Luminaire_Table,MATCH($B88,Luminaire_Types,0),3))","v":""}]
[null,{"$f":"IF('Luminaire Schedule'!B78=\"\",\"\",'Luminaire Schedule'!B78)","v":""},null,{"$f":"IF($B89=\"\",\"\",$C89*INDEX(Luminaire_Table,MATCH($B89,Luminaire_Types,0),3))","v":""},null,{"$f":"IF($B89=\"\",\"\",$E89*INDEX(Luminaire_Table,MATCH($B89,Luminaire_Types,0),3))","v":""},null,{"$f":"IF($B89=\"\",\"\",$G89*INDEX(Luminaire_Table,MATCH($B89,Luminaire_Types,0),3))","v":""},null,{"$f":"IF($B89=\"\",\"\",$I89*INDEX(Luminaire_Table,MATCH($B89,Luminaire_Types,0),3))","v":""},null,{"$f":"IF($B89=\"\",\"\",$K89*INDEX(Luminaire_Table,MATCH($B89,Luminaire_Types,0),3))","v":""}]
[null,{"$f":"IF('Luminaire Schedule'!B79=\"\",\"\",'Luminaire Schedule'!B79)","v":""},null,{"$f":"IF($B90=\"\",\"\",$C90*INDEX(Luminaire_Table,MATCH($B90,Luminaire_Types,0),3))","v":""},null,{"$f":"IF($B90=\"\",\"\",$E90*INDEX(Luminaire_Table,MATCH($B90,Luminaire_Types,0),3))","v":""},null,{"$f":"IF($B90=\"\",\"\",$G90*INDEX(Luminaire_Table,MATCH($B90,Luminaire_Types,0),3))","v":""},null,{"$f":"IF($B90=\"\",\"\",$I90*INDEX(Luminaire_Table,MATCH($B90,Luminaire_Types,0),3))","v":""},null,{"$f":"IF($B90=\"\",\"\",$K90*INDEX(Luminaire_Table,MATCH($B90,Luminaire_Types,0),3))","v":""}]
[null,{"$f":"IF('Luminaire Schedule'!B80=\"\",\"\",'Luminaire Schedule'!B80)","v":""},null,{"$f":"IF($B91=\"\",\"\",$C91*INDEX(Luminaire_Table,MATCH($B91,Luminaire_Types,0),3))","v":""},null,{"$f":"IF($B91=\"\",\"\",$E91*INDEX(Luminaire_Table,MATCH($B91,Luminaire_Types,0),3))","v":""},null,{"$f":"IF($B91=\"\",\"\",$G91*INDEX(Luminaire_Table,MATCH($B91,Luminaire_Types,0),3))","v":""},null,{"$f":"IF($B91=\"\",\"\",$I91*INDEX(Luminaire_Table,MATCH($B91,Luminaire_Types,0),3))","v":""},null,{"$f":"IF($B91=\"\",\"\",$K91*INDEX(Luminaire_Table,MATCH($B91,Luminaire_Types,0),3))","v":""}]
[null,{"$f":"IF('Luminaire Schedule'!B81=\"\",\"\",'Luminaire Schedule'!B81)","v":""},null,{"$f":"IF($B92=\"\",\"\",$C92*INDEX(Luminaire_Table,MATCH($B92,Luminaire_Types,0),3))","v":""},null,{"$f":"IF($B92=\"\",\"\",$E92*INDEX(Luminaire_Table,MATCH($B92,Luminaire_Types,0),3))","v":""},null,{"$f":"IF($B92=\"\",\"\",$G92*INDEX(Luminaire_Table,MATCH($B92,Luminaire_Types,0),3))","v":""},null,{"$f":"IF($B92=\"\",\"\",$I92*INDEX(Luminaire_Table,MATCH($B92,Luminaire_Types,0),3))","v":""},null,{"$f":"IF($B92=\"\",\"\",$K92*INDEX(Luminaire_Table,MATCH($B92,Luminaire_Types,0),3))","v":""}]
[null,{"$f":"IF('Luminaire Schedule'!B82=\"\",\"\",'Luminaire Schedule'!B82)","v":""},null,{"$f":"IF($B93=\"\",\"\",$C93*INDEX(Luminaire_Table,MATCH($B93,Luminaire_Types,0),3))","v":""},null,{"$f":"IF($B93=\"\",\"\",$E93*INDEX(Luminaire_Table,MATCH($B93,Luminaire_Types,0),3))","v":""},null,{"$f":"IF($B93=\"\",\"\",$G93*INDEX(Luminaire_Table,MATCH($B93,Luminaire_Types,0),3))","v":""},null,{"$f":"IF($B93=\"\",\"\",$I93*INDEX(Luminaire_Table,MATCH($B93,Luminaire_Types,0),3))","v":""},null,{"$f":"IF($B93=\"\",\"\",$K93*INDEX(Luminaire_Table,MATCH($B93,Luminaire_Types,0),3))","v":""}]
[null,{"$f":"IF('Luminaire Schedule'!B83=\"\",\"\",'Luminaire Schedule'!B83)","v":""},null,{"$f":"IF($B94=\"\",\"\",$C94*INDEX(Luminaire_Table,MATCH($B94,Luminaire_Types,0),3))","v":""},null,{"$f":"IF($B94=\"\",\"\",$E94*INDEX(Luminaire_Table,MATCH($B94,Luminaire_Types,0),3))","v":""},null,{"$f":"IF($B94=\"\",\"\",$G94*INDEX(Luminaire_Table,MATCH($B94,Luminaire_Types,0),3))","v":""},null,{"$f":"IF($B94=\"\",\"\",$I94*INDEX(Luminaire_Table,MATCH($B94,Luminaire_Types,0),3))","v":""},null,{"$f":"IF($B94=\"\",\"\",$K94*INDEX(Luminaire_Table,MATCH($B94,Luminaire_Types,0),3))","v":""}]
[null,{"$f":"IF('Luminaire Schedule'!B84=\"\",\"\",'Luminaire Schedule'!B84)","v":""},null,{"$f":"IF($B95=\"\",\"\",$C95*INDEX(Luminaire_Table,MATCH($B95,Luminaire_Types,0),3))","v":""},null,{"$f":"IF($B95=\"\",\"\",$E95*INDEX(Luminaire_Table,MATCH($B95,Luminaire_Types,0),3))","v":""},null,{"$f":"IF($B95=\"\",\"\",$G95*INDEX(Luminaire_Table,MATCH($B95,Luminaire_Types,0),3))","v":""},null,{"$f":"IF($B95=\"\",\"\",$I95*INDEX(Luminaire_Table,MATCH($B95,Luminaire_Types,0),3))","v":""},null,{"$f":"IF($B95=\"\",\"\",$K95*INDEX(Luminaire_Table,MATCH($B95,Luminaire_Types,0),3))","v":""}]
[null,{"$f":"IF('Luminaire Schedule'!B85=\"\",\"\",'Luminaire Schedule'!B85)","v":""},null,{"$f":"IF($B96=\"\",\"\",$C96*INDEX(Luminaire_Table,MATCH($B96,Luminaire_Types,0),3))","v":""},null,{"$f":"IF($B96=\"\",\"\",$E96*INDEX(Luminaire_Table,MATCH($B96,Luminaire_Types,0),3))","v":""},null,{"$f":"IF($B96=\"\",\"\",$G96*INDEX(Luminaire_Table,MATCH($B96,Luminaire_Types,0),3))","v":""},null,{"$f":"IF($B96=\"\",\"\",$I96*INDEX(Luminaire_Table,MATCH($B96,Luminaire_Types,0),3))","v":""},null,{"$f":"IF($B96=\"\",\"\",$K96*INDEX(Luminaire_Table,MATCH($B96,Luminaire_Types,0),3))","v":""}]
[null,{"$f":"IF('Luminaire Schedule'!B86=\"\",\"\",'Luminaire Schedule'!B86)","v":""},null,{"$f":"IF($B97=\"\",\"\",$C97*INDEX(Luminaire_Table,MATCH($B97,Luminaire_Types,0),3))","v":""},null,{"$f":"IF($B97=\"\",\"\",$E97*INDEX(Luminaire_Table,MATCH($B97,Luminaire_Types,0),3))","v":""},null,{"$f":"IF($B97=\"\",\"\",$G97*INDEX(Luminaire_Table,MATCH($B97,Luminaire_Types,0),3))","v":""},null,{"$f":"IF($B97=\"\",\"\",$I97*INDEX(Luminaire_Table,MATCH($B97,Luminaire_Types,0),3))","v":""},null,{"$f":"IF($B97=\"\",\"\",$K97*INDEX(Luminaire_Table,MATCH($B97,Luminaire_Types,0),3))","v":""}]
[null,{"$f":"IF('Luminaire Schedule'!B87=\"\",\"\",'Luminaire Schedule'!B87)","v":""},null,{"$f":"IF($B98=\"\",\"\",$C98*INDEX(Luminaire_Table,MATCH($B98,Luminaire_Types,0),3))","v":""},null,{"$f":"IF($B98=\"\",\"\",$E98*INDEX(Luminaire_Table,MATCH($B98,Luminaire_Types,0),3))","v":""},null,{"$f":"IF($B98=\"\",\"\",$G98*INDEX(Luminaire_Table,MATCH($B98,Luminaire_Types,0),3))","v":""},null,{"$f":"IF($B98=\"\",\"\",$I98*INDEX(Luminaire_Table,MATCH($B98,Luminaire_Types,0),3))","v":""},null,{"$f":"IF($B98=\"\",\"\",$K98*INDEX(Luminaire_Table,MATCH($B98,Luminaire_Types,0),3))","v":""}]
[null,{"$f":"IF('Luminaire Schedule'!B88=\"\",\"\",'Luminaire Schedule'!B88)","v":""},null,{"$f":"IF($B99=\"\",\"\",$C99*INDEX(Luminaire_Table,MATCH($B99,Luminaire_Types,0),3))","v":""},null,{"$f":"IF($B99=\"\",\"\",$E99*INDEX(Luminaire_Table,MATCH($B99,Luminaire_Types,0),3))","v":""},null,{"$f":"IF($B99=\"\",\"\",$G99*INDEX(Luminaire_Table,MATCH($B99,Luminaire_Types,0),3))","v":""},null,{"$f":"IF($B99=\"\",\"\",$I99*INDEX(Luminaire_Table,MATCH($B99,Luminaire_Types,0),3))","v":""},null,{"$f":"IF($B99=\"\",\"\",$K99*INDEX(Luminaire_Table,MATCH($B99,Luminaire_Types,0),3))","v":""}]
[null,{"$f":"IF('Luminaire Schedule'!B89=\"\",\"\",'Luminaire Schedule'!B89)","v":""},null,{"$f":"IF($B100=\"\",\"\",$C100*INDEX(Luminaire_Table,MATCH($B100,Luminaire_Types,0),3))","v":""},null,{"$f":"IF($B100=\"\",\"\",$E100*INDEX(Luminaire_Table,MATCH($B100,Luminaire_Types,0),3))","v":""},null,{"$f":"IF($B100=\"\",\"\",$G100*INDEX(Luminaire_Table,MATCH($B100,Luminaire_Types,0),3))","v":""},null,{"$f":"IF($B100=\"\",\"\",$I100*INDEX(Luminaire_Table,MATCH($B100,Luminaire_Types,0),3))","v":""},null,{"$f":"IF($B100=\"\",\"\",$K100*INDEX(Luminaire_Table,MATCH($B100,Luminaire_Types,0),3))","v":""}]
[null,{"$f":"IF('Luminaire Schedule'!B90=\"\",\"\",'Luminaire Schedule'!B90)","v":""},null,{"$f":"IF($B101=\"\",\"\",$C101*INDEX(Luminaire_Table,MATCH($B101,Luminaire_Types,0),3))","v":""},null,{"$f":"IF($B101=\"\",\"\",$E101*INDEX(Luminaire_Table,MATCH($B101,Luminaire_Types,0),3))","v":""},null,{"$f":"IF($B101=\"\",\"\",$G101*INDEX(Luminaire_Table,MATCH($B101,Luminaire_Types,0),3))","v":""},null,{"$f":"IF($B101=\"\",\"\",$I101*INDEX(Luminaire_Table,MATCH($B101,Luminaire_Types,0),3))","v":""},null,{"$f":"IF($B101=\"\",\"\",$K101*INDEX(Luminaire_Table,MATCH($B101,Luminaire_Types,0),3))","v":""}]
[null,{"$f":"IF('Luminaire Schedule'!B91=\"\",\"\",'Luminaire Schedule'!B91)","v":""},null,{"$f":"IF($B102=\"\",\"\",$C102*INDEX(Luminaire_Table,MATCH($B102,Luminaire_Types,0),3))","v":""},null,{"$f":"IF($B102=\"\",\"\",$E102*INDEX(Luminaire_Table,MATCH($B102,Luminaire_Types,0),3))","v":""},null,{"$f":"IF($B102=\"\",\"\",$G102*INDEX(Luminaire_Table,MATCH($B102,Luminaire_Types,0),3))","v":""},null,{"$f":"IF($B102=\"\",\"\",$I102*INDEX(Luminaire_Table,MATCH($B102,Luminaire_Types,0),3))","v":""},null,{"$f":"IF($B102=\"\",\"\",$K102*INDEX(Luminaire_Table,MATCH($B102,Luminaire_Types,0),3))","v":""}]
[null,{"$f":"IF('Luminaire Schedule'!B92=\"\",\"\",'Luminaire Schedule'!B92)","v":""},null,{"$f":"IF($B103=\"\",\"\",$C103*INDEX(Luminaire_Table,MATCH($B103,Luminaire_Types,0),3))","v":""},null,{"$f":"IF($B103=\"\",\"\",$E103*INDEX(Luminaire_Table,MATCH($B103,Luminaire_Types,0),3))","v":""},null,{"$f":"IF($B103=\"\",\"\",$G103*INDEX(Luminaire_Table,MATCH($B103,Luminaire_Types,0),3))","v":""},null,{"$f":"IF($B103=\"\",\"\",$I103*INDEX(Luminaire_Table,MATCH($B103,Luminaire_Types,0),3))","v":""},null,{"$f":"IF($B103=\"\",\"\",$K103*INDEX(Luminaire_Table,MATCH($B103,Luminaire_Types,0),3))","v":""}]
[null,{"$f":"IF('Luminaire Schedule'!B93=\"\",\"\",'Luminaire Schedule'!B93)","v":""},null,{"$f":"IF($B104=\"\",\"\",$C104*INDEX(Luminaire_Table,MATCH($B104,Luminaire_Types,0),3))","v":""},null,{"$f":"IF($B104=\"\",\"\",$E104*INDEX(Luminaire_Table,MATCH($B104,Luminaire_Types,0),3))","v":""},null,{"$f":"IF($B104=\"\",\"\",$G104*INDEX(Luminaire_Table,MATCH($B104,Luminaire_Types,0),3))","v":""},null,{"$f":"IF($B104=\"\",\"\",$I104*INDEX(Luminaire_Table,MATCH($B104,Luminaire_Types,0),3))","v":""},null,{"$f":"IF($B104=\"\",\"\",$K104*INDEX(Luminaire_Table,MATCH($B104,Luminaire_Types,0),3))","v":""}]
[null,{"$f":"IF('Luminaire Schedule'!B94=\"\",\"\",'Luminaire Schedule'!B94)","v":""},null,{"$f":"IF($B105=\"\",\"\",$C105*INDEX(Luminaire_Table,MATCH($B105,Luminaire_Types,0),3))","v":""},null,{"$f":"IF($B105=\"\",\"\",$E105*INDEX(Luminaire_Table,MATCH($B105,Luminaire_Types,0),3))","v":""},null,{"$f":"IF($B105=\"\",\"\",$G105*INDEX(Luminaire_Table,MATCH($B105,Luminaire_Types,0),3))","v":""},null,{"$f":"IF($B105=\"\",\"\",$I105*INDEX(Luminaire_Table,MATCH($B105,Luminaire_Types,0),3))","v":""},null,{"$f":"IF($B105=\"\",\"\",$K105*INDEX(Luminaire_Table,MATCH($B105,Luminaire_Types,0),3))","v":""}]
[null,{"$f":"IF('Luminaire Schedule'!B95=\"\",\"\",'Luminaire Schedule'!B95)","v":""},null,{"$f":"IF($B106=\"\",\"\",$C106*INDEX(Luminaire_Table,MATCH($B106,Luminaire_Types,0),3))","v":""},null,{"$f":"IF($B106=\"\",\"\",$E106*INDEX(Luminaire_Table,MATCH($B106,Luminaire_Types,0),3))","v":""},null,{"$f":"IF($B106=\"\",\"\",$G106*INDEX(Luminaire_Table,MATCH($B106,Luminaire_Types,0),3))","v":""},null,{"$f":"IF($B106=\"\",\"\",$I106*INDEX(Luminaire_Table,MATCH($B106,Luminaire_Types,0),3))","v":""},null,{"$f":"IF($B106=\"\",\"\",$K106*INDEX(Luminaire_Table,MATCH($B106,Luminaire_Types,0),3))","v":""}]
[null,{"$f":"IF('Luminaire Schedule'!B96=\"\",\"\",'Luminaire Schedule'!B96)","v":""},null,{"$f":"IF($B107=\"\",\"\",$C107*INDEX(Luminaire_Table,MATCH($B107,Luminaire_Types,0),3))","v":""},null,{"$f":"IF($B107=\"\",\"\",$E107*INDEX(Luminaire_Table,MATCH($B107,Luminaire_Types,0),3))","v":""},null,{"$f":"IF($B107=\"\",\"\",$G107*INDEX(Luminaire_Table,MATCH($B107,Luminaire_Types,0),3))","v":""},null,{"$f":"IF($B107=\"\",\"\",$I107*INDEX(Luminaire_Table,MATCH($B107,Luminaire_Types,0),3))","v":""},null,{"$f":"IF($B107=\"\",\"\",$K107*INDEX(Luminaire_Table,MATCH($B107,Luminaire_Types,0),3))","v":""}]
[null,{"$f":"IF('Luminaire Schedule'!B97=\"\",\"\",'Luminaire Schedule'!B97)","v":""},null,{"$f":"IF($B108=\"\",\"\",$C108*INDEX(Luminaire_Table,MATCH($B108,Luminaire_Types,0),3))","v":""},null,{"$f":"IF($B108=\"\",\"\",$E108*INDEX(Luminaire_Table,MATCH($B108,Luminaire_Types,0),3))","v":""},null,{"$f":"IF($B108=\"\",\"\",$G108*INDEX(Luminaire_Table,MATCH($B108,Luminaire_Types,0),3))","v":""},null,{"$f":"IF($B108=\"\",\"\",$I108*INDEX(Luminaire_Table,MATCH($B108,Luminaire_Types,0),3))","v":""},null,{"$f":"IF($B108=\"\",\"\",$K108*INDEX(Luminaire_Table,MATCH($B108,Luminaire_Types,0),3))","v":""}]
[null,{"$f":"IF('Luminaire Schedule'!B98=\"\",\"\",'Luminaire Schedule'!B98)","v":""},null,{"$f":"IF($B109=\"\",\"\",$C109*INDEX(Luminaire_Table,MATCH($B109,Luminaire_Types,0),3))","v":""},null,{"$f":"IF($B109=\"\",\"\",$E109*INDEX(Luminaire_Table,MATCH($B109,Luminaire_Types,0),3))","v":""},null,{"$f":"IF($B109=\"\",\"\",$G109*INDEX(Luminaire_Table,MATCH($B109,Luminaire_Types,0),3))","v":""},null,{"$f":"IF($B109=\"\",\"\",$I109*INDEX(Luminaire_Table,MATCH($B109,Luminaire_Types,0),3))","v":""},null,{"$f":"IF($B109=\"\",\"\",$K109*INDEX(Luminaire_Table,MATCH($B109,Luminaire_Types,0),3))","v":""}]
[null,{"$f":"IF('Luminaire Schedule'!B99=\"\",\"\",'Luminaire Schedule'!B99)","v":""},null,{"$f":"IF($B110=\"\",\"\",$C110*INDEX(Luminaire_Table,MATCH($B110,Luminaire_Types,0),3))","v":""},null,{"$f":"IF($B110=\"\",\"\",$E110*INDEX(Luminaire_Table,MATCH($B110,Luminaire_Types,0),3))","v":""},null,{"$f":"IF($B110=\"\",\"\",$G110*INDEX(Luminaire_Table,MATCH($B110,Luminaire_Types,0),3))","v":""},null,{"$f":"IF($B110=\"\",\"\",$I110*INDEX(Luminaire_Table,MATCH($B110,Luminaire_Types,0),3))","v":""},null,{"$f":"IF($B110=\"\",\"\",$K110*INDEX(Luminaire_Table,MATCH($B110,Luminaire_Types,0),3))","v":""}]
[null,{"$f":"IF('Luminaire Schedule'!B100=\"\",\"\",'Luminaire Schedule'!B100)","v":""},null,{"$f":"IF($B111=\"\",\"\",$C111*INDEX(Luminaire_Table,MATCH($B111,Luminaire_Types,0),3))","v":""},null,{"$f":"IF($B111=\"\",\"\",$E111*INDEX(Luminaire_Table,MATCH($B111,Luminaire_Types,0),3))","v":""},null,{"$f":"IF($B111=\"\",\"\",$G111*INDEX(Luminaire_Table,MATCH($B111,Luminaire_Types,0),3))","v":""},null,{"$f":"IF($B111=\"\",\"\",$I111*INDEX(Luminaire_Table,MATCH($B111,Luminaire_Types,0),3))","v":""},null,{"$f":"IF($B111=\"\",\"\",$K111*INDEX(Luminaire_Table,MATCH($B111,Luminaire_Types,0),3))","v":""}]
[null,{"$f":"IF('Luminaire Schedule'!B101=\"\",\"\",'Luminaire Schedule'!B101)","v":""},null,{"$f":"IF($B112=\"\",\"\",$C112*INDEX(Luminaire_Table,MATCH($B112,Luminaire_Types,0),3))","v":""},null,{"$f":"IF($B112=\"\",\"\",$E112*INDEX(Luminaire_Table,MATCH($B112,Luminaire_Types,0),3))","v":""},null,{"$f":"IF($B112=\"\",\"\",$G112*INDEX(Luminaire_Table,MATCH($B112,Luminaire_Types,0),3))","v":""},null,{"$f":"IF($B112=\"\",\"\",$I112*INDEX(Luminaire_Table,MATCH($B112,Luminaire_Types,0),3))","v":""},null,{"$f":"IF($B112=\"\",\"\",$K112*INDEX(Luminaire_Table,MATCH($B112,Luminaire_Types,0),3))","v":""}]
[null,{"$f":"IF('Luminaire Schedule'!B102=\"\",\"\",'Luminaire Schedule'!B102)","v":""},null,{"$f":"IF($B113=\"\",\"\",$C113*INDEX(Luminaire_Table,MATCH($B113,Luminaire_Types,0),3))","v":""},null,{"$f":"IF($B113=\"\",\"\",$E113*INDEX(Luminaire_Table,MATCH($B113,Luminaire_Types,0),3))","v":""},null,{"$f":"IF($B113=\"\",\"\",$G113*INDEX(Luminaire_Table,MATCH($B113,Luminaire_Types,0),3))","v":""},null,{"$f":"IF($B113=\"\",\"\",$I113*INDEX(Luminaire_Table,MATCH($B113,Luminaire_Types,0),3))","v":""},null,{"$f":"IF($B113=\"\",\"\",$K113*INDEX(Luminaire_Table,MATCH($B113,Luminaire_Types,0),3))","v":""}]
[null,{"$f":"IF('Luminaire Schedule'!B103=\"\",\"\",'Luminaire Schedule'!B103)","v":""},null,{"$f":"IF($B114=\"\",\"\",$C114*INDEX(Luminaire_Table,MATCH($B114,Luminaire_Types,0),3))","v":""},null,{"$f":"IF($B114=\"\",\"\",$E114*INDEX(Luminaire_Table,MATCH($B114,Luminaire_Types,0),3))","v":""},null,{"$f":"IF($B114=\"\",\"\",$G114*INDEX(Luminaire_Table,MATCH($B114,Luminaire_Types,0),3))","v":""},null,{"$f":"IF($B114=\"\",\"\",$I114*INDEX(Luminaire_Table,MATCH($B114,Luminaire_Types,0),3))","v":""},null,{"$f":"IF($B114=\"\",\"\",$K114*INDEX(Luminaire_Table,MATCH($B114,Luminaire_Types,0),3))","v":""}]
[null,{"$f":"IF('Luminaire Schedule'!B104=\"\",\"\",'Luminaire Schedule'!B104)","v":""},null,{"$f":"IF($B115=\"\",\"\",$C115*INDEX(Luminaire_Table,MATCH($B115,Luminaire_Types,0),3))","v":""},null,{"$f":"IF($B115=\"\",\"\",$E115*INDEX(Luminaire_Table,MATCH($B115,Luminaire_Types,0),3))","v":""},null,{"$f":"IF($B115=\"\",\"\",$G115*INDEX(Luminaire_Table,MATCH($B115,Luminaire_Types,0),3))","v":""},null,{"$f":"IF($B115=\"\",\"\",$I115*INDEX(Luminaire_Table,MATCH($B115,Luminaire_Types,0),3))","v":""},null,{"$f":"IF($B115=\"\",\"\",$K115*INDEX(Luminaire_Table,MATCH($B115,Luminaire_Types,0),3))","v":""}]
[null,{"$f":"IF('Luminaire Schedule'!B105=\"\",\"\",'Luminaire Schedule'!B105)","v":""},null,{"$f":"IF($B116=\"\",\"\",$C116*INDEX(Luminaire_Table,MATCH($B116,Luminaire_Types,0),3))","v":""},null,{"$f":"IF($B116=\"\",\"\",$E116*INDEX(Luminaire_Table,MATCH($B116,Luminaire_Types,0),3))","v":""},null,{"$f":"IF($B116=\"\",\"\",$G116*INDEX(Luminaire_Table,MATCH($B116,Luminaire_Types,0),3))","v":""},null,{"$f":"IF($B116=\"\",\"\",$I116*INDEX(Luminaire_Table,MATCH($B116,Luminaire_Types,0),3))","v":""},null,{"$f":"IF($B116=\"\",\"\",$K116*INDEX(Luminaire_Table,MATCH($B116,Luminaire_Types,0),3))","v":""}]
[null,{"$f":"IF('Luminaire Schedule'!B106=\"\",\"\",'Luminaire Schedule'!B106)","v":""},null,{"$f":"IF($B117=\"\",\"\",$C117*INDEX(Luminaire_Table,MATCH($B117,Luminaire_Types,0),3))","v":""},null,{"$f":"IF($B117=\"\",\"\",$E117*INDEX(Luminaire_Table,MATCH($B117,Luminaire_Types,0),3))","v":""},null,{"$f":"IF($B117=\"\",\"\",$G117*INDEX(Luminaire_Table,MATCH($B117,Luminaire_Types,0),3))","v":""},null,{"$f":"IF($B117=\"\",\"\",$I117*INDEX(Luminaire_Table,MATCH($B117,Luminaire_Types,0),3))","v":""},null,{"$f":"IF($B117=\"\",\"\",$K117*INDEX(Luminaire_Table,MATCH($B117,Luminaire_Types,0),3))","v":""}]
[null,{"$f":"IF('Luminaire Schedule'!B107=\"\",\"\",'Luminaire Schedule'!B107)","v":""},null,{"$f":"IF($B118=\"\",\"\",$C118*INDEX(Luminaire_Table,MATCH($B118,Luminaire_Types,0),3))","v":""},null,{"$f":"IF($B118=\"\",\"\",$E118*INDEX(Luminaire_Table,MATCH($B118,Luminaire_Types,0),3))","v":""},null,{"$f":"IF($B118=\"\",\"\",$G118*INDEX(Luminaire_Table,MATCH($B118,Luminaire_Types,0),3))","v":""},null,{"$f":"IF($B118=\"\",\"\",$I118*INDEX(Luminaire_Table,MATCH($B118,Luminaire_Types,0),3))","v":""},null,{"$f":"IF($B118=\"\",\"\",$K118*INDEX(Luminaire_Table,MATCH($B118,Luminaire_Types,0),3))","v":""}]
[null,{"$f":"IF('Luminaire Schedule'!B108=\"\",\"\",'Luminaire Schedule'!B108)","v":""},null,{"$f":"IF($B119=\"\",\"\",$C119*INDEX(Luminaire_Table,MATCH($B119,Luminaire_Types,0),3))","v":""},null,{"$f":"IF($B119=\"\",\"\",$E119*INDEX(Luminaire_Table,MATCH($B119,Luminaire_Types,0),3))","v":""},null,{"$f":"IF($B119=\"\",\"\",$G119*INDEX(Luminaire_Table,MATCH($B119,Luminaire_Types,0),3))","v":""},null,{"$f":"IF($B119=\"\",\"\",$I119*INDEX(Luminaire_Table,MATCH($B119,Luminaire_Types,0),3))","v":""},null,{"$f":"IF($B119=\"\",\"\",$K119*INDEX(Luminaire_Table,MATCH($B119,Luminaire_Types,0),3))","v":""}]
[null,{"$f":"IF('Luminaire Schedule'!B109=\"\",\"\",'Luminaire Schedule'!B109)","v":""},null,{"$f":"IF($B120=\"\",\"\",$C120*INDEX(Luminaire_Table,MATCH($B120,Luminaire_Types,0),3))","v":""},null,{"$f":"IF($B120=\"\",\"\",$E120*INDEX(Luminaire_Table,MATCH($B120,Luminaire_Types,0),3))","v":""},null,{"$f":"IF($B120=\"\",\"\",$G120*INDEX(Luminaire_Table,MATCH($B120,Luminaire_Types,0),3))","v":""},null,{"$f":"IF($B120=\"\",\"\",$I120*INDEX(Luminaire_Table,MATCH($B120,Luminaire_Types,0),3))","v":""},null,{"$f":"IF($B120=\"\",\"\",$K120*INDEX(Luminaire_Table,MATCH($B120,Luminaire_Types,0),3))","v":""}]
[null,{"$f":"IF('Luminaire Schedule'!B110=\"\",\"\",'Luminaire Schedule'!B110)","v":""},null,{"$f":"IF($B121=\"\",\"\",$C121*INDEX(Luminaire_Table,MATCH($B121,Luminaire_Types,0),3))","v":""},null,{"$f":"IF($B121=\"\",\"\",$E121*INDEX(Luminaire_Table,MATCH($B121,Luminaire_Types,0),3))","v":""},null,{"$f":"IF($B121=\"\",\"\",$G121*INDEX(Luminaire_Table,MATCH($B121,Luminaire_Types,0),3))","v":""},null,{"$f":"IF($B121=\"\",\"\",$I121*INDEX(Luminaire_Table,MATCH($B121,Luminaire_Types,0),3))","v":""},null,{"$f":"IF($B121=\"\",\"\",$K121*INDEX(Luminaire_Table,MATCH($B121,Luminaire_Types,0),3))","v":""}]
[null,{"$f":"IF('Luminaire Schedule'!B111=\"\",\"\",'Luminaire Schedule'!B111)","v":""},null,{"$f":"IF($B122=\"\",\"\",$C122*INDEX(Luminaire_Table,MATCH($B122,Luminaire_Types,0),3))","v":""},null,{"$f":"IF($B122=\"\",\"\",$E122*INDEX(Luminaire_Table,MATCH($B122,Luminaire_Types,0),3))","v":""},null,{"$f":"IF($B122=\"\",\"\",$G122*INDEX(Luminaire_Table,MATCH($B122,Luminaire_Types,0),3))","v":""},null,{"$f":"IF($B122=\"\",\"\",$I122*INDEX(Luminaire_Table,MATCH($B122,Luminaire_Types,0),3))","v":""},null,{"$f":"IF($B122=\"\",\"\",$K122*INDEX(Luminaire_Table,MATCH($B122,Luminaire_Types,0),3))","v":""}]
[null,{"$f":"IF('Luminaire Schedule'!B112=\"\",\"\",'Luminaire Schedule'!B112)","v":""},null,{"$f":"IF($B123=\"\",\"\",$C123*INDEX(Luminaire_Table,MATCH($B123,Luminaire_Types,0),3))","v":""},null,{"$f":"IF($B123=\"\",\"\",$E123*INDEX(Luminaire_Table,MATCH($B123,Luminaire_Types,0),3))","v":""},null,{"$f":"IF($B123=\"\",\"\",$G123*INDEX(Luminaire_Table,MATCH($B123,Luminaire_Types,0),3))","v":""},null,{"$f":"IF($B123=\"\",\"\",$I123*INDEX(Luminaire_Table,MATCH($B123,Luminaire_Types,0),3))","v":""},null,{"$f":"IF($B123=\"\",\"\",$K123*INDEX(Luminaire_Table,MATCH($B123,Luminaire_Types,0),3))","v":""}]
[null,{"$f":"IF('Luminaire Schedule'!B113=\"\",\"\",'Luminaire Schedule'!B113)","v":""},null,{"$f":"IF($B124=\"\",\"\",$C124*INDEX(Luminaire_Table,MATCH($B124,Luminaire_Types,0),3))","v":""},null,{"$f":"IF($B124=\"\",\"\",$E124*INDEX(Luminaire_Table,MATCH($B124,Luminaire_Types,0),3))","v":""},null,{"$f":"IF($B124=\"\",\"\",$G124*INDEX(Luminaire_Table,MATCH($B124,Luminaire_Types,0),3))","v":""},null,{"$f":"IF($B124=\"\",\"\",$I124*INDEX(Luminaire_Table,MATCH($B124,Luminaire_Types,0),3))","v":""},null,{"$f":"IF($B124=\"\",\"\",$K124*INDEX(Luminaire_Table,MATCH($B124,Luminaire_Types,0),3))","v":""}]
[null,{"$f":"IF('Luminaire Schedule'!B114=\"\",\"\",'Luminaire Schedule'!B114)","v":""},null,{"$f":"IF($B125=\"\",\"\",$C125*INDEX(Luminaire_Table,MATCH($B125,Luminaire_Types,0),3))","v":""},null,{"$f":"IF($B125=\"\",\"\",$E125*INDEX(Luminaire_Table,MATCH($B125,Luminaire_Types,0),3))","v":""},null,{"$f":"IF($B125=\"\",\"\",$G125*INDEX(Luminaire_Table,MATCH($B125,Luminaire_Types,0),3))","v":""},null,{"$f":"IF($B125=\"\",\"\",$I125*INDEX(Luminaire_Table,MATCH($B125,Luminaire_Types,0),3))","v":""},null,{"$f":"IF($B125=\"\",\"\",$K125*INDEX(Luminaire_Table,MATCH($B125,Luminaire_Types,0),3))","v":""}]
[null,{"$f":"IF('Luminaire Schedule'!B115=\"\",\"\",'Luminaire Schedule'!B115)","v":""},null,{"$f":"IF($B126=\"\",\"\",$C126*INDEX(Luminaire_Table,MATCH($B126,Luminaire_Types,0),3))","v":""},null,{"$f":"IF($B126=\"\",\"\",$E126*INDEX(Luminaire_Table,MATCH($B126,Luminaire_Types,0),3))","v":""},null,{"$f":"IF($B126=\"\",\"\",$G126*INDEX(Luminaire_Table,MATCH($B126,Luminaire_Types,0),3))","v":""},null,{"$f":"IF($B126=\"\",\"\",$I126*INDEX(Luminaire_Table,MATCH($B126,Luminaire_Types,0),3))","v":""},null,{"$f":"IF($B126=\"\",\"\",$K126*INDEX(Luminaire_Table,MATCH($B126,Luminaire_Types,0),3))","v":""}]
[null,{"$f":"IF('Luminaire Schedule'!B116=\"\",\"\",'Luminaire Schedule'!B116)","v":""},null,{"$f":"IF($B127=\"\",\"\",$C127*INDEX(Luminaire_Table,MATCH($B127,Luminaire_Types,0),3))","v":""},null,{"$f":"IF($B127=\"\",\"\",$E127*INDEX(Luminaire_Table,MATCH($B127,Luminaire_Types,0),3))","v":""},null,{"$f":"IF($B127=\"\",\"\",$G127*INDEX(Luminaire_Table,MATCH($B127,Luminaire_Types,0),3))","v":""},null,{"$f":"IF($B127=\"\",\"\",$I127*INDEX(Luminaire_Table,MATCH($B127,Luminaire_Types,0),3))","v":""},null,{"$f":"IF($B127=\"\",\"\",$K127*INDEX(Luminaire_Table,MATCH($B127,Luminaire_Types,0),3))","v":""}]
[null,{"$f":"IF('Luminaire Schedule'!B117=\"\",\"\",'Luminaire Schedule'!B117)","v":""},null,{"$f":"IF($B128=\"\",\"\",$C128*INDEX(Luminaire_Table,MATCH($B128,Luminaire_Types,0),3))","v":""},null,{"$f":"IF($B128=\"\",\"\",$E128*INDEX(Luminaire_Table,MATCH($B128,Luminaire_Types,0),3))","v":""},null,{"$f":"IF($B128=\"\",\"\",$G128*INDEX(Luminaire_Table,MATCH($B128,Luminaire_Types,0),3))","v":""},null,{"$f":"IF($B128=\"\",\"\",$I128*INDEX(Luminaire_Table,MATCH($B128,Luminaire_Types,0),3))","v":""},null,{"$f":"IF($B128=\"\",\"\",$K128*INDEX(Luminaire_Table,MATCH($B128,Luminaire_Types,0),3))","v":""}]
[null,{"$f":"IF('Luminaire Schedule'!B118=\"\",\"\",'Luminaire Schedule'!B118)","v":""},null,{"$f":"IF($B129=\"\",\"\",$C129*INDEX(Luminaire_Table,MATCH($B129,Luminaire_Types,0),3))","v":""},null,{"$f":"IF($B129=\"\",\"\",$E129*INDEX(Luminaire_Table,MATCH($B129,Luminaire_Types,0),3))","v":""},null,{"$f":"IF($B129=\"\",\"\",$G129*INDEX(Luminaire_Table,MATCH($B129,Luminaire_Types,0),3))","v":""},null,{"$f":"IF($B129=\"\",\"\",$I129*INDEX(Luminaire_Table,MATCH($B129,Luminaire_Types,0),3))","v":""},null,{"$f":"IF($B129=\"\",\"\",$K129*INDEX(Luminaire_Table,MATCH($B129,Luminaire_Types,0),3))","v":""}]
[null,{"$f":"IF('Luminaire Schedule'!B119=\"\",\"\",'Luminaire Schedule'!B119)","v":""},null,{"$f":"IF($B130=\"\",\"\",$C130*INDEX(Luminaire_Table,MATCH($B130,Luminaire_Types,0),3))","v":""},null,{"$f":"IF($B130=\"\",\"\",$E130*INDEX(Luminaire_Table,MATCH($B130,Luminaire_Types,0),3))","v":""},null,{"$f":"IF($B130=\"\",\"\",$G130*INDEX(Luminaire_Table,MATCH($B130,Luminaire_Types,0),3))","v":""},null,{"$f":"IF($B130=\"\",\"\",$I130*INDEX(Luminaire_Table,MATCH($B130,Luminaire_Types,0),3))","v":""},null,{"$f":"IF($B130=\"\",\"\",$K130*INDEX(Luminaire_Table,MATCH($B130,Luminaire_Types,0),3))","v":""}]
[null,{"$f":"IF('Luminaire Schedule'!B120=\"\",\"\",'Luminaire Schedule'!B120)","v":""},null,{"$f":"IF($B131=\"\",\"\",$C131*INDEX(Luminaire_Table,MATCH($B131,Luminaire_Types,0),3))","v":""},null,{"$f":"IF($B131=\"\",\"\",$E131*INDEX(Luminaire_Table,MATCH($B131,Luminaire_Types,0),3))","v":""},null,{"$f":"IF($B131=\"\",\"\",$G131*INDEX(Luminaire_Table,MATCH($B131,Luminaire_Types,0),3))","v":""},null,{"$f":"IF($B131=\"\",\"\",$I131*INDEX(Luminaire_Table,MATCH($B131,Luminaire_Types,0),3))","v":""},null,{"$f":"IF($B131=\"\",\"\",$K131*INDEX(Luminaire_Table,MATCH($B131,Luminaire_Types,0),3))","v":""}]
[null,{"$f":"IF('Luminaire Schedule'!B121=\"\",\"\",'Luminaire Schedule'!B121)","v":""},null,{"$f":"IF($B132=\"\",\"\",$C132*INDEX(Luminaire_Table,MATCH($B132,Luminaire_Types,0),3))","v":""},null,{"$f":"IF($B132=\"\",\"\",$E132*INDEX(Luminaire_Table,MATCH($B132,Luminaire_Types,0),3))","v":""},null,{"$f":"IF($B132=\"\",\"\",$G132*INDEX(Luminaire_Table,MATCH($B132,Luminaire_Types,0),3))","v":""},null,{"$f":"IF($B132=\"\",\"\",$I132*INDEX(Luminaire_Table,MATCH($B132,Luminaire_Types,0),3))","v":""},null,{"$f":"IF($B132=\"\",\"\",$K132*INDEX(Luminaire_Table,MATCH($B132,Luminaire_Types,0),3))","v":""}]
[null,{"$f":"IF('Luminaire Schedule'!B122=\"\",\"\",'Luminaire Schedule'!B122)","v":""},null,{"$f":"IF($B133=\"\",\"\",$C133*INDEX(Luminaire_Table,MATCH($B133,Luminaire_Types,0),3))","v":""},null,{"$f":"IF($B133=\"\",\"\",$E133*INDEX(Luminaire_Table,MATCH($B133,Luminaire_Types,0),3))","v":""},null,{"$f":"IF($B133=\"\",\"\",$G133*INDEX(Luminaire_Table,MATCH($B133,Luminaire_Types,0),3))","v":""},null,{"$f":"IF($B133=\"\",\"\",$I133*INDEX(Luminaire_Table,MATCH($B133,Luminaire_Types,0),3))","v":""},null,{"$f":"IF($B133=\"\",\"\",$K133*INDEX(Luminaire_Table,MATCH($B133,Luminaire_Types,0),3))","v":""}]
[null,{"$f":"IF('Luminaire Schedule'!B123=\"\",\"\",'Luminaire Schedule'!B123)","v":""},null,{"$f":"IF($B134=\"\",\"\",$C134*INDEX(Luminaire_Table,MATCH($B134,Luminaire_Types,0),3))","v":""},null,{"$f":"IF($B134=\"\",\"\",$E134*INDEX(Luminaire_Table,MATCH($B134,Luminaire_Types,0),3))","v":""},null,{"$f":"IF($B134=\"\",\"\",$G134*INDEX(Luminaire_Table,MATCH($B134,Luminaire_Types,0),3))","v":""},null,{"$f":"IF($B134=\"\",\"\",$I134*INDEX(Luminaire_Table,MATCH($B134,Luminaire_Types,0),3))","v":""},null,{"$f":"IF($B134=\"\",\"\",$K134*INDEX(Luminaire_Table,MATCH($B134,Luminaire_Types,0),3))","v":""}]
[null,{"$f":"IF('Luminaire Schedule'!B124=\"\",\"\",'Luminaire Schedule'!B124)","v":""},null,{"$f":"IF($B135=\"\",\"\",$C135*INDEX(Luminaire_Table,MATCH($B135,Luminaire_Types,0),3))","v":""},null,{"$f":"IF($B135=\"\",\"\",$E135*INDEX(Luminaire_Table,MATCH($B135,Luminaire_Types,0),3))","v":""},null,{"$f":"IF($B135=\"\",\"\",$G135*INDEX(Luminaire_Table,MATCH($B135,Luminaire_Types,0),3))","v":""},null,{"$f":"IF($B135=\"\",\"\",$I135*INDEX(Luminaire_Table,MATCH($B135,Luminaire_Types,0),3))","v":""},null,{"$f":"IF($B135=\"\",\"\",$K135*INDEX(Luminaire_Table,MATCH($B135,Luminaire_Types,0),3))","v":""}]
[null,{"$f":"IF('Luminaire Schedule'!B125=\"\",\"\",'Luminaire Schedule'!B125)","v":""},null,{"$f":"IF($B136=\"\",\"\",$C136*INDEX(Luminaire_Table,MATCH($B136,Luminaire_Types,0),3))","v":""},null,{"$f":"IF($B136=\"\",\"\",$E136*INDEX(Luminaire_Table,MATCH($B136,Luminaire_Types,0),3))","v":""},null,{"$f":"IF($B136=\"\",\"\",$G136*INDEX(Luminaire_Table,MATCH($B136,Luminaire_Types,0),3))","v":""},null,{"$f":"IF($B136=\"\",\"\",$I136*INDEX(Luminaire_Table,MATCH($B136,Luminaire_Types,0),3))","v":""},null,{"$f":"IF($B136=\"\",\"\",$K136*INDEX(Luminaire_Table,MATCH($B136,Luminaire_Types,0),3))","v":""}]
[null,{"$f":"IF('Luminaire Schedule'!B126=\"\",\"\",'Luminaire Schedule'!B126)","v":""},null,{"$f":"IF($B137=\"\",\"\",$C137*INDEX(Luminaire_Table,MATCH($B137,Luminaire_Types,0),3))","v":""},null,{"$f":"IF($B137=\"\",\"\",$E137*INDEX(Luminaire_Table,MATCH($B137,Luminaire_Types,0),3))","v":""},null,{"$f":"IF($B137=\"\",\"\",$G137*INDEX(Luminaire_Table,MATCH($B137,Luminaire_Types,0),3))","v":""},null,{"$f":"IF($B137=\"\",\"\",$I137*INDEX(Luminaire_Table,MATCH($B137,Luminaire_Types,0),3))","v":""},null,{"$f":"IF($B137=\"\",\"\",$K137*INDEX(Luminaire_Table,MATCH($B137,Luminaire_Types,0),3))","v":""}]
[null,{"$f":"IF('Luminaire Schedule'!B127=\"\",\"\",'Luminaire Schedule'!B127)","v":""},null,{"$f":"IF($B138=\"\",\"\",$C138*INDEX(Luminaire_Table,MATCH($B138,Luminaire_Types,0),3))","v":""},null,{"$f":"IF($B138=\"\",\"\",$E138*INDEX(Luminaire_Table,MATCH($B138,Luminaire_Types,0),3))","v":""},null,{"$f":"IF($B138=\"\",\"\",$G138*INDEX(Luminaire_Table,MATCH($B138,Luminaire_Types,0),3))","v":""},null,{"$f":"IF($B138=\"\",\"\",$I138*INDEX(Luminaire_Table,MATCH($B138,Luminaire_Types,0),3))","v":""},null,{"$f":"IF($B138=\"\",\"\",$K138*INDEX(Luminaire_Table,MATCH($B138,Luminaire_Types,0),3))","v":""}]
[null,{"$f":"IF('Luminaire Schedule'!B128=\"\",\"\",'Luminaire Schedule'!B128)","v":""},null,{"$f":"IF($B139=\"\",\"\",$C139*INDEX(Luminaire_Table,MATCH($B139,Luminaire_Types,0),3))","v":""},null,{"$f":"IF($B139=\"\",\"\",$E139*INDEX(Luminaire_Table,MATCH($B139,Luminaire_Types,0),3))","v":""},null,{"$f":"IF($B139=\"\",\"\",$G139*INDEX(Luminaire_Table,MATCH($B139,Luminaire_Types,0),3))","v":""},null,{"$f":"IF($B139=\"\",\"\",$I139*INDEX(Luminaire_Table,MATCH($B139,Luminaire_Types,0),3))","v":""},null,{"$f":"IF($B139=\"\",\"\",$K139*INDEX(Luminaire_Table,MATCH($B139,Luminaire_Types,0),3))","v":""}]
[null,{"$f":"IF('Luminaire Schedule'!B129=\"\",\"\",'Luminaire Schedule'!B129)","v":""},null,{"$f":"IF($B140=\"\",\"\",$C140*INDEX(Luminaire_Table,MATCH($B140,Luminaire_Types,0),3))","v":""},null,{"$f":"IF($B140=\"\",\"\",$E140*INDEX(Luminaire_Table,MATCH($B140,Luminaire_Types,0),3))","v":""},null,{"$f":"IF($B140=\"\",\"\",$G140*INDEX(Luminaire_Table,MATCH($B140,Luminaire_Types,0),3))","v":""},null,{"$f":"IF($B140=\"\",\"\",$I140*INDEX(Luminaire_Table,MATCH($B140,Luminaire_Types,0),3))","v":""},null,{"$f":"IF($B140=\"\",\"\",$K140*INDEX(Luminaire_Table,MATCH($B140,Luminaire_Types,0),3))","v":""}]
[null,{"$f":"IF('Luminaire Schedule'!B130=\"\",\"\",'Luminaire Schedule'!B130)","v":""},null,{"$f":"IF($B141=\"\",\"\",$C141*INDEX(Luminaire_Table,MATCH($B141,Luminaire_Types,0),3))","v":""},null,{"$f":"IF($B141=\"\",\"\",$E141*INDEX(Luminaire_Table,MATCH($B141,Luminaire_Types,0),3))","v":""},null,{"$f":"IF($B141=\"\",\"\",$G141*INDEX(Luminaire_Table,MATCH($B141,Luminaire_Types,0),3))","v":""},null,{"$f":"IF($B141=\"\",\"\",$I141*INDEX(Luminaire_Table,MATCH($B141,Luminaire_Types,0),3))","v":""},null,{"$f":"IF($B141=\"\",\"\",$K141*INDEX(Luminaire_Table,MATCH($B141,Luminaire_Types,0),3))","v":""}]
[null,{"$f":"IF('Luminaire Schedule'!B131=\"\",\"\",'Luminaire Schedule'!B131)","v":""},null,{"$f":"IF($B142=\"\",\"\",$C142*INDEX(Luminaire_Table,MATCH($B142,Luminaire_Types,0),3))","v":""},null,{"$f":"IF($B142=\"\",\"\",$E142*INDEX(Luminaire_Table,MATCH($B142,Luminaire_Types,0),3))","v":""},null,{"$f":"IF($B142=\"\",\"\",$G142*INDEX(Luminaire_Table,MATCH($B142,Luminaire_Types,0),3))","v":""},null,{"$f":"IF($B142=\"\",\"\",$I142*INDEX(Luminaire_Table,MATCH($B142,Luminaire_Types,0),3))","v":""},null,{"$f":"IF($B142=\"\",\"\",$K142*INDEX(Luminaire_Table,MATCH($B142,Luminaire_Types,0),3))","v":""}]
[null,{"$f":"IF('Luminaire Schedule'!B132=\"\",\"\",'Luminaire Schedule'!B132)","v":""},null,{"$f":"IF($B143=\"\",\"\",$C143*INDEX(Luminaire_Table,MATCH($B143,Luminaire_Types,0),3))","v":""},null,{"$f":"IF($B143=\"\",\"\",$E143*INDEX(Luminaire_Table,MATCH($B143,Luminaire_Types,0),3))","v":""},null,{"$f":"IF($B143=\"\",\"\",$G143*INDEX(Luminaire_Table,MATCH($B143,Luminaire_Types,0),3))","v":""},null,{"$f":"IF($B143=\"\",\"\",$I143*INDEX(Luminaire_Table,MATCH($B143,Luminaire_Types,0),3))","v":""},null,{"$f":"IF($B143=\"\",\"\",$K143*INDEX(Luminaire_Table,MATCH($B143,Luminaire_Types,0),3))","v":""}]
[null,{"$f":"IF('Luminaire Schedule'!B133=\"\",\"\",'Luminaire Schedule'!B133)","v":""},null,{"$f":"IF($B144=\"\",\"\",$C144*INDEX(Luminaire_Table,MATCH($B144,Luminaire_Types,0),3))","v":""},null,{"$f":"IF($B144=\"\",\"\",$E144*INDEX(Luminaire_Table,MATCH($B144,Luminaire_Types,0),3))","v":""},null,{"$f":"IF($B144=\"\",\"\",$G144*INDEX(Luminaire_Table,MATCH($B144,Luminaire_Types,0),3))","v":""},null,{"$f":"IF($B144=\"\",\"\",$I144*INDEX(Luminaire_Table,MATCH($B144,Luminaire_Types,0),3))","v":""},null,{"$f":"IF($B144=\"\",\"\",$K144*INDEX(Luminaire_Table,MATCH($B144,Luminaire_Types,0),3))","v":""}]
[null,{"$f":"IF('Luminaire Schedule'!B134=\"\",\"\",'Luminaire Schedule'!B134)","v":""},null,{"$f":"IF($B145=\"\",\"\",$C145*INDEX(Luminaire_Table,MATCH($B145,Luminaire_Types,0),3))","v":""},null,{"$f":"IF($B145=\"\",\"\",$E145*INDEX(Luminaire_Table,MATCH($B145,Luminaire_Types,0),3))","v":""},null,{"$f":"IF($B145=\"\",\"\",$G145*INDEX(Luminaire_Table,MATCH($B145,Luminaire_Types,0),3))","v":""},null,{"$f":"IF($B145=\"\",\"\",$I145*INDEX(Luminaire_Table,MATCH($B145,Luminaire_Types,0),3))","v":""},null,{"$f":"IF($B145=\"\",\"\",$K145*INDEX(Luminaire_Table,MATCH($B145,Luminaire_Types,0),3))","v":""}]
[null,{"$f":"IF('Luminaire Schedule'!B135=\"\",\"\",'Luminaire Schedule'!B135)","v":""},null,{"$f":"IF($B146=\"\",\"\",$C146*INDEX(Luminaire_Table,MATCH($B146,Luminaire_Types,0),3))","v":""},null,{"$f":"IF($B146=\"\",\"\",$E146*INDEX(Luminaire_Table,MATCH($B146,Luminaire_Types,0),3))","v":""},null,{"$f":"IF($B146=\"\",\"\",$G146*INDEX(Luminaire_Table,MATCH($B146,Luminaire_Types,0),3))","v":""},null,{"$f":"IF($B146=\"\",\"\",$I146*INDEX(Luminaire_Table,MATCH($B146,Luminaire_Types,0),3))","v":""},null,{"$f":"IF($B146=\"\",\"\",$K146*INDEX(Luminaire_Table,MATCH($B146,Luminaire_Types,0),3))","v":""}]
[null,{"$f":"IF('Luminaire Schedule'!B136=\"\",\"\",'Luminaire Schedule'!B136)","v":""},null,{"$f":"IF($B147=\"\",\"\",$C147*INDEX(Luminaire_Table,MATCH($B147,Luminaire_Types,0),3))","v":""},null,{"$f":"IF($B147=\"\",\"\",$E147*INDEX(Luminaire_Table,MATCH($B147,Luminaire_Types,0),3))","v":""},null,{"$f":"IF($B147=\"\",\"\",$G147*INDEX(Luminaire_Table,MATCH($B147,Luminaire_Types,0),3))","v":""},null,{"$f":"IF($B147=\"\",\"\",$I147*INDEX(Luminaire_Table,MATCH($B147,Luminaire_Types,0),3))","v":""},null,{"$f":"IF($B147=\"\",\"\",$K147*INDEX(Luminaire_Table,MATCH($B147,Luminaire_Types,0),3))","v":""}]
[null,{"$f":"IF('Luminaire Schedule'!B137=\"\",\"\",'Luminaire Schedule'!B137)","v":""},null,{"$f":"IF($B148=\"\",\"\",$C148*INDEX(Luminaire_Table,MATCH($B148,Luminaire_Types,0),3))","v":""},null,{"$f":"IF($B148=\"\",\"\",$E148*INDEX(Luminaire_Table,MATCH($B148,Luminaire_Types,0),3))","v":""},null,{"$f":"IF($B148=\"\",\"\",$G148*INDEX(Luminaire_Table,MATCH($B148,Luminaire_Types,0),3))","v":""},null,{"$f":"IF($B148=\"\",\"\",$I148*INDEX(Luminaire_Table,MATCH($B148,Luminaire_Types,0),3))","v":""},null,{"$f":"IF($B148=\"\",\"\",$K148*INDEX(Luminaire_Table,MATCH($B148,Luminaire_Types,0),3))","v":""}]
[null,{"$f":"IF('Luminaire Schedule'!B138=\"\",\"\",'Luminaire Schedule'!B138)","v":""},null,{"$f":"IF($B149=\"\",\"\",$C149*INDEX(Luminaire_Table,MATCH($B149,Luminaire_Types,0),3))","v":""},null,{"$f":"IF($B149=\"\",\"\",$E149*INDEX(Luminaire_Table,MATCH($B149,Luminaire_Types,0),3))","v":""},null,{"$f":"IF($B149=\"\",\"\",$G149*INDEX(Luminaire_Table,MATCH($B149,Luminaire_Types,0),3))","v":""},null,{"$f":"IF($B149=\"\",\"\",$I149*INDEX(Luminaire_Table,MATCH($B149,Luminaire_Types,0),3))","v":""},null,{"$f":"IF($B149=\"\",\"\",$K149*INDEX(Luminaire_Table,MATCH($B149,Luminaire_Types,0),3))","v":""}]
[null,{"$f":"IF('Luminaire Schedule'!B139=\"\",\"\",'Luminaire Schedule'!B139)","v":""},null,{"$f":"IF($B150=\"\",\"\",$C150*INDEX(Luminaire_Table,MATCH($B150,Luminaire_Types,0),3))","v":""},null,{"$f":"IF($B150=\"\",\"\",$E150*INDEX(Luminaire_Table,MATCH($B150,Luminaire_Types,0),3))","v":""},null,{"$f":"IF($B150=\"\",\"\",$G150*INDEX(Luminaire_Table,MATCH($B150,Luminaire_Types,0),3))","v":""},null,{"$f":"IF($B150=\"\",\"\",$I150*INDEX(Luminaire_Table,MATCH($B150,Luminaire_Types,0),3))","v":""},null,{"$f":"IF($B150=\"\",\"\",$K150*INDEX(Luminaire_Table,MATCH($B150,Luminaire_Types,0),3))","v":""}]
[null,{"$f":"IF('Luminaire Schedule'!B140=\"\",\"\",'Luminaire Schedule'!B140)","v":""},null,{"$f":"IF($B151=\"\",\"\",$C151*INDEX(Luminaire_Table,MATCH($B151,Luminaire_Types,0),3))","v":""},null,{"$f":"IF($B151=\"\",\"\",$E151*INDEX(Luminaire_Table,MATCH($B151,Luminaire_Types,0),3))","v":""},null,{"$f":"IF($B151=\"\",\"\",$G151*INDEX(Luminaire_Table,MATCH($B151,Luminaire_Types,0),3))","v":""},null,{"$f":"IF($B151=\"\",\"\",$I151*INDEX(Luminaire_Table,MATCH($B151,Luminaire_Types,0),3))","v":""},null,{"$f":"IF($B151=\"\",\"\",$K151*INDEX(Luminaire_Table,MATCH($B151,Luminaire_Types,0),3))","v":""}]
[null,{"$f":"IF('Luminaire Schedule'!B141=\"\",\"\",'Luminaire Schedule'!B141)","v":""},null,{"$f":"IF($B152=\"\",\"\",$C152*INDEX(Luminaire_Table,MATCH($B152,Luminaire_Types,0),3))","v":""},null,{"$f":"IF($B152=\"\",\"\",$E152*INDEX(Luminaire_Table,MATCH($B152,Luminaire_Types,0),3))","v":""},null,{"$f":"IF($B152=\"\",\"\",$G152*INDEX(Luminaire_Table,MATCH($B152,Luminaire_Types,0),3))","v":""},null,{"$f":"IF($B152=\"\",\"\",$I152*INDEX(Luminaire_Table,MATCH($B152,Luminaire_Types,0),3))","v":""},null,{"$f":"IF($B152=\"\",\"\",$K152*INDEX(Luminaire_Table,MATCH($B152,Luminaire_Types,0),3))","v":""}]
[null,{"$f":"IF('Luminaire Schedule'!B142=\"\",\"\",'Luminaire Schedule'!B142)","v":""},null,{"$f":"IF($B153=\"\",\"\",$C153*INDEX(Luminaire_Table,MATCH($B153,Luminaire_Types,0),3))","v":""},null,{"$f":"IF($B153=\"\",\"\",$E153*INDEX(Luminaire_Table,MATCH($B153,Luminaire_Types,0),3))","v":""},null,{"$f":"IF($B153=\"\",\"\",$G153*INDEX(Luminaire_Table,MATCH($B153,Luminaire_Types,0),3))","v":""},null,{"$f":"IF($B153=\"\",\"\",$I153*INDEX(Luminaire_Table,MATCH($B153,Luminaire_Types,0),3))","v":""},null,{"$f":"IF($B153=\"\",\"\",$K153*INDEX(Luminaire_Table,MATCH($B153,Luminaire_Types,0),3))","v":""}]
[null,{"$f":"IF('Luminaire Schedule'!B143=\"\",\"\",'Luminaire Schedule'!B143)","v":""},null,{"$f":"IF($B154=\"\",\"\",$C154*INDEX(Luminaire_Table,MATCH($B154,Luminaire_Types,0),3))","v":""},null,{"$f":"IF($B154=\"\",\"\",$E154*INDEX(Luminaire_Table,MATCH($B154,Luminaire_Types,0),3))","v":""},null,{"$f":"IF($B154=\"\",\"\",$G154*INDEX(Luminaire_Table,MATCH($B154,Luminaire_Types,0),3))","v":""},null,{"$f":"IF($B154=\"\",\"\",$I154*INDEX(Luminaire_Table,MATCH($B154,Luminaire_Types,0),3))","v":""},null,{"$f":"IF($B154=\"\",\"\",$K154*INDEX(Luminaire_Table,MATCH($B154,Luminaire_Types,0),3))","v":""}]
[null,{"$f":"IF('Luminaire Schedule'!B144=\"\",\"\",'Luminaire Schedule'!B144)","v":""},null,{"$f":"IF($B155=\"\",\"\",$C155*INDEX(Luminaire_Table,MATCH($B155,Luminaire_Types,0),3))","v":""},null,{"$f":"IF($B155=\"\",\"\",$E155*INDEX(Luminaire_Table,MATCH($B155,Luminaire_Types,0),3))","v":""},null,{"$f":"IF($B155=\"\",\"\",$G155*INDEX(Luminaire_Table,MATCH($B155,Luminaire_Types,0),3))","v":""},null,{"$f":"IF($B155=\"\",\"\",$I155*INDEX(Luminaire_Table,MATCH($B155,Luminaire_Types,0),3))","v":""},null,{"$f":"IF($B155=\"\",\"\",$K155*INDEX(Luminaire_Table,MATCH($B155,Luminaire_Types,0),3))","v":""}]
[null,{"$f":"IF('Luminaire Schedule'!B145=\"\",\"\",'Luminaire Schedule'!B145)","v":""},null,{"$f":"IF($B156=\"\",\"\",$C156*INDEX(Luminaire_Table,MATCH($B156,Luminaire_Types,0),3))","v":""},null,{"$f":"IF($B156=\"\",\"\",$E156*INDEX(Luminaire_Table,MATCH($B156,Luminaire_Types,0),3))","v":""},null,{"$f":"IF($B156=\"\",\"\",$G156*INDEX(Luminaire_Table,MATCH($B156,Luminaire_Types,0),3))","v":""},null,{"$f":"IF($B156=\"\",\"\",$I156*INDEX(Luminaire_Table,MATCH($B156,Luminaire_Types,0),3))","v":""},null,{"$f":"IF($B156=\"\",\"\",$K156*INDEX(Luminaire_Table,MATCH($B156,Luminaire_Types,0),3))","v":""}]
[null,{"$f":"IF('Luminaire Schedule'!B146=\"\",\"\",'Luminaire Schedule'!B146)","v":""},null,{"$f":"IF($B157=\"\",\"\",$C157*INDEX(Luminaire_Table,MATCH($B157,Luminaire_Types,0),3))","v":""},null,{"$f":"IF($B157=\"\",\"\",$E157*INDEX(Luminaire_Table,MATCH($B157,Luminaire_Types,0),3))","v":""},null,{"$f":"IF($B157=\"\",\"\",$G157*INDEX(Luminaire_Table,MATCH($B157,Luminaire_Types,0),3))","v":""},null,{"$f":"IF($B157=\"\",\"\",$I157*INDEX(Luminaire_Table,MATCH($B157,Luminaire_Types,0),3))","v":""},null,{"$f":"IF($B157=\"\",\"\",$K157*INDEX(Luminaire_Table,MATCH($B157,Luminaire_Types,0),3))","v":""}]
[null,{"$f":"IF('Luminaire Schedule'!B147=\"\",\"\",'Luminaire Schedule'!B147)","v":""},null,{"$f":"IF($B158=\"\",\"\",$C158*INDEX(Luminaire_Table,MATCH($B158,Luminaire_Types,0),3))","v":""},null,{"$f":"IF($B158=\"\",\"\",$E158*INDEX(Luminaire_Table,MATCH($B158,Luminaire_Types,0),3))","v":""},null,{"$f":"IF($B158=\"\",\"\",$G158*INDEX(Luminaire_Table,MATCH($B158,Luminaire_Types,0),3))","v":""},null,{"$f":"IF($B158=\"\",\"\",$I158*INDEX(Luminaire_Table,MATCH($B158,Luminaire_Types,0),3))","v":""},null,{"$f":"IF($B158=\"\",\"\",$K158*INDEX(Luminaire_Table,MATCH($B158,Luminaire_Types,0),3))","v":""}]
[null,{"$f":"IF('Luminaire Schedule'!B148=\"\",\"\",'Luminaire Schedule'!B148)","v":""},null,{"$f":"IF($B159=\"\",\"\",$C159*INDEX(Luminaire_Table,MATCH($B159,Luminaire_Types,0),3))","v":""},null,{"$f":"IF($B159=\"\",\"\",$E159*INDEX(Luminaire_Table,MATCH($B159,Luminaire_Types,0),3))","v":""},null,{"$f":"IF($B159=\"\",\"\",$G159*INDEX(Luminaire_Table,MATCH($B159,Luminaire_Types,0),3))","v":""},null,{"$f":"IF($B159=\"\",\"\",$I159*INDEX(Luminaire_Table,MATCH($B159,Luminaire_Types,0),3))","v":""},null,{"$f":"IF($B159=\"\",\"\",$K159*INDEX(Luminaire_Table,MATCH($B159,Luminaire_Types,0),3))","v":""}]
[null,{"$f":"IF('Luminaire Schedule'!B149=\"\",\"\",'Luminaire Schedule'!B149)","v":""},null,{"$f":"IF($B160=\"\",\"\",$C160*INDEX(Luminaire_Table,MATCH($B160,Luminaire_Types,0),3))","v":""},null,{"$f":"IF($B160=\"\",\"\",$E160*INDEX(Luminaire_Table,MATCH($B160,Luminaire_Types,0),3))","v":""},null,{"$f":"IF($B160=\"\",\"\",$G160*INDEX(Luminaire_Table,MATCH($B160,Luminaire_Types,0),3))","v":""},null,{"$f":"IF($B160=\"\",\"\",$I160*INDEX(Luminaire_Table,MATCH($B160,Luminaire_Types,0),3))","v":""},null,{"$f":"IF($B160=\"\",\"\",$K160*INDEX(Luminaire_Table,MATCH($B160,Luminaire_Types,0),3))","v":""}]
[null,{"$f":"IF('Luminaire Schedule'!B150=\"\",\"\",'Luminaire Schedule'!B150)","v":""},null,{"$f":"IF($B161=\"\",\"\",$C161*INDEX(Luminaire_Table,MATCH($B161,Luminaire_Types,0),3))","v":""},null,{"$f":"IF($B161=\"\",\"\",$E161*INDEX(Luminaire_Table,MATCH($B161,Luminaire_Types,0),3))","v":""},null,{"$f":"IF($B161=\"\",\"\",$G161*INDEX(Luminaire_Table,MATCH($B161,Luminaire_Types,0),3))","v":""},null,{"$f":"IF($B161=\"\",\"\",$I161*INDEX(Luminaire_Table,MATCH($B161,Luminaire_Types,0),3))","v":""},null,{"$f":"IF($B161=\"\",\"\",$K161*INDEX(Luminaire_Table,MATCH($B161,Luminaire_Types,0),3))","v":""}]
[null,{"$f":"IF('Luminaire Schedule'!B151=\"\",\"\",'Luminaire Schedule'!B151)","v":""},null,{"$f":"IF($B162=\"\",\"\",$C162*INDEX(Luminaire_Table,MATCH($B162,Luminaire_Types,0),3))","v":""},null,{"$f":"IF($B162=\"\",\"\",$E162*INDEX(Luminaire_Table,MATCH($B162,Luminaire_Types,0),3))","v":""},null,{"$f":"IF($B162=\"\",\"\",$G162*INDEX(Luminaire_Table,MATCH($B162,Luminaire_Types,0),3))","v":""},null,{"$f":"IF($B162=\"\",\"\",$I162*INDEX(Luminaire_Table,MATCH($B162,Luminaire_Types,0),3))","v":""},null,{"$f":"IF($B162=\"\",\"\",$K162*INDEX(Luminaire_Table,MATCH($B162,Luminaire_Types,0),3))","v":""}]
[null,{"$f":"IF('Luminaire Schedule'!B152=\"\",\"\",'Luminaire Schedule'!B152)","v":""},null,{"$f":"IF($B163=\"\",\"\",$C163*INDEX(Luminaire_Table,MATCH($B163,Luminaire_Types,0),3))","v":""},null,{"$f":"IF($B163=\"\",\"\",$E163*INDEX(Luminaire_Table,MATCH($B163,Luminaire_Types,0),3))","v":""},null,{"$f":"IF($B163=\"\",\"\",$G163*INDEX(Luminaire_Table,MATCH($B163,Luminaire_Types,0),3))","v":""},null,{"$f":"IF($B163=\"\",\"\",$I163*INDEX(Luminaire_Table,MATCH($B163,Luminaire_Types,0),3))","v":""},null,{"$f":"IF($B163=\"\",\"\",$K163*INDEX(Luminaire_Table,MATCH($B163,Luminaire_Types,0),3))","v":""}]
[null,{"$f":"IF('Luminaire Schedule'!B153=\"\",\"\",'Luminaire Schedule'!B153)","v":""},null,{"$f":"IF($B164=\"\",\"\",$C164*INDEX(Luminaire_Table,MATCH($B164,Luminaire_Types,0),3))","v":""},null,{"$f":"IF($B164=\"\",\"\",$E164*INDEX(Luminaire_Table,MATCH($B164,Luminaire_Types,0),3))","v":""},null,{"$f":"IF($B164=\"\",\"\",$G164*INDEX(Luminaire_Table,MATCH($B164,Luminaire_Types,0),3))","v":""},null,{"$f":"IF($B164=\"\",\"\",$I164*INDEX(Luminaire_Table,MATCH($B164,Luminaire_Types,0),3))","v":""},null,{"$f":"IF($B164=\"\",\"\",$K164*INDEX(Luminaire_Table,MATCH($B164,Luminaire_Types,0),3))","v":""}]
[null,{"$f":"IF('Luminaire Schedule'!B154=\"\",\"\",'Luminaire Schedule'!B154)","v":""},null,{"$f":"IF($B165=\"\",\"\",$C165*INDEX(Luminaire_Table,MATCH($B165,Luminaire_Types,0),3))","v":""},null,{"$f":"IF($B165=\"\",\"\",$E165*INDEX(Luminaire_Table,MATCH($B165,Luminaire_Types,0),3))","v":""},null,{"$f":"IF($B165=\"\",\"\",$G165*INDEX(Luminaire_Table,MATCH($B165,Luminaire_Types,0),3))","v":""},null,{"$f":"IF($B165=\"\",\"\",$I165*INDEX(Luminaire_Table,MATCH($B165,Luminaire_Types,0),3))","v":""},null,{"$f":"IF($B165=\"\",\"\",$K165*INDEX(Luminaire_Table,MATCH($B165,Luminaire_Types,0),3))","v":""}]
[null,{"$f":"IF('Luminaire Schedule'!B155=\"\",\"\",'Luminaire Schedule'!B155)","v":""},null,{"$f":"IF($B166=\"\",\"\",$C166*INDEX(Luminaire_Table,MATCH($B166,Luminaire_Types,0),3))","v":""},null,{"$f":"IF($B166=\"\",\"\",$E166*INDEX(Luminaire_Table,MATCH($B166,Luminaire_Types,0),3))","v":""},null,{"$f":"IF($B166=\"\",\"\",$G166*INDEX(Luminaire_Table,MATCH($B166,Luminaire_Types,0),3))","v":""},null,{"$f":"IF($B166=\"\",\"\",$I166*INDEX(Luminaire_Table,MATCH($B166,Luminaire_Types,0),3))","v":""},null,{"$f":"IF($B166=\"\",\"\",$K166*INDEX(Luminaire_Table,MATCH($B166,Luminaire_Types,0),3))","v":""}]
[null,{"$f":"IF('Luminaire Schedule'!B156=\"\",\"\",'Luminaire Schedule'!B156)","v":""},null,{"$f":"IF($B167=\"\",\"\",$C167*INDEX(Luminaire_Table,MATCH($B167,Luminaire_Types,0),3))","v":""},null,{"$f":"IF($B167=\"\",\"\",$E167*INDEX(Luminaire_Table,MATCH($B167,Luminaire_Types,0),3))","v":""},null,{"$f":"IF($B167=\"\",\"\",$G167*INDEX(Luminaire_Table,MATCH($B167,Luminaire_Types,0),3))","v":""},null,{"$f":"IF($B167=\"\",\"\",$I167*INDEX(Luminaire_Table,MATCH($B167,Luminaire_Types,0),3))","v":""},null,{"$f":"IF($B167=\"\",\"\",$K167*INDEX(Luminaire_Table,MATCH($B167,Luminaire_Types,0),3))","v":""}]
[null,{"$f":"IF('Luminaire Schedule'!B157=\"\",\"\",'Luminaire Schedule'!B157)","v":""},null,{"$f":"IF($B168=\"\",\"\",$C168*INDEX(Luminaire_Table,MATCH($B168,Luminaire_Types,0),3))","v":""},null,{"$f":"IF($B168=\"\",\"\",$E168*INDEX(Luminaire_Table,MATCH($B168,Luminaire_Types,0),3))","v":""},null,{"$f":"IF($B168=\"\",\"\",$G168*INDEX(Luminaire_Table,MATCH($B168,Luminaire_Types,0),3))","v":""},null,{"$f":"IF($B168=\"\",\"\",$I168*INDEX(Luminaire_Table,MATCH($B168,Luminaire_Types,0),3))","v":""},null,{"$f":"IF($B168=\"\",\"\",$K168*INDEX(Luminaire_Table,MATCH($B168,Luminaire_Types,0),3))","v":""}]

{"sheet":"Interior - Space-By-Space","index":4,"n_rows":56,"n_cols":55,"rows_kept":56,"cut":false,"hidden":false,"merged":[[12,44,12,45],[12,49,12,50],[0,2,0,12],[1,2,1,12],[5,2,5,5],[6,2,6,3],[7,2,7,3],[8,2,8,3],[9,2,9,3],[8,8,9,10],[8,12,9,12],[12,12,12,15]]}
[null,null,"New Construction Program"]
[null,null,"Lighting Calculator"]
[null,null,{"$f":"'Basic Lists'!A100","v":"NCP LC v.4.0"}]
[null,null,"Interior lighting calculator"]
[]
[null,null,"Interior totals"]
[null,null,"Demand savings",null,{"$f":"$AY$56","v":{"$error":"#N/A"}},"kW"]
[null,null,"Energy savings - LPD",null,{"$f":"$AZ$56","v":{"$error":"#N/A"}},"kWh"]
[null,null,"Energy savings - lighting controls",null,{"$f":"$BA$56","v":{"$error":"#N/A"}},"kWh",null,null,"Number of Luminaire Columns to Show:",null,null,null,4]
[null,null,"Energy savings - total",null,{"$f":"$BB$56","v":{"$error":"#N/A"}},"kWh"]
[]
[]
[null,null,"Space information",null,null,null,null,null,null,null,null,"hide","Lighting information",null,null,null,null,null,"hide",null,null,null,"hide",null,null,null,"hide",null,null,null,"hide",null,null,null,"hide",null,null,null,"hide",null,null,null,"hide",null,"Calculated values",null,null,null,null,"Savings info"]
[null,"Space","Area name","Number of identical areas","Space type",{"$f":"IF(ProjectUnits=\"Imperial\",\"RCR / corridor width (ft)\",\"RCR / corridor width (m)\")","v":"RCR / corridor width (m)"},"Meets RCR Threshold","Baseline LPD","Annual hours","Surface area","Local automated\nlighting control type","Lighting Controls Hour Reduction","Luminaire [type 1]","Quantity [type 1]","Total Quantity [Type 1]","W           [type 1]","Luminaire [type 2]","Quantity [type 2]","Total Quantity [Type 2]","W                     [type 2]","Luminaire [type 3]","Quantity [type 3]","Total Quantity [Type 3]","W                     [type 3]","Luminaire [type 4]","Quantity [type 4]","Total Quantity [Type 4]","W                     [type 4]","Luminaire [type 5]","Quantity [type 5]","Total Quantity [Type 5]","W                     [type 5]","Luminaire [type 6]","Quantity [type 6]","Total Quantity [Type 6]","W                     [type 6]","Luminaire [type 7]","Quantity [type 7]","Total Quantity [Type 7]","W                     [type 7]","Luminaire [type 8]","Quantity [type 8]","Total Quantity [Type 8]","W                     [type 8]","Design LPD","Baseline annual lighting energy","Design annual lighting energy","Baseline demand allowance","Design demand","LPD savings","Demand savings","Energy savings - LPD","Energy savings - controls","Energy savings - total","Meets Retail Allowance Check"]
[null,"#",null,"#",null,"Optional",null,{"$f":"IF(ProjectUnits=\"Imperial\",\"W/sqft\",\"W/sqm\")","v":"W/sqm"},"hrs",{"$f":"IF(ProjectUnits=\"Imperial\",\"sqft\",\"sqm\")","v":"sqm"},null,"%",null,"#","#","W",null,"#","#","W",null,"#","#","W",null,"#","#","W",null,"#","#","W",null,"#","#","W",null,"#","#","W",null,"#","#","W",{"$f":"IF(ProjectUnits=\"Imperial\",\"W/sqft\",\"W/sqm\")","v":"W/sqm"},"kWh","kWh","kW","kW",{"$f":"IF(ProjectUnits=\"Imperial\",\"W/sqft\",\"W/sqm\")","v":"W/sqm"},"kW","kWh","kWh","kWh"]
[null,{"$f":"ROW()-22","v":-6},"A384-guest rm",1,"Guest room",null,{"$f":"IF(OR(ISBLANK($E16),$D16=0),\"\",AND(NOT(ISBLANK($F16)),ProjectCode=ASHRAE,OR(AND(ISNUMBER(FIND(\"Corridor\",$E16)),$F16<INDEX(ASHRAE_InteriorTable,MATCH($E16,ASHRAE_InteriorSpaces,0),6)),AND(NOT(ISNUMBER(FIND(\"Corridor\",$E16))),$F16>INDEX(ASHRAE_InteriorTable,MATCH($E16,ASHRAE_InteriorSpaces,0),6)))))","v":false},{"$f":"IF(OR(ISBLANK($E16),$D16=0),\"\",IF(ProjectCode=NECB,INDEX(NECB_InteriorTable,MATCH($E16,NECB_InteriorSpaces,0),3),IF(ProjectCode=ASHRAE,INDEX(ASHRAE_InteriorTable,MATCH($E16,ASHRAE_InteriorSpaces,0),3)*IF($G16,1.2,1),0)))","v":0},{"$f":"IF(OR(ISBLANK($E16),$D16=0),\"\",IF(ProjectCode=NECB,INDEX(NECB_InteriorTable,MATCH($E16,NECB_InteriorSpaces,0),4),IF(ProjectCode=ASHRAE,INDEX(ASHRAE_InteriorTable,MATCH($E16,ASHRAE_InteriorSpaces,0),4),\"\")))","v":""},240,"OS+dimming (private/zoned)",{"$f":"IF(ISBLANK($K16),\"\",IF($E16=\"Parking Garage Area\",0,INDEX(Interior_ControlsTable,MATCH($K16,Interior_ControlsTypes,0),IF(ISNUMBER(MATCH($E16,OSRequired_Spaces,0)),3,2))))","v":0.1},"A1",4,{"$f":"IF(OR(ISBLANK($E16),$D16=0),\"\",N16*$D16)","v":4},{"$f":"IF(OR(ISBLANK($E16),$D16=0), \"\",IF(ISBLANK(M16),0,INDEX(Luminaire_Table,MATCH(M16,Luminaire_Types,0),3)))","v":{"$error":"#N/A"}},"A1",null,{"$f":"IF(OR(ISBLANK($E16),$D16=0),\"\",R16*$D16)","v":0},{"$f":"IF(OR(ISBLANK($E16),$D16=0), \"\",IF(ISBLANK(Q16),0,INDEX(Luminaire_Table,MATCH(Q16,Luminaire_Types,0),3)))","v":{"$error":"#N/A"}},"A1",null,{"$f":"IF(OR(ISBLANK($E16),$D16=0),\"\",V16*$D16)","v":0},{"$f":"IF(OR(ISBLANK($E16),$D16=0), \"\",IF(ISBLANK(U16),0,INDEX(Luminaire_Table,MATCH(U16,Luminaire_Types,0),3)))","v":{"$error":"#N/A"}},null,null,{"$f":"IF(OR(ISBLANK($E16),$D16=0),\"\",Z16*$D16)","v":0},{"$f":"IF(OR(ISBLANK($E16),$D16=0), \"\",IF(ISBLANK(Y16),0,INDEX(Luminaire_Table,MATCH(Y16,Luminaire_Types,0),3)))","v":0},null,null,{"$f":"IF(OR(ISBLANK($E16),$D16=0),\"\",AD16*$D16)","v":0},{"$f":"IF(OR(ISBLANK($E16),$D16=0), \"\",IF(ISBLANK(AC16),0,INDEX(Luminaire_Table,MATCH(AC16,Luminaire_Types,0),3)))","v":0},null,null,{"$f":"IF(OR(ISBLANK($E16),$D16=0),\"\",AH16*$D16)","v":0},{"$f":"IF(OR(ISBLANK($E16),$D16=0), \"\",IF(ISBLANK(AG16),0,INDEX(Luminaire_Table,MATCH(AG16,Luminaire_Types,0),3)))","v":0},null,null,{"$f":"IF(OR(ISBLANK($E16),$D16=0),\"\",AL16*$D16)","v":0},{"$f":"IF(OR(ISBLANK($E16),$D16=0), \"\",IF(ISBLANK(AK16),0,INDEX(Luminaire_Table,MATCH(AK16,Luminaire_Types,0),3)))","v":0},null,null,{"$f":"IF(OR(ISBLANK($E16),$D16=0),\"\",AP16*$D16)","v":0},{"$f":"IF(OR(ISBLANK($E16),$D16=0), \"\",IF(ISBLANK(AO16),0,INDEX(Luminaire_Table,MATCH(AO16,Luminaire_Types,0),3)))","v":0},{"$f":"IF(OR(ISBLANK($E16),$D16=0),\"\",AW16*1000/(J16*D16))","v":{"$error":"#N/A"}},{"$f":"IF(OR(ISBLANK($E16),$D16=0),\"\",AV16*I16)","v":{"$error":"#VALUE!"}},{"$f":"IF(OR(ISBLANK($E16),$D16=0),\"\",AW16*I16*(1-L16))","v":{"$error":"#N/A"}},{"$f":"IF(OR(ISBLANK($E16),$D16=0),\"\",D16*H16*J16/1000)","v":0},{"$f":"IF(OR(ISBLANK($E16),$D16=0),\"\",D16*(N16*P16+R16*T16+V16*X16+Z16*AB16+AD16*AF16+AH16*AJ16+AL16*AN16+AP16*AR16)/1000)","v":{"$error":"#N/A"}},{"$f":"IF(OR(ISBLANK($E16),$D16=0,$AW16=0),\"\",H16-AS16)","v":{"$error":"#N/A"}},{"$f":"IF(OR(ISBLANK($E16),$D16=0,$AW16=0),\"\",AV16-AW16)","v":{"$error":"#N/A"}},{"$f":"IF(OR(ISBLANK($E16),$D16=0,$AW16=0),\"\",AY16*I16)","v":{"$error":"#N/A"}},{"$f":"IF(OR(ISBLANK($E16),$D16=0,$AW16=0),\"\",AW16*I16*L16)","v":{"$error":"#N/A"}},{"$f":"IF(OR(ISBLANK($E16),$D16=0,$AW16=0),\"\",AT16-AU16)","v":{"$error":"#N/A"}},{"$f":"AND(OR($E16=\"Retail - Sales Area\",$E16=\"Sales Area\"),$D16>0,$J16>0)","v":false}]
[null,{"$f":"ROW()-22","v":-5},null,null,null,null,{"$f":"IF(OR(ISBLANK($E17),$D17=0),\"\",AND(NOT(ISBLANK($F17)),ProjectCode=ASHRAE,OR(AND(ISNUMBER(FIND(\"Corridor\",$E17)),$F17<INDEX(ASHRAE_InteriorTable,MATCH($E17,ASHRAE_InteriorSpaces,0),6)),AND(NOT(ISNUMBER(FIND(\"Corridor\",$E17))),$F17>INDEX(ASHRAE_InteriorTable,MATCH($E17,ASHRAE_InteriorSpaces,0),6)))))","v":""},"","",null,null,"",null,null,{"$f":"IF(OR(ISBLANK($E17),$D17=0),\"\",N17*$D17)","v":""},{"$f":"IF(OR(ISBLANK($E17),$D17=0), \"\",IF(ISBLANK(M17),0,INDEX(Luminaire_Table,MATCH(M17,Luminaire_Types,0),3)))","v":""},null,null,{"$f":"IF(OR(ISBLANK($E17),$D17=0),\"\",R17*$D17)","v":""},{"$f":"IF(OR(ISBLANK($E17),$D17=0), \"\",IF(ISBLANK(Q17),0,INDEX(Luminaire_Table,MATCH(Q17,Luminaire_Types,0),3)))","v":""},null,null,{"$f":"IF(OR(ISBLANK($E17),$D17=0),\"\",V17*$D17)","v":""},{"$f":"IF(OR(ISBLANK($E17),$D17=0), \"\",IF(ISBLANK(U17),0,INDEX(Luminaire_Table,MATCH(U17,Luminaire_Types,0),3)))","v":""},null,null,{"$f":"IF(OR(ISBLANK($E17),$D17=0),\"\",Z17*$D17)","v":""},{"$f":"IF(OR(ISBLANK($E17),$D17=0), \"\",IF(ISBLANK(Y17),0,INDEX(Luminaire_Table,MATCH(Y17,Luminaire_Types,0),3)))","v":""},null,null,{"$f":"IF(OR(ISBLANK($E17),$D17=0),\"\",AD17*$D17)","v":""},{"$f":"IF(OR(ISBLANK($E17),$D17=0), \"\",IF(ISBLANK(AC17),0,INDEX(Luminaire_Table,MATCH(AC17,Luminaire_Types,0),3)))","v":""},null,null,{"$f":"IF(OR(ISBLANK($E17),$D17=0),\"\",AH17*$D17)","v":""},{"$f":"IF(OR(ISBLANK($E17),$D17=0), \"\",IF(ISBLANK(AG17),0,INDEX(Luminaire_Table,MATCH(AG17,Luminaire_Types,0),3)))","v":""},null,null,{"$f":"IF(OR(ISBLANK($E17),$D17=0),\"\",AL17*$D17)","v":""},{"$f":"IF(OR(ISBLANK($E17),$D17=0), \"\",IF(ISBLANK(AK17),0,INDEX(Luminaire_Table,MATCH(AK17,Luminaire_Types,0),3)))","v":""},null,null,{"$f":"IF(OR(ISBLANK($E17),$D17=0),\"\",AP17*$D17)","v":""},{"$f":"IF(OR(ISBLANK($E17),$D17=0), \"\",IF(ISBLANK(AO17),0,INDEX(Luminaire_Table,MATCH(AO17,Luminaire_Types,0),3)))","v":""},{"$f":"IF(OR(ISBLANK($E17),$D17=0),\"\",AW17*1000/(J17*D17))","v":""},{"$f":"IF(OR(ISBLANK($E17),$D17=0),\"\",AV17*I17)","v":""},{"$f":"IF(OR(ISBLANK($E17),$D17=0),\"\",AW17*I17*(1-L17))","v":""},{"$f":"IF(OR(ISBLANK($E17),$D17=0),\"\",D17*H17*J17/1000)","v":""},{"$f":"IF(OR(ISBLANK($E17),$D17=0),\"\",D17*(N17*P17+R17*T17+V17*X17+Z17*AB17+AD17*AF17+AH17*AJ17+AL17*AN17+AP17*AR17)/1000)","v":""},{"$f":"IF(OR(ISBLANK($E17),$D17=0,$AW17=0),\"\",H17-AS17)","v":""},{"$f":"IF(OR(ISBLANK($E17),$D17=0,$AW17=0),\"\",AV17-AW17)","v":""},{"$f":"IF(OR(ISBLANK($E17),$D17=0,$AW17=0),\"\",AY17*I17)","v":""},{"$f":"IF(OR(ISBLANK($E17),$D17=0,$AW17=0),\"\",AW17*I17*L17)","v":""},{"$f":"IF(OR(ISBLANK($E17),$D17=0,$AW17=0),\"\",AT17-AU17)","v":""},{"$f":"AND(OR($E17=\"Retail - Sales Area\",$E17=\"Sales Area\"),$D17>0,$J17>0)","v":false}]
[null,{"$f":"ROW()-22","v":-4},null,null,null,null,{"$f":"IF(ISBLANK($E18),\"\",AND(NOT(ISBLANK($F18)),ProjectCode=ASHRAE,OR(AND(ISNUMBER(FIND(\"Corridor\",$E18)),$F18<INDEX(ASHRAE_InteriorTable,MATCH($E18,ASHRAE_InteriorSpaces,0),6)),AND(NOT(ISNUMBER(FIND(\"Corridor\",$E18))),$F18>INDEX(ASHRAE_InteriorTable,MATCH($E18,ASHRAE_InteriorSpaces,0),6)))))","v":""},"","",null,null,"",null,null,{"$f":"IF(ISBLANK($E18),\"\",N18*$D18)","v":""},{"$f":"IF(OR(ISBLANK($E18),$D18=0), \"\",IF(ISBLANK(M18),0,INDEX(Luminaire_Table,MATCH(M18,Luminaire_Types,0),3)))","v":""},null,null,{"$f":"IF(ISBLANK($E18),\"\",R18*$D18)","v":""},{"$f":"IF(OR(ISBLANK($E18),$D18=0), \"\",IF(ISBLANK(Q18),0,INDEX(Luminaire_Table,MATCH(Q18,Luminaire_Types,0),3)))","v":""},null,null,{"$f":"IF(ISBLANK($E18),\"\",V18*$D18)","v":""},{"$f":"IF(OR(ISBLANK($E18),$D18=0), \"\",IF(ISBLANK(U18),0,INDEX(Luminaire_Table,MATCH(U18,Luminaire_Types,0),3)))","v":""},null,null,{"$f":"IF(ISBLANK($E18),\"\",Z18*$D18)","v":""},{"$f":"IF(OR(ISBLANK($E18),$D18=0), \"\",IF(ISBLANK(Y18),0,INDEX(Luminaire_Table,MATCH(Y18,Luminaire_Types,0),3)))","v":""},null,null,{"$f":"IF(ISBLANK($E18),\"\",AD18*$D18)","v":""},{"$f":"IF(OR(ISBLANK($E18),$D18=0), \"\",IF(ISBLANK(AC18),0,INDEX(Luminaire_Table,MATCH(AC18,Luminaire_Types,0),3)))","v":""},null,null,{"$f":"IF(ISBLANK($E18),\"\",AH18*$D18)","v":""},{"$f":"IF(OR(ISBLANK($E18),$D18=0), \"\",IF(ISBLANK(AG18),0,INDEX(Luminaire_Table,MATCH(AG18,Luminaire_Types,0),3)))","v":""},null,null,{"$f":"IF(ISBLANK($E18),\"\",AL18*$D18)","v":""},{"$f":"IF(OR(ISBLANK($E18),$D18=0), \"\",IF(ISBLANK(AK18),0,INDEX(Luminaire_Table,MATCH(AK18,Luminaire_Types,0),3)))","v":""},null,null,{"$f":"IF(ISBLANK($E18),\"\",AP18*$D18)","v":""},{"$f":"IF(OR(ISBLANK($E18),$D18=0), \"\",IF(ISBLANK(AO18),0,INDEX(Luminaire_Table,MATCH(AO18,Luminaire_Types,0),3)))","v":""},"","","","","","","","","","",{"$f":"AND(OR($E18=\"Retail - Sales Area\",$E18=\"Sales Area\"),$D18>0,$J18>0)","v":false}]
[null,-3,null,null,null,null,"","","",null,null,"",null,null,{"$f":"IF(ISBLANK($E19),\"\",N19*$D19)","v":""},{"$f":"IF(OR(ISBLANK($E19),$D19=0), \"\",IF(ISBLANK(M19),0,INDEX(Luminaire_Table,MATCH(M19,Luminaire_Types,0),3)))","v":""},null,null,{"$f":"IF(ISBLANK($E19),\"\",R19*$D19)","v":""},{"$f":"IF(OR(ISBLANK($E19),$D19=0), \"\",IF(ISBLANK(Q19),0,INDEX(Luminaire_Table,MATCH(Q19,Luminaire_Types,0),3)))","v":""},null,null,{"$f":"IF(ISBLANK($E19),\"\",V19*$D19)","v":""},{"$f":"IF(OR(ISBLANK($E19),$D19=0), \"\",IF(ISBLANK(U19),0,INDEX(Luminaire_Table,MATCH(U19,Luminaire_Types,0),3)))","v":""},null,null,{"$f":"IF(ISBLANK($E19),\"\",Z19*$D19)","v":""},{"$f":"IF(OR(ISBLANK($E19),$D19=0), \"\",IF(ISBLANK(Y19),0,INDEX(Luminaire_Table,MATCH(Y19,Luminaire_Types,0),3)))","v":""},null,null,{"$f":"IF(ISBLANK($E19),\"\",AD19*$D19)","v":""},{"$f":"IF(OR(ISBLANK($E19),$D19=0), \"\",IF(ISBLANK(AC19),0,INDEX(Luminaire_Table,MATCH(AC19,Luminaire_Types,0),3)))","v":""},null,null,{"$f":"IF(ISBLANK($E19),\"\",AH19*$D19)","v":""},{"$f":"IF(OR(ISBLANK($E19),$D19=0), \"\",IF(ISBLANK(AG19),0,INDEX(Luminaire_Table,MATCH(AG19,Luminaire_Types,0),3)))","v":""},null,null,{"$f":"IF(ISBLANK($E19),\"\",AL19*$D19)","v":""},{"$f":"IF(OR(ISBLANK($E19),$D19=0), \"\",IF(ISBLANK(AK19),0,INDEX(Luminaire_Table,MATCH(AK19,Luminaire_Types,0),3)))","v":""},null,null,{"$f":"IF(ISBLANK($E19),\"\",AP19*$D19)","v":""},{"$f":"IF(OR(ISBLANK($E19),$D19=0), \"\",IF(ISBLANK(AO19),0,INDEX(Luminaire_Table,MATCH(AO19,Luminaire_Types,0),3)))","v":""},"","","","","","","","","","",false]
[null,-2,null,null,null,null,"","","",null,null,"",null,null,"",{"$f":"IF(OR(ISBLANK($E20),$D20=0), \"\",IF(ISBLANK(M20),0,INDEX(Luminaire_Table,MATCH(M20,Luminaire_Types,0),3)))","v":""},null,null,"",{"$f":"IF(OR(ISBLANK($E20),$D20=0), \"\",IF(ISBLANK(Q20),0,INDEX(Luminaire_Table,MATCH(Q20,Luminaire_Types,0),3)))","v":""},null,null,"",{"$f":"IF(OR(ISBLANK($E20),$D20=0), \"\",IF(ISBLANK(U20),0,INDEX(Luminaire_Table,MATCH(U20,Luminaire_Types,0),3)))","v":""},null,null,"",{"$f":"IF(OR(ISBLANK($E20),$D20=0), \"\",IF(ISBLANK(Y20),0,INDEX(Luminaire_Table,MATCH(Y20,Luminaire_Types,0),3)))","v":""},null,null,"",{"$f":"IF(OR(ISBLANK($E20),$D20=0), \"\",IF(ISBLANK(AC20),0,INDEX(Luminaire_Table,MATCH(AC20,Luminaire_Types,0),3)))","v":""},null,null,"",{"$f":"IF(OR(ISBLANK($E20),$D20=0), \"\",IF(ISBLANK(AG20),0,INDEX(Luminaire_Table,MATCH(AG20,Luminaire_Types,0),3)))","v":""},null,null,"",{"$f":"IF(OR(ISBLANK($E20),$D20=0), \"\",IF(ISBLANK(AK20),0,INDEX(Luminaire_Table,MATCH(AK20,Luminaire_Types,0),3)))","v":""},null,null,"",{"$f":"IF(OR(ISBLANK($E20),$D20=0), \"\",IF(ISBLANK(AO20),0,INDEX(Luminaire_Table,MATCH(AO20,Luminaire_Types,0),3)))","v":""},"","","","","","","","","","",false]
[null,-1,null,null,null,null,"","","",null,null,"",null,null,"",{"$f":"IF(OR(ISBLANK($E21),$D21=0), \"\",IF(ISBLANK(M21),0,INDEX(Luminaire_Table,MATCH(M21,Luminaire_Types,0),3)))","v":""},null,null,"",{"$f":"IF(OR(ISBLANK($E21),$D21=0), \"\",IF(ISBLANK(Q21),0,INDEX(Luminaire_Table,MATCH(Q21,Luminaire_Types,0),3)))","v":""},null,null,"",{"$f":"IF(OR(ISBLANK($E21),$D21=0), \"\",IF(ISBLANK(U21),0,INDEX(Luminaire_Table,MATCH(U21,Luminaire_Types,0),3)))","v":""},null,null,"",{"$f":"IF(OR(ISBLANK($E21),$D21=0), \"\",IF(ISBLANK(Y21),0,INDEX(Luminaire_Table,MATCH(Y21,Luminaire_Types,0),3)))","v":""},null,null,"",{"$f":"IF(OR(ISBLANK($E21),$D21=0), \"\",IF(ISBLANK(AC21),0,INDEX(Luminaire_Table,MATCH(AC21,Luminaire_Types,0),3)))","v":""},null,null,"",{"$f":"IF(OR(ISBLANK($E21),$D21=0), \"\",IF(ISBLANK(AG21),0,INDEX(Luminaire_Table,MATCH(AG21,Luminaire_Types,0),3)))","v":""},null,null,"",{"$f":"IF(OR(ISBLANK($E21),$D21=0), \"\",IF(ISBLANK(AK21),0,INDEX(Luminaire_Table,MATCH(AK21,Luminaire_Types,0),3)))","v":""},null,null,"",{"$f":"IF(OR(ISBLANK($E21),$D21=0), \"\",IF(ISBLANK(AO21),0,INDEX(Luminaire_Table,MATCH(AO21,Luminaire_Types,0),3)))","v":""},"","","","","","","","","","",false]
[null,0,null,null,null,null,"","","",null,null,"",null,null,"",{"$f":"IF(OR(ISBLANK($E22),$D22=0), \"\",IF(ISBLANK(M22),0,INDEX(Luminaire_Table,MATCH(M22,Luminaire_Types,0),3)))","v":""},null,null,"",{"$f":"IF(OR(ISBLANK($E22),$D22=0), \"\",IF(ISBLANK(Q22),0,INDEX(Luminaire_Table,MATCH(Q22,Luminaire_Types,0),3)))","v":""},null,null,"",{"$f":"IF(OR(ISBLANK($E22),$D22=0), \"\",IF(ISBLANK(U22),0,INDEX(Luminaire_Table,MATCH(U22,Luminaire_Types,0),3)))","v":""},null,null,"",{"$f":"IF(OR(ISBLANK($E22),$D22=0), \"\",IF(ISBLANK(Y22),0,INDEX(Luminaire_Table,MATCH(Y22,Luminaire_Types,0),3)))","v":""},null,null,"",{"$f":"IF(OR(ISBLANK($E22),$D22=0), \"\",IF(ISBLANK(AC22),0,INDEX(Luminaire_Table,MATCH(AC22,Luminaire_Types,0),3)))","v":""},null,null,"",{"$f":"IF(OR(ISBLANK($E22),$D22=0), \"\",IF(ISBLANK(AG22),0,INDEX(Luminaire_Table,MATCH(AG22,Luminaire_Types,0),3)))","v":""},null,null,"",{"$f":"IF(OR(ISBLANK($E22),$D22=0), \"\",IF(ISBLANK(AK22),0,INDEX(Luminaire_Table,MATCH(AK22,Luminaire_Types,0),3)))","v":""},null,null,"",{"$f":"IF(OR(ISBLANK($E22),$D22=0), \"\",IF(ISBLANK(AO22),0,INDEX(Luminaire_Table,MATCH(AO22,Luminaire_Types,0),3)))","v":""},"","","","","","","","","","",false]
[null,1,null,null,null,null,"","","",null,null,"",null,null,"",{"$f":"IF(OR(ISBLANK($E23),$D23=0), \"\",IF(ISBLANK(M23),0,INDEX(Luminaire_Table,MATCH(M23,Luminaire_Types,0),3)))","v":""},null,null,"",{"$f":"IF(OR(ISBLANK($E23),$D23=0), \"\",IF(ISBLANK(Q23),0,INDEX(Luminaire_Table,MATCH(Q23,Luminaire_Types,0),3)))","v":""},null,null,"",{"$f":"IF(OR(ISBLANK($E23),$D23=0), \"\",IF(ISBLANK(U23),0,INDEX(Luminaire_Table,MATCH(U23,Luminaire_Types,0),3)))","v":""},null,null,"",{"$f":"IF(OR(ISBLANK($E23),$D23=0), \"\",IF(ISBLANK(Y23),0,INDEX(Luminaire_Table,MATCH(Y23,Luminaire_Types,0),3)))","v":""},null,null,"",{"$f":"IF(OR(ISBLANK($E23),$D23=0), \"\",IF(ISBLANK(AC23),0,INDEX(Luminaire_Table,MATCH(AC23,Luminaire_Types,0),3)))","v":""},null,null,"",{"$f":"IF(OR(ISBLANK($E23),$D23=0), \"\",IF(ISBLANK(AG23),0,INDEX(Luminaire_Table,MATCH(AG23,Luminaire_Types,0),3)))","v":""},null,null,"",{"$f":"IF(OR(ISBLANK($E23),$D23=0), \"\",IF(ISBLANK(AK23),0,INDEX(Luminaire_Table,MATCH(AK23,Luminaire_Types,0),3)))","v":""},null,null,"",{"$f":"IF(OR(ISBLANK($E23),$D23=0), \"\",IF(ISBLANK(AO23),0,INDEX(Luminaire_Table,MATCH(AO23,Luminaire_Types,0),3)))","v":""},"","","","","","","","","","",false]
[null,2,null,null,null,null,"","","",null,null,"",null,null,{"$f":"IF(ISBLANK($E24),\"\",N24*$D24)","v":""},{"$f":"IF(OR(ISBLANK($E24),$D24=0), \"\",IF(ISBLANK(M24),0,INDEX(Luminaire_Table,MATCH(M24,Luminaire_Types,0),3)))","v":""},null,null,{"$f":"IF(ISBLANK($E24),\"\",R24*$D24)","v":""},{"$f":"IF(OR(ISBLANK($E24),$D24=0), \"\",IF(ISBLANK(Q24),0,INDEX(Luminaire_Table,MATCH(Q24,Luminaire_Types,0),3)))","v":""},null,null,{"$f":"IF(ISBLANK($E24),\"\",V24*$D24)","v":""},{"$f":"IF(OR(ISBLANK($E24),$D24=0), \"\",IF(ISBLANK(U24),0,INDEX(Luminaire_Table,MATCH(U24,Luminaire_Types,0),3)))","v":""},null,null,{"$f":"IF(ISBLANK($E24),\"\",Z24*$D24)","v":""},{"$f":"IF(OR(ISBLANK($E24),$D24=0), \"\",IF(ISBLANK(Y24),0,INDEX(Luminaire_Table,MATCH(Y24,Luminaire_Types,0),3)))","v":""},null,null,{"$f":"IF(ISBLANK($E24),\"\",AD24*$D24)","v":""},{"$f":"IF(OR(ISBLANK($E24),$D24=0), \"\",IF(ISBLANK(AC24),0,INDEX(Luminaire_Table,MATCH(AC24,Luminaire_Types,0),3)))","v":""},null,null,{"$f":"IF(ISBLANK($E24),\"\",AH24*$D24)","v":""},{"$f":"IF(OR(ISBLANK($E24),$D24=0), \"\",IF(ISBLANK(AG24),0,INDEX(Luminaire_Table,MATCH(AG24,Luminaire_Types,0),3)))","v":""},null,null,{"$f":"IF(ISBLANK($E24),\"\",AL24*$D24)","v":""},{"$f":"IF(OR(ISBLANK($E24),$D24=0), \"\",IF(ISBLANK(AK24),0,INDEX(Luminaire_Table,MATCH(AK24,Luminaire_Types,0),3)))","v":""},null,null,{"$f":"IF(ISBLANK($E24),\"\",AP24*$D24)","v":""},{"$f":"IF(OR(ISBLANK($E24),$D24=0), \"\",IF(ISBLANK(AO24),0,INDEX(Luminaire_Table,MATCH(AO24,Luminaire_Types,0),3)))","v":""},"","","","","","","","","","",false]
[null,3,null,null,null,null,"","","",null,null,"",null,null,{"$f":"IF(ISBLANK($E25),\"\",N25*$D25)","v":""},{"$f":"IF(OR(ISBLANK($E25),$D25=0), \"\",IF(ISBLANK(M25),0,INDEX(Luminaire_Table,MATCH(M25,Luminaire_Types,0),3)))","v":""},null,null,{"$f":"IF(ISBLANK($E25),\"\",R25*$D25)","v":""},{"$f":"IF(OR(ISBLANK($E25),$D25=0), \"\",IF(ISBLANK(Q25),0,INDEX(Luminaire_Table,MATCH(Q25,Luminaire_Types,0),3)))","v":""},null,null,{"$f":"IF(ISBLANK($E25),\"\",V25*$D25)","v":""},{"$f":"IF(OR(ISBLANK($E25),$D25=0), \"\",IF(ISBLANK(U25),0,INDEX(Luminaire_Table,MATCH(U25,Luminaire_Types,0),3)))","v":""},null,null,{"$f":"IF(ISBLANK($E25),\"\",Z25*$D25)","v":""},{"$f":"IF(OR(ISBLANK($E25),$D25=0), \"\",IF(ISBLANK(Y25),0,INDEX(Luminaire_Table,MATCH(Y25,Luminaire_Types,0),3)))","v":""},null,null,{"$f":"IF(ISBLANK($E25),\"\",AD25*$D25)","v":""},{"$f":"IF(OR(ISBLANK($E25),$D25=0), \"\",IF(ISBLANK(AC25),0,INDEX(Luminaire_Table,MATCH(AC25,Luminaire_Types,0),3)))","v":""},null,null,{"$f":"IF(ISBLANK($E25),\"\",AH25*$D25)","v":""},{"$f":"IF(OR(ISBLANK($E25),$D25=0), \"\",IF(ISBLANK(AG25),0,INDEX(Luminaire_Table,MATCH(AG25,Luminaire_Types,0),3)))","v":""},null,null,{"$f":"IF(ISBLANK($E25),\"\",AL25*$D25)","v":""},{"$f":"IF(OR(ISBLANK($E25),$D25=0), \"\",IF(ISBLANK(AK25),0,INDEX(Luminaire_Table,MATCH(AK25,Luminaire_Types,0),3)))","v":""},null,null,{"$f":"IF(ISBLANK($E25),\"\",AP25*$D25)","v":""},{"$f":"IF(OR(ISBLANK($E25),$D25=0), \"\",IF(ISBLANK(AO25),0,INDEX(Luminaire_Table,MATCH(AO25,Luminaire_Types,0),3)))","v":""},"","","","","","","","","","",false]
[null,4,null,null,null,null,"","","",null,null,"",null,null,"",{"$f":"IF(OR(ISBLANK($E26),$D26=0), \"\",IF(ISBLANK(M26),0,INDEX(Luminaire_Table,MATCH(M26,Luminaire_Types,0),3)))","v":""},null,null,"",{"$f":"IF(OR(ISBLANK($E26),$D26=0), \"\",IF(ISBLANK(Q26),0,INDEX(Luminaire_Table,MATCH(Q26,Luminaire_Types,0),3)))","v":""},null,null,"",{"$f":"IF(OR(ISBLANK($E26),$D26=0), \"\",IF(ISBLANK(U26),0,INDEX(Luminaire_Table,MATCH(U26,Luminaire_Types,0),3)))","v":""},null,null,"",{"$f":"IF(OR(ISBLANK($E26),$D26=0), \"\",IF(ISBLANK(Y26),0,INDEX(Luminaire_Table,MATCH(Y26,Luminaire_Types,0),3)))","v":""},null,null,"",{"$f":"IF(OR(ISBLANK($E26),$D26=0), \"\",IF(ISBLANK(AC26),0,INDEX(Luminaire_Table,MATCH(AC26,Luminaire_Types,0),3)))","v":""},null,null,"",{"$f":"IF(OR(ISBLANK($E26),$D26=0), \"\",IF(ISBLANK(AG26),0,INDEX(Luminaire_Table,MATCH(AG26,Luminaire_Types,0),3)))","v":""},null,null,"",{"$f":"IF(OR(ISBLANK($E26),$D26=0), \"\",IF(ISBLANK(AK26),0,INDEX(Luminaire_Table,MATCH(AK26,Luminaire_Types,0),3)))","v":""},null,null,"",{"$f":"IF(OR(ISBLANK($E26),$D26=0), \"\",IF(ISBLANK(AO26),0,INDEX(Luminaire_Table,MATCH(AO26,Luminaire_Types,0),3)))","v":""},"","","","","","","","","","",false]
[null,5,null,null,null,null,"","","",null,null,"",null,null,"",{"$f":"IF(OR(ISBLANK($E27),$D27=0), \"\",IF(ISBLANK(M27),0,INDEX(Luminaire_Table,MATCH(M27,Luminaire_Types,0),3)))","v":""},null,null,"",{"$f":"IF(OR(ISBLANK($E27),$D27=0), \"\",IF(ISBLANK(Q27),0,INDEX(Luminaire_Table,MATCH(Q27,Luminaire_Types,0),3)))","v":""},null,null,"",{"$f":"IF(OR(ISBLANK($E27),$D27=0), \"\",IF(ISBLANK(U27),0,INDEX(Luminaire_Table,MATCH(U27,Luminaire_Types,0),3)))","v":""},null,null,"",{"$f":"IF(OR(ISBLANK($E27),$D27=0), \"\",IF(ISBLANK(Y27),0,INDEX(Luminaire_Table,MATCH(Y27,Luminaire_Types,0),3)))","v":""},null,null,"",{"$f":"IF(OR(ISBLANK($E27),$D27=0), \"\",IF(ISBLANK(AC27),0,INDEX(Luminaire_Table,MATCH(AC27,Luminaire_Types,0),3)))","v":""},null,null,"",{"$f":"IF(OR(ISBLANK($E27),$D27=0), \"\",IF(ISBLANK(AG27),0,INDEX(Luminaire_Table,MATCH(AG27,Luminaire_Types,0),3)))","v":""},null,null,"",{"$f":"IF(OR(ISBLANK($E27),$D27=0), \"\",IF(ISBLANK(AK27),0,INDEX(Luminaire_Table,MATCH(AK27,Luminaire_Types,0),3)))","v":""},null,null,"",{"$f":"IF(OR(ISBLANK($E27),$D27=0), \"\",IF(ISBLANK(AO27),0,INDEX(Luminaire_Table,MATCH(AO27,Luminaire_Types,0),3)))","v":""},"","","","","","","","","","",false]
[null,6,null,null,null,null,"","","",null,null,"",null,null,"",{"$f":"IF(OR(ISBLANK($E28),$D28=0), \"\",IF(ISBLANK(M28),0,INDEX(Luminaire_Table,MATCH(M28,Luminaire_Types,0),3)))","v":""},null,null,"",{"$f":"IF(OR(ISBLANK($E28),$D28=0), \"\",IF(ISBLANK(Q28),0,INDEX(Luminaire_Table,MATCH(Q28,Luminaire_Types,0),3)))","v":""},null,null,"",{"$f":"IF(OR(ISBLANK($E28),$D28=0), \"\",IF(ISBLANK(U28),0,INDEX(Luminaire_Table,MATCH(U28,Luminaire_Types,0),3)))","v":""},null,null,"",{"$f":"IF(OR(ISBLANK($E28),$D28=0), \"\",IF(ISBLANK(Y28),0,INDEX(Luminaire_Table,MATCH(Y28,Luminaire_Types,0),3)))","v":""},null,null,"",{"$f":"IF(OR(ISBLANK($E28),$D28=0), \"\",IF(ISBLANK(AC28),0,INDEX(Luminaire_Table,MATCH(AC28,Luminaire_Types,0),3)))","v":""},null,null,"",{"$f":"IF(OR(ISBLANK($E28),$D28=0), \"\",IF(ISBLANK(AG28),0,INDEX(Luminaire_Table,MATCH(AG28,Luminaire_Types,0),3)))","v":""},null,null,"",{"$f":"IF(OR(ISBLANK($E28),$D28=0), \"\",IF(ISBLANK(AK28),0,INDEX(Luminaire_Table,MATCH(AK28,Luminaire_Types,0),3)))","v":""},null,null,"",{"$f":"IF(OR(ISBLANK($E28),$D28=0), \"\",IF(ISBLANK(AO28),0,INDEX(Luminaire_Table,MATCH(AO28,Luminaire_Types,0),3)))","v":""},"","","","","","","","","","",false]
[null,7,null,null,null,null,"","","",null,null,"",null,null,{"$f":"IF(ISBLANK($E29),\"\",N29*$D29)","v":""},{"$f":"IF(OR(ISBLANK($E29),$D29=0), \"\",IF(ISBLANK(M29),0,INDEX(Luminaire_Table,MATCH(M29,Luminaire_Types,0),3)))","v":""},null,null,{"$f":"IF(ISBLANK($E29),\"\",R29*$D29)","v":""},{"$f":"IF(OR(ISBLANK($E29),$D29=0), \"\",IF(ISBLANK(Q29),0,INDEX(Luminaire_Table,MATCH(Q29,Luminaire_Types,0),3)))","v":""},null,null,{"$f":"IF(ISBLANK($E29),\"\",V29*$D29)","v":""},{"$f":"IF(OR(ISBLANK($E29),$D29=0), \"\",IF(ISBLANK(U29),0,INDEX(Luminaire_Table,MATCH(U29,Luminaire_Types,0),3)))","v":""},null,null,{"$f":"IF(ISBLANK($E29),\"\",Z29*$D29)","v":""},{"$f":"IF(OR(ISBLANK($E29),$D29=0), \"\",IF(ISBLANK(Y29),0,INDEX(Luminaire_Table,MATCH(Y29,Luminaire_Types,0),3)))","v":""},null,null,{"$f":"IF(ISBLANK($E29),\"\",AD29*$D29)","v":""},{"$f":"IF(OR(ISBLANK($E29),$D29=0), \"\",IF(ISBLANK(AC29),0,INDEX(Luminaire_Table,MATCH(AC29,Luminaire_Types,0),3)))","v":""},null,null,{"$f":"IF(ISBLANK($E29),\"\",AH29*$D29)","v":""},{"$f":"IF(OR(ISBLANK($E29),$D29=0), \"\",IF(ISBLANK(AG29),0,INDEX(Luminaire_Table,MATCH(AG29,Luminaire_Types,0),3)))","v":""},null,null,{"$f":"IF(ISBLANK($E29),\"\",AL29*$D29)","v":""},{"$f":"IF(OR(ISBLANK($E29),$D29=0), \"\",IF(ISBLANK(AK29),0,INDEX(Luminaire_Table,MATCH(AK29,Luminaire_Types,0),3)))","v":""},null,null,{"$f":"IF(ISBLANK($E29),\"\",AP29*$D29)","v":""},{"$f":"IF(OR(ISBLANK($E29),$D29=0), \"\",IF(ISBLANK(AO29),0,INDEX(Luminaire_Table,MATCH(AO29,Luminaire_Types,0),3)))","v":""},"","","","","","","","","","",false]
[null,8,null,null,null,null,"","","",null,null,"",null,null,"",{"$f":"IF(OR(ISBLANK($E30),$D30=0), \"\",IF(ISBLANK(M30),0,INDEX(Luminaire_Table,MATCH(M30,Luminaire_Types,0),3)))","v":""},null,null,"",{"$f":"IF(OR(ISBLANK($E30),$D30=0), \"\",IF(ISBLANK(Q30),0,INDEX(Luminaire_Table,MATCH(Q30,Luminaire_Types,0),3)))","v":""},null,null,"",{"$f":"IF(OR(ISBLANK($E30),$D30=0), \"\",IF(ISBLANK(U30),0,INDEX(Luminaire_Table,MATCH(U30,Luminaire_Types,0),3)))","v":""},null,null,"",{"$f":"IF(OR(ISBLANK($E30),$D30=0), \"\",IF(ISBLANK(Y30),0,INDEX(Luminaire_Table,MATCH(Y30,Luminaire_Types,0),3)))","v":""},null,null,"",{"$f":"IF(OR(ISBLANK($E30),$D30=0), \"\",IF(ISBLANK(AC30),0,INDEX(Luminaire_Table,MATCH(AC30,Luminaire_Types,0),3)))","v":""},null,null,"",{"$f":"IF(OR(ISBLANK($E30),$D30=0), \"\",IF(ISBLANK(AG30),0,INDEX(Luminaire_Table,MATCH(AG30,Luminaire_Types,0),3)))","v":""},null,null,"",{"$f":"IF(OR(ISBLANK($E30),$D30=0), \"\",IF(ISBLANK(AK30),0,INDEX(Luminaire_Table,MATCH(AK30,Luminaire_Types,0),3)))","v":""},null,null,"",{"$f":"IF(OR(ISBLANK($E30),$D30=0), \"\",IF(ISBLANK(AO30),0,INDEX(Luminaire_Table,MATCH(AO30,Luminaire_Types,0),3)))","v":""},"","","","","","","","","","",false]
[null,9,null,null,null,null,"","","",null,null,"",null,null,"",{"$f":"IF(OR(ISBLANK($E31),$D31=0), \"\",IF(ISBLANK(M31),0,INDEX(Luminaire_Table,MATCH(M31,Luminaire_Types,0),3)))","v":""},null,null,"",{"$f":"IF(OR(ISBLANK($E31),$D31=0), \"\",IF(ISBLANK(Q31),0,INDEX(Luminaire_Table,MATCH(Q31,Luminaire_Types,0),3)))","v":""},null,null,"",{"$f":"IF(OR(ISBLANK($E31),$D31=0), \"\",IF(ISBLANK(U31),0,INDEX(Luminaire_Table,MATCH(U31,Luminaire_Types,0),3)))","v":""},null,null,"",{"$f":"IF(OR(ISBLANK($E31),$D31=0), \"\",IF(ISBLANK(Y31),0,INDEX(Luminaire_Table,MATCH(Y31,Luminaire_Types,0),3)))","v":""},null,null,"",{"$f":"IF(OR(ISBLANK($E31),$D31=0), \"\",IF(ISBLANK(AC31),0,INDEX(Luminaire_Table,MATCH(AC31,Luminaire_Types,0),3)))","v":""},null,null,"",{"$f":"IF(OR(ISBLANK($E31),$D31=0), \"\",IF(ISBLANK(AG31),0,INDEX(Luminaire_Table,MATCH(AG31,Luminaire_Types,0),3)))","v":""},null,null,"",{"$f":"IF(OR(ISBLANK($E31),$D31=0), \"\",IF(ISBLANK(AK31),0,INDEX(Luminaire_Table,MATCH(AK31,Luminaire_Types,0),3)))","v":""},null,null,"",{"$f":"IF(OR(ISBLANK($E31),$D31=0), \"\",IF(ISBLANK(AO31),0,INDEX(Luminaire_Table,MATCH(AO31,Luminaire_Types,0),3)))","v":""},"","","","","","","","","","",false]
[null,10,null,null,null,null,"","","",null,null,"",null,null,{"$f":"IF(ISBLANK($E32),\"\",N32*$D32)","v":""},{"$f":"IF(OR(ISBLANK($E32),$D32=0), \"\",IF(ISBLANK(M32),0,INDEX(Luminaire_Table,MATCH(M32,Luminaire_Types,0),3)))","v":""},null,null,{"$f":"IF(ISBLANK($E32),\"\",R32*$D32)","v":""},{"$f":"IF(OR(ISBLANK($E32),$D32=0), \"\",IF(ISBLANK(Q32),0,INDEX(Luminaire_Table,MATCH(Q32,Luminaire_Types,0),3)))","v":""},null,null,{"$f":"IF(ISBLANK($E32),\"\",V32*$D32)","v":""},{"$f":"IF(OR(ISBLANK($E32),$D32=0), \"\",IF(ISBLANK(U32),0,INDEX(Luminaire_Table,MATCH(U32,Luminaire_Types,0),3)))","v":""},null,null,{"$f":"IF(ISBLANK($E32),\"\",Z32*$D32)","v":""},{"$f":"IF(OR(ISBLANK($E32),$D32=0), \"\",IF(ISBLANK(Y32),0,INDEX(Luminaire_Table,MATCH(Y32,Luminaire_Types,0),3)))","v":""},null,null,{"$f":"IF(ISBLANK($E32),\"\",AD32*$D32)","v":""},{"$f":"IF(OR(ISBLANK($E32),$D32=0), \"\",IF(ISBLANK(AC32),0,INDEX(Luminaire_Table,MATCH(AC32,Luminaire_Types,0),3)))","v":""},null,null,{"$f":"IF(ISBLANK($E32),\"\",AH32*$D32)","v":""},{"$f":"IF(OR(ISBLANK($E32),$D32=0), \"\",IF(ISBLANK(AG32),0,INDEX(Luminaire_Table,MATCH(AG32,Luminaire_Types,0),3)))","v":""},null,null,{"$f":"IF(ISBLANK($E32),\"\",AL32*$D32)","v":""},{"$f":"IF(OR(ISBLANK($E32),$D32=0), \"\",IF(ISBLANK(AK32),0,INDEX(Luminaire_Table,MATCH(AK32,Luminaire_Types,0),3)))","v":""},null,null,{"$f":"IF(ISBLANK($E32),\"\",AP32*$D32)","v":""},{"$f":"IF(OR(ISBLANK($E32),$D32=0), \"\",IF(ISBLANK(AO32),0,INDEX(Luminaire_Table,MATCH(AO32,Luminaire_Types,0),3)))","v":""},"","","","","","","","","","",false]
[null,11,null,null,null,null,"","","",null,null,"",null,null,"",{"$f":"IF(OR(ISBLANK($E33),$D33=0), \"\",IF(ISBLANK(M33),0,INDEX(Luminaire_Table,MATCH(M33,Luminaire_Types,0),3)))","v":""},null,null,"",{"$f":"IF(OR(ISBLANK($E33),$D33=0), \"\",IF(ISBLANK(Q33),0,INDEX(Luminaire_Table,MATCH(Q33,Luminaire_Types,0),3)))","v":""},null,null,"",{"$f":"IF(OR(ISBLANK($E33),$D33=0), \"\",IF(ISBLANK(U33),0,INDEX(Luminaire_Table,MATCH(U33,Luminaire_Types,0),3)))","v":""},null,null,"",{"$f":"IF(OR(ISBLANK($E33),$D33=0), \"\",IF(ISBLANK(Y33),0,INDEX(Luminaire_Table,MATCH(Y33,Luminaire_Types,0),3)))","v":""},null,null,"",{"$f":"IF(OR(ISBLANK($E33),$D33=0), \"\",IF(ISBLANK(AC33),0,INDEX(Luminaire_Table,MATCH(AC33,Luminaire_Types,0),3)))","v":""},null,null,"",{"$f":"IF(OR(ISBLANK($E33),$D33=0), \"\",IF(ISBLANK(AG33),0,INDEX(Luminaire_Table,MATCH(AG33,Luminaire_Types,0),3)))","v":""},null,null,"",{"$f":"IF(OR(ISBLANK($E33),$D33=0), \"\",IF(ISBLANK(AK33),0,INDEX(Luminaire_Table,MATCH(AK33,Luminaire_Types,0),3)))","v":""},null,null,"",{"$f":"IF(OR(ISBLANK($E33),$D33=0), \"\",IF(ISBLANK(AO33),0,INDEX(Luminaire_Table,MATCH(AO33,Luminaire_Types,0),3)))","v":""},"","","","","","","","","","",false]
[null,12,null,null,null,null,"","","",null,null,"",null,null,"",{"$f":"IF(OR(ISBLANK($E34),$D34=0), \"\",IF(ISBLANK(M34),0,INDEX(Luminaire_Table,MATCH(M34,Luminaire_Types,0),3)))","v":""},null,null,"",{"$f":"IF(OR(ISBLANK($E34),$D34=0), \"\",IF(ISBLANK(Q34),0,INDEX(Luminaire_Table,MATCH(Q34,Luminaire_Types,0),3)))","v":""},null,null,"",{"$f":"IF(OR(ISBLANK($E34),$D34=0), \"\",IF(ISBLANK(U34),0,INDEX(Luminaire_Table,MATCH(U34,Luminaire_Types,0),3)))","v":""},null,null,"",{"$f":"IF(OR(ISBLANK($E34),$D34=0), \"\",IF(ISBLANK(Y34),0,INDEX(Luminaire_Table,MATCH(Y34,Luminaire_Types,0),3)))","v":""},null,null,"",{"$f":"IF(OR(ISBLANK($E34),$D34=0), \"\",IF(ISBLANK(AC34),0,INDEX(Luminaire_Table,MATCH(AC34,Luminaire_Types,0),3)))","v":""},null,null,"",{"$f":"IF(OR(ISBLANK($E34),$D34=0), \"\",IF(ISBLANK(AG34),0,INDEX(Luminaire_Table,MATCH(AG34,Luminaire_Types,0),3)))","v":""},null,null,"",{"$f":"IF(OR(ISBLANK($E34),$D34=0), \"\",IF(ISBLANK(AK34),0,INDEX(Luminaire_Table,MATCH(AK34,Luminaire_Types,0),3)))","v":""},null,null,"",{"$f":"IF(OR(ISBLANK($E34),$D34=0), \"\",IF(ISBLANK(AO34),0,INDEX(Luminaire_Table,MATCH(AO34,Luminaire_Types,0),3)))","v":""},"","","","","","","","","","",false]
[null,13,null,null,null,null,"","","",null,null,"",null,null,{"$f":"IF(ISBLANK($E35),\"\",N35*$D35)","v":""},{"$f":"IF(OR(ISBLANK($E35),$D35=0), \"\",IF(ISBLANK(M35),0,INDEX(Luminaire_Table,MATCH(M35,Luminaire_Types,0),3)))","v":""},null,null,{"$f":"IF(ISBLANK($E35),\"\",R35*$D35)","v":""},{"$f":"IF(OR(ISBLANK($E35),$D35=0), \"\",IF(ISBLANK(Q35),0,INDEX(Luminaire_Table,MATCH(Q35,Luminaire_Types,0),3)))","v":""},null,null,{"$f":"IF(ISBLANK($E35),\"\",V35*$D35)","v":""},{"$f":"IF(OR(ISBLANK($E35),$D35=0), \"\",IF(ISBLANK(U35),0,INDEX(Luminaire_Table,MATCH(U35,Luminaire_Types,0),3)))","v":""},null,null,{"$f":"IF(ISBLANK($E35),\"\",Z35*$D35)","v":""},{"$f":"IF(OR(ISBLANK($E35),$D35=0), \"\",IF(ISBLANK(Y35),0,INDEX(Luminaire_Table,MATCH(Y35,Luminaire_Types,0),3)))","v":""},null,null,{"$f":"IF(ISBLANK($E35),\"\",AD35*$D35)","v":""},{"$f":"IF(OR(ISBLANK($E35),$D35=0), \"\",IF(ISBLANK(AC35),0,INDEX(Luminaire_Table,MATCH(AC35,Luminaire_Types,0),3)))","v":""},null,null,{"$f":"IF(ISBLANK($E35),\"\",AH35*$D35)","v":""},{"$f":"IF(OR(ISBLANK($E35),$D35=0), \"\",IF(ISBLANK(AG35),0,INDEX(Luminaire_Table,MATCH(AG35,Luminaire_Types,0),3)))","v":""},null,null,{"$f":"IF(ISBLANK($E35),\"\",AL35*$D35)","v":""},{"$f":"IF(OR(ISBLANK($E35),$D35=0), \"\",IF(ISBLANK(AK35),0,INDEX(Luminaire_Table,MATCH(AK35,Luminaire_Types,0),3)))","v":""},null,null,{"$f":"IF(ISBLANK($E35),\"\",AP35*$D35)","v":""},{"$f":"IF(OR(ISBLANK($E35),$D35=0), \"\",IF(ISBLANK(AO35),0,INDEX(Luminaire_Table,MATCH(AO35,Luminaire_Types,0),3)))","v":""},"","","","","","","","","","",false]
[null,14,null,null,null,null,"","","",null,null,"",null,null,"",{"$f":"IF(OR(ISBLANK($E36),$D36=0), \"\",IF(ISBLANK(M36),0,INDEX(Luminaire_Table,MATCH(M36,Luminaire_Types,0),3)))","v":""},null,null,"",{"$f":"IF(OR(ISBLANK($E36),$D36=0), \"\",IF(ISBLANK(Q36),0,INDEX(Luminaire_Table,MATCH(Q36,Luminaire_Types,0),3)))","v":""},null,null,"",{"$f":"IF(OR(ISBLANK($E36),$D36=0), \"\",IF(ISBLANK(U36),0,INDEX(Luminaire_Table,MATCH(U36,Luminaire_Types,0),3)))","v":""},null,null,"",{"$f":"IF(OR(ISBLANK($E36),$D36=0), \"\",IF(ISBLANK(Y36),0,INDEX(Luminaire_Table,MATCH(Y36,Luminaire_Types,0),3)))","v":""},null,null,"",{"$f":"IF(OR(ISBLANK($E36),$D36=0), \"\",IF(ISBLANK(AC36),0,INDEX(Luminaire_Table,MATCH(AC36,Luminaire_Types,0),3)))","v":""},null,null,"",{"$f":"IF(OR(ISBLANK($E36),$D36=0), \"\",IF(ISBLANK(AG36),0,INDEX(Luminaire_Table,MATCH(AG36,Luminaire_Types,0),3)))","v":""},null,null,"",{"$f":"IF(OR(ISBLANK($E36),$D36=0), \"\",IF(ISBLANK(AK36),0,INDEX(Luminaire_Table,MATCH(AK36,Luminaire_Types,0),3)))","v":""},null,null,"",{"$f":"IF(OR(ISBLANK($E36),$D36=0), \"\",IF(ISBLANK(AO36),0,INDEX(Luminaire_Table,MATCH(AO36,Luminaire_Types,0),3)))","v":""},"","","","","","","","","","",false]
[null,15,null,null,null,null,"","","",null,null,"",null,null,"",{"$f":"IF(OR(ISBLANK($E37),$D37=0), \"\",IF(ISBLANK(M37),0,INDEX(Luminaire_Table,MATCH(M37,Luminaire_Types,0),3)))","v":""},null,null,"",{"$f":"IF(OR(ISBLANK($E37),$D37=0), \"\",IF(ISBLANK(Q37),0,INDEX(Luminaire_Table,MATCH(Q37,Luminaire_Types,0),3)))","v":""},null,null,"",{"$f":"IF(OR(ISBLANK($E37),$D37=0), \"\",IF(ISBLANK(U37),0,INDEX(Luminaire_Table,MATCH(U37,Luminaire_Types,0),3)))","v":""},null,null,"",{"$f":"IF(OR(ISBLANK($E37),$D37=0), \"\",IF(ISBLANK(Y37),0,INDEX(Luminaire_Table,MATCH(Y37,Luminaire_Types,0),3)))","v":""},null,null,"",{"$f":"IF(OR(ISBLANK($E37),$D37=0), \"\",IF(ISBLANK(AC37),0,INDEX(Luminaire_Table,MATCH(AC37,Luminaire_Types,0),3)))","v":""},null,null,"",{"$f":"IF(OR(ISBLANK($E37),$D37=0), \"\",IF(ISBLANK(AG37),0,INDEX(Luminaire_Table,MATCH(AG37,Luminaire_Types,0),3)))","v":""},null,null,"",{"$f":"IF(OR(ISBLANK($E37),$D37=0), \"\",IF(ISBLANK(AK37),0,INDEX(Luminaire_Table,MATCH(AK37,Luminaire_Types,0),3)))","v":""},null,null,"",{"$f":"IF(OR(ISBLANK($E37),$D37=0), \"\",IF(ISBLANK(AO37),0,INDEX(Luminaire_Table,MATCH(AO37,Luminaire_Types,0),3)))","v":""},"","","","","","","","","","",false]
[null,16,null,null,null,null,"","","",null,null,"",null,null,"",{"$f":"IF(OR(ISBLANK($E38),$D38=0), \"\",IF(ISBLANK(M38),0,INDEX(Luminaire_Table,MATCH(M38,Luminaire_Types,0),3)))","v":""},null,null,"",{"$f":"IF(OR(ISBLANK($E38),$D38=0), \"\",IF(ISBLANK(Q38),0,INDEX(Luminaire_Table,MATCH(Q38,Luminaire_Types,0),3)))","v":""},null,null,"",{"$f":"IF(OR(ISBLANK($E38),$D38=0), \"\",IF(ISBLANK(U38),0,INDEX(Luminaire_Table,MATCH(U38,Luminaire_Types,0),3)))","v":""},null,null,"",{"$f":"IF(OR(ISBLANK($E38),$D38=0), \"\",IF(ISBLANK(Y38),0,INDEX(Luminaire_Table,MATCH(Y38,Luminaire_Types,0),3)))","v":""},null,null,"",{"$f":"IF(OR(ISBLANK($E38),$D38=0), \"\",IF(ISBLANK(AC38),0,INDEX(Luminaire_Table,MATCH(AC38,Luminaire_Types,0),3)))","v":""},null,null,"",{"$f":"IF(OR(ISBLANK($E38),$D38=0), \"\",IF(ISBLANK(AG38),0,INDEX(Luminaire_Table,MATCH(AG38,Luminaire_Types,0),3)))","v":""},null,null,"",{"$f":"IF(OR(ISBLANK($E38),$D38=0), \"\",IF(ISBLANK(AK38),0,INDEX(Luminaire_Table,MATCH(AK38,Luminaire_Types,0),3)))","v":""},null,null,"",{"$f":"IF(OR(ISBLANK($E38),$D38=0), \"\",IF(ISBLANK(AO38),0,INDEX(Luminaire_Table,MATCH(AO38,Luminaire_Types,0),3)))","v":""},"","","","","","","","","","",false]
[null,17,null,null,null,null,"","","",null,null,"",null,null,{"$f":"IF(ISBLANK($E39),\"\",N39*$D39)","v":""},{"$f":"IF(OR(ISBLANK($E39),$D39=0), \"\",IF(ISBLANK(M39),0,INDEX(Luminaire_Table,MATCH(M39,Luminaire_Types,0),3)))","v":""},null,null,{"$f":"IF(ISBLANK($E39),\"\",R39*$D39)","v":""},{"$f":"IF(OR(ISBLANK($E39),$D39=0), \"\",IF(ISBLANK(Q39),0,INDEX(Luminaire_Table,MATCH(Q39,Luminaire_Types,0),3)))","v":""},null,null,{"$f":"IF(ISBLANK($E39),\"\",V39*$D39)","v":""},{"$f":"IF(OR(ISBLANK($E39),$D39=0), \"\",IF(ISBLANK(U39),0,INDEX(Luminaire_Table,MATCH(U39,Luminaire_Types,0),3)))","v":""},null,null,{"$f":"IF(ISBLANK($E39),\"\",Z39*$D39)","v":""},{"$f":"IF(OR(ISBLANK($E39),$D39=0), \"\",IF(ISBLANK(Y39),0,INDEX(Luminaire_Table,MATCH(Y39,Luminaire_Types,0),3)))","v":""},null,null,{"$f":"IF(ISBLANK($E39),\"\",AD39*$D39)","v":""},{"$f":"IF(OR(ISBLANK($E39),$D39=0), \"\",IF(ISBLANK(AC39),0,INDEX(Luminaire_Table,MATCH(AC39,Luminaire_Types,0),3)))","v":""},null,null,{"$f":"IF(ISBLANK($E39),\"\",AH39*$D39)","v":""},{"$f":"IF(OR(ISBLANK($E39),$D39=0), \"\",IF(ISBLANK(AG39),0,INDEX(Luminaire_Table,MATCH(AG39,Luminaire_Types,0),3)))","v":""},null,null,{"$f":"IF(ISBLANK($E39),\"\",AL39*$D39)","v":""},{"$f":"IF(OR(ISBLANK($E39),$D39=0), \"\",IF(ISBLANK(AK39),0,INDEX(Luminaire_Table,MATCH(AK39,Luminaire_Types,0),3)))","v":""},null,null,{"$f":"IF(ISBLANK($E39),\"\",AP39*$D39)","v":""},{"$f":"IF(OR(ISBLANK($E39),$D39=0), \"\",IF(ISBLANK(AO39),0,INDEX(Luminaire_Table,MATCH(AO39,Luminaire_Types,0),3)))","v":""},"","","","","","","","","","",false]
[null,18,null,null,null,null,"","","",null,null,"",null,null,"",{"$f":"IF(OR(ISBLANK($E40),$D40=0), \"\",IF(ISBLANK(M40),0,INDEX(Luminaire_Table,MATCH(M40,Luminaire_Types,0),3)))","v":""},null,null,"",{"$f":"IF(OR(ISBLANK($E40),$D40=0), \"\",IF(ISBLANK(Q40),0,INDEX(Luminaire_Table,MATCH(Q40,Luminaire_Types,0),3)))","v":""},null,null,"",{"$f":"IF(OR(ISBLANK($E40),$D40=0), \"\",IF(ISBLANK(U40),0,INDEX(Luminaire_Table,MATCH(U40,Luminaire_Types,0),3)))","v":""},null,null,"",{"$f":"IF(OR(ISBLANK($E40),$D40=0), \"\",IF(ISBLANK(Y40),0,INDEX(Luminaire_Table,MATCH(Y40,Luminaire_Types,0),3)))","v":""},null,null,"",{"$f":"IF(OR(ISBLANK($E40),$D40=0), \"\",IF(ISBLANK(AC40),0,INDEX(Luminaire_Table,MATCH(AC40,Luminaire_Types,0),3)))","v":""},null,null,"",{"$f":"IF(OR(ISBLANK($E40),$D40=0), \"\",IF(ISBLANK(AG40),0,INDEX(Luminaire_Table,MATCH(AG40,Luminaire_Types,0),3)))","v":""},null,null,"",{"$f":"IF(OR(ISBLANK($E40),$D40=0), \"\",IF(ISBLANK(AK40),0,INDEX(Luminaire_Table,MATCH(AK40,Luminaire_Types,0),3)))","v":""},null,null,"",{"$f":"IF(OR(ISBLANK($E40),$D40=0), \"\",IF(ISBLANK(AO40),0,INDEX(Luminaire_Table,MATCH(AO40,Luminaire_Types,0),3)))","v":""},"","","","","","","","","","",false]
[null,19,null,null,null,null,"","","",null,null,"",null,null,"",{"$f":"IF(OR(ISBLANK($E41),$D41=0), \"\",IF(ISBLANK(M41),0,INDEX(Luminaire_Table,MATCH(M41,Luminaire_Types,0),3)))","v":""},null,null,"",{"$f":"IF(OR(ISBLANK($E41),$D41=0), \"\",IF(ISBLANK(Q41),0,INDEX(Luminaire_Table,MATCH(Q41,Luminaire_Types,0),3)))","v":""},null,null,"",{"$f":"IF(OR(ISBLANK($E41),$D41=0), \"\",IF(ISBLANK(U41),0,INDEX(Luminaire_Table,MATCH(U41,Luminaire_Types,0),3)))","v":""},null,null,"",{"$f":"IF(OR(ISBLANK($E41),$D41=0), \"\",IF(ISBLANK(Y41),0,INDEX(Luminaire_Table,MATCH(Y41,Luminaire_Types,0),3)))","v":""},null,null,"",{"$f":"IF(OR(ISBLANK($E41),$D41=0), \"\",IF(ISBLANK(AC41),0,INDEX(Luminaire_Table,MATCH(AC41,Luminaire_Types,0),3)))","v":""},null,null,"",{"$f":"IF(OR(ISBLANK($E41),$D41=0), \"\",IF(ISBLANK(AG41),0,INDEX(Luminaire_Table,MATCH(AG41,Luminaire_Types,0),3)))","v":""},null,null,"",{"$f":"IF(OR(ISBLANK($E41),$D41=0), \"\",IF(ISBLANK(AK41),0,INDEX(Luminaire_Table,MATCH(AK41,Luminaire_Types,0),3)))","v":""},null,null,"",{"$f":"IF(OR(ISBLANK($E41),$D41=0), \"\",IF(ISBLANK(AO41),0,INDEX(Luminaire_Table,MATCH(AO41,Luminaire_Types,0),3)))","v":""},"","","","","","","","","","",false]
[null,20,null,null,null,null,"","","",null,null,"",null,null,"",{"$f":"IF(OR(ISBLANK($E42),$D42=0), \"\",IF(ISBLANK(M42),0,INDEX(Luminaire_Table,MATCH(M42,Luminaire_Types,0),3)))","v":""},null,null,"",{"$f":"IF(OR(ISBLANK($E42),$D42=0), \"\",IF(ISBLANK(Q42),0,INDEX(Luminaire_Table,MATCH(Q42,Luminaire_Types,0),3)))","v":""},null,null,"",{"$f":"IF(OR(ISBLANK($E42),$D42=0), \"\",IF(ISBLANK(U42),0,INDEX(Luminaire_Table,MATCH(U42,Luminaire_Types,0),3)))","v":""},null,null,"",{"$f":"IF(OR(ISBLANK($E42),$D42=0), \"\",IF(ISBLANK(Y42),0,INDEX(Luminaire_Table,MATCH(Y42,Luminaire_Types,0),3)))","v":""},null,null,"",{"$f":"IF(OR(ISBLANK($E42),$D42=0), \"\",IF(ISBLANK(AC42),0,INDEX(Luminaire_Table,MATCH(AC42,Luminaire_Types,0),3)))","v":""},null,null,"",{"$f":"IF(OR(ISBLANK($E42),$D42=0), \"\",IF(ISBLANK(AG42),0,INDEX(Luminaire_Table,MATCH(AG42,Luminaire_Types,0),3)))","v":""},null,null,"",{"$f":"IF(OR(ISBLANK($E42),$D42=0), \"\",IF(ISBLANK(AK42),0,INDEX(Luminaire_Table,MATCH(AK42,Luminaire_Types,0),3)))","v":""},null,null,"",{"$f":"IF(OR(ISBLANK($E42),$D42=0), \"\",IF(ISBLANK(AO42),0,INDEX(Luminaire_Table,MATCH(AO42,Luminaire_Types,0),3)))","v":""},"","","","","","","","","","",false]
[null,21,null,null,null,null,"","","",null,null,"",null,null,"",{"$f":"IF(OR(ISBLANK($E43),$D43=0), \"\",IF(ISBLANK(M43),0,INDEX(Luminaire_Table,MATCH(M43,Luminaire_Types,0),3)))","v":""},null,null,"",{"$f":"IF(OR(ISBLANK($E43),$D43=0), \"\",IF(ISBLANK(Q43),0,INDEX(Luminaire_Table,MATCH(Q43,Luminaire_Types,0),3)))","v":""},null,null,"",{"$f":"IF(OR(ISBLANK($E43),$D43=0), \"\",IF(ISBLANK(U43),0,INDEX(Luminaire_Table,MATCH(U43,Luminaire_Types,0),3)))","v":""},null,null,"",{"$f":"IF(OR(ISBLANK($E43),$D43=0), \"\",IF(ISBLANK(Y43),0,INDEX(Luminaire_Table,MATCH(Y43,Luminaire_Types,0),3)))","v":""},null,null,"",{"$f":"IF(OR(ISBLANK($E43),$D43=0), \"\",IF(ISBLANK(AC43),0,INDEX(Luminaire_Table,MATCH(AC43,Luminaire_Types,0),3)))","v":""},null,null,"",{"$f":"IF(OR(ISBLANK($E43),$D43=0), \"\",IF(ISBLANK(AG43),0,INDEX(Luminaire_Table,MATCH(AG43,Luminaire_Types,0),3)))","v":""},null,null,"",{"$f":"IF(OR(ISBLANK($E43),$D43=0), \"\",IF(ISBLANK(AK43),0,INDEX(Luminaire_Table,MATCH(AK43,Luminaire_Types,0),3)))","v":""},null,null,"",{"$f":"IF(OR(ISBLANK($E43),$D43=0), \"\",IF(ISBLANK(AO43),0,INDEX(Luminaire_Table,MATCH(AO43,Luminaire_Types,0),3)))","v":""},"","","","","","","","","","",false]
[null,22,null,null,null,null,"","","",null,null,"",null,null,"",{"$f":"IF(OR(ISBLANK($E44),$D44=0), \"\",IF(ISBLANK(M44),0,INDEX(Luminaire_Table,MATCH(M44,Luminaire_Types,0),3)))","v":""},null,null,"",{"$f":"IF(OR(ISBLANK($E44),$D44=0), \"\",IF(ISBLANK(Q44),0,INDEX(Luminaire_Table,MATCH(Q44,Luminaire_Types,0),3)))","v":""},null,null,"",{"$f":"IF(OR(ISBLANK($E44),$D44=0), \"\",IF(ISBLANK(U44),0,INDEX(Luminaire_Table,MATCH(U44,Luminaire_Types,0),3)))","v":""},null,null,"",{"$f":"IF(OR(ISBLANK($E44),$D44=0), \"\",IF(ISBLANK(Y44),0,INDEX(Luminaire_Table,MATCH(Y44,Luminaire_Types,0),3)))","v":""},null,null,"",{"$f":"IF(OR(ISBLANK($E44),$D44=0), \"\",IF(ISBLANK(AC44),0,INDEX(Luminaire_Table,MATCH(AC44,Luminaire_Types,0),3)))","v":""},null,null,"",{"$f":"IF(OR(ISBLANK($E44),$D44=0), \"\",IF(ISBLANK(AG44),0,INDEX(Luminaire_Table,MATCH(AG44,Luminaire_Types,0),3)))","v":""},null,null,"",{"$f":"IF(OR(ISBLANK($E44),$D44=0), \"\",IF(ISBLANK(AK44),0,INDEX(Luminaire_Table,MATCH(AK44,Luminaire_Types,0),3)))","v":""},null,null,"",{"$f":"IF(OR(ISBLANK($E44),$D44=0), \"\",IF(ISBLANK(AO44),0,INDEX(Luminaire_Table,MATCH(AO44,Luminaire_Types,0),3)))","v":""},"","","","","","","","","","",false]
[null,23,null,null,null,null,"","","",null,null,"",null,null,"",{"$f":"IF(OR(ISBLANK($E45),$D45=0), \"\",IF(ISBLANK(M45),0,INDEX(Luminaire_Table,MATCH(M45,Luminaire_Types,0),3)))","v":""},null,null,"",{"$f":"IF(OR(ISBLANK($E45),$D45=0), \"\",IF(ISBLANK(Q45),0,INDEX(Luminaire_Table,MATCH(Q45,Luminaire_Types,0),3)))","v":""},null,null,"",{"$f":"IF(OR(ISBLANK($E45),$D45=0), \"\",IF(ISBLANK(U45),0,INDEX(Luminaire_Table,MATCH(U45,Luminaire_Types,0),3)))","v":""},null,null,"",{"$f":"IF(OR(ISBLANK($E45),$D45=0), \"\",IF(ISBLANK(Y45),0,INDEX(Luminaire_Table,MATCH(Y45,Luminaire_Types,0),3)))","v":""},null,null,"",{"$f":"IF(OR(ISBLANK($E45),$D45=0), \"\",IF(ISBLANK(AC45),0,INDEX(Luminaire_Table,MATCH(AC45,Luminaire_Types,0),3)))","v":""},null,null,"",{"$f":"IF(OR(ISBLANK($E45),$D45=0), \"\",IF(ISBLANK(AG45),0,INDEX(Luminaire_Table,MATCH(AG45,Luminaire_Types,0),3)))","v":""},null,null,"",{"$f":"IF(OR(ISBLANK($E45),$D45=0), \"\",IF(ISBLANK(AK45),0,INDEX(Luminaire_Table,MATCH(AK45,Luminaire_Types,0),3)))","v":""},null,null,"",{"$f":"IF(OR(ISBLANK($E45),$D45=0), \"\",IF(ISBLANK(AO45),0,INDEX(Luminaire_Table,MATCH(AO45,Luminaire_Types,0),3)))","v":""},"","","","","","","","","","",false]
[null,24,null,null,null,null,"","","",null,null,"",null,null,"",{"$f":"IF(OR(ISBLANK($E46),$D46=0), \"\",IF(ISBLANK(M46),0,INDEX(Luminaire_Table,MATCH(M46,Luminaire_Types,0),3)))","v":""},null,null,"",{"$f":"IF(OR(ISBLANK($E46),$D46=0), \"\",IF(ISBLANK(Q46),0,INDEX(Luminaire_Table,MATCH(Q46,Luminaire_Types,0),3)))","v":""},null,null,"",{"$f":"IF(OR(ISBLANK($E46),$D46=0), \"\",IF(ISBLANK(U46),0,INDEX(Luminaire_Table,MATCH(U46,Luminaire_Types,0),3)))","v":""},null,null,"",{"$f":"IF(OR(ISBLANK($E46),$D46=0), \"\",IF(ISBLANK(Y46),0,INDEX(Luminaire_Table,MATCH(Y46,Luminaire_Types,0),3)))","v":""},null,null,"",{"$f":"IF(OR(ISBLANK($E46),$D46=0), \"\",IF(ISBLANK(AC46),0,INDEX(Luminaire_Table,MATCH(AC46,Luminaire_Types,0),3)))","v":""},null,null,"",{"$f":"IF(OR(ISBLANK($E46),$D46=0), \"\",IF(ISBLANK(AG46),0,INDEX(Luminaire_Table,MATCH(AG46,Luminaire_Types,0),3)))","v":""},null,null,"",{"$f":"IF(OR(ISBLANK($E46),$D46=0), \"\",IF(ISBLANK(AK46),0,INDEX(Luminaire_Table,MATCH(AK46,Luminaire_Types,0),3)))","v":""},null,null,"",{"$f":"IF(OR(ISBLANK($E46),$D46=0), \"\",IF(ISBLANK(AO46),0,INDEX(Luminaire_Table,MATCH(AO46,Luminaire_Types,0),3)))","v":""},"","","","","","","","","","",false]
[null,25,null,null,null,null,"","","",null,null,"",null,null,"",{"$f":"IF(OR(ISBLANK($E47),$D47=0), \"\",IF(ISBLANK(M47),0,INDEX(Luminaire_Table,MATCH(M47,Luminaire_Types,0),3)))","v":""},null,null,"",{"$f":"IF(OR(ISBLANK($E47),$D47=0), \"\",IF(ISBLANK(Q47),0,INDEX(Luminaire_Table,MATCH(Q47,Luminaire_Types,0),3)))","v":""},null,null,"",{"$f":"IF(OR(ISBLANK($E47),$D47=0), \"\",IF(ISBLANK(U47),0,INDEX(Luminaire_Table,MATCH(U47,Luminaire_Types,0),3)))","v":""},null,null,"",{"$f":"IF(OR(ISBLANK($E47),$D47=0), \"\",IF(ISBLANK(Y47),0,INDEX(Luminaire_Table,MATCH(Y47,Luminaire_Types,0),3)))","v":""},null,null,"",{"$f":"IF(OR(ISBLANK($E47),$D47=0), \"\",IF(ISBLANK(AC47),0,INDEX(Luminaire_Table,MATCH(AC47,Luminaire_Types,0),3)))","v":""},null,null,"",{"$f":"IF(OR(ISBLANK($E47),$D47=0), \"\",IF(ISBLANK(AG47),0,INDEX(Luminaire_Table,MATCH(AG47,Luminaire_Types,0),3)))","v":""},null,null,"",{"$f":"IF(OR(ISBLANK($E47),$D47=0), \"\",IF(ISBLANK(AK47),0,INDEX(Luminaire_Table,MATCH(AK47,Luminaire_Types,0),3)))","v":""},null,null,"",{"$f":"IF(OR(ISBLANK($E47),$D47=0), \"\",IF(ISBLANK(AO47),0,INDEX(Luminaire_Table,MATCH(AO47,Luminaire_Types,0),3)))","v":""},"","","","","","","","","","",false]
[null,26,null,null,null,null,"","","",null,null,"",null,null,"",{"$f":"IF(OR(ISBLANK($E48),$D48=0), \"\",IF(ISBLANK(M48),0,INDEX(Luminaire_Table,MATCH(M48,Luminaire_Types,0),3)))","v":""},null,null,"",{"$f":"IF(OR(ISBLANK($E48),$D48=0), \"\",IF(ISBLANK(Q48),0,INDEX(Luminaire_Table,MATCH(Q48,Luminaire_Types,0),3)))","v":""},null,null,"",{"$f":"IF(OR(ISBLANK($E48),$D48=0), \"\",IF(ISBLANK(U48),0,INDEX(Luminaire_Table,MATCH(U48,Luminaire_Types,0),3)))","v":""},null,null,"",{"$f":"IF(OR(ISBLANK($E48),$D48=0), \"\",IF(ISBLANK(Y48),0,INDEX(Luminaire_Table,MATCH(Y48,Luminaire_Types,0),3)))","v":""},null,null,"",{"$f":"IF(OR(ISBLANK($E48),$D48=0), \"\",IF(ISBLANK(AC48),0,INDEX(Luminaire_Table,MATCH(AC48,Luminaire_Types,0),3)))","v":""},null,null,"",{"$f":"IF(OR(ISBLANK($E48),$D48=0), \"\",IF(ISBLANK(AG48),0,INDEX(Luminaire_Table,MATCH(AG48,Luminaire_Types,0),3)))","v":""},null,null,"",{"$f":"IF(OR(ISBLANK($E48),$D48=0), \"\",IF(ISBLANK(AK48),0,INDEX(Luminaire_Table,MATCH(AK48,Luminaire_Types,0),3)))","v":""},null,null,"",{"$f":"IF(OR(ISBLANK($E48),$D48=0), \"\",IF(ISBLANK(AO48),0,INDEX(Luminaire_Table,MATCH(AO48,Luminaire_Types,0),3)))","v":""},"","","","","","","","","","",false]
[null,27,null,null,null,null,"","","",null,null,"",null,null,"",{"$f":"IF(OR(ISBLANK($E49),$D49=0), \"\",IF(ISBLANK(M49),0,INDEX(Luminaire_Table,MATCH(M49,Luminaire_Types,0),3)))","v":""},null,null,"",{"$f":"IF(OR(ISBLANK($E49),$D49=0), \"\",IF(ISBLANK(Q49),0,INDEX(Luminaire_Table,MATCH(Q49,Luminaire_Types,0),3)))","v":""},null,null,"",{"$f":"IF(OR(ISBLANK($E49),$D49=0), \"\",IF(ISBLANK(U49),0,INDEX(Luminaire_Table,MATCH(U49,Luminaire_Types,0),3)))","v":""},null,null,"",{"$f":"IF(OR(ISBLANK($E49),$D49=0), \"\",IF(ISBLANK(Y49),0,INDEX(Luminaire_Table,MATCH(Y49,Luminaire_Types,0),3)))","v":""},null,null,"",{"$f":"IF(OR(ISBLANK($E49),$D49=0), \"\",IF(ISBLANK(AC49),0,INDEX(Luminaire_Table,MATCH(AC49,Luminaire_Types,0),3)))","v":""},null,null,"",{"$f":"IF(OR(ISBLANK($E49),$D49=0), \"\",IF(ISBLANK(AG49),0,INDEX(Luminaire_Table,MATCH(AG49,Luminaire_Types,0),3)))","v":""},null,null,"",{"$f":"IF(OR(ISBLANK($E49),$D49=0), \"\",IF(ISBLANK(AK49),0,INDEX(Luminaire_Table,MATCH(AK49,Luminaire_Types,0),3)))","v":""},null,null,"",{"$f":"IF(OR(ISBLANK($E49),$D49=0), \"\",IF(ISBLANK(AO49),0,INDEX(Luminaire_Table,MATCH(AO49,Luminaire_Types,0),3)))","v":""},"","","","","","","","","","",false]
[null,28,null,null,null,null,"","","",null,null,"",null,null,"",{"$f":"IF(OR(ISBLANK($E50),$D50=0), \"\",IF(ISBLANK(M50),0,INDEX(Luminaire_Table,MATCH(M50,Luminaire_Types,0),3)))","v":""},null,null,"",{"$f":"IF(OR(ISBLANK($E50),$D50=0), \"\",IF(ISBLANK(Q50),0,INDEX(Luminaire_Table,MATCH(Q50,Luminaire_Types,0),3)))","v":""},null,null,"",{"$f":"IF(OR(ISBLANK($E50),$D50=0), \"\",IF(ISBLANK(U50),0,INDEX(Luminaire_Table,MATCH(U50,Luminaire_Types,0),3)))","v":""},null,null,"",{"$f":"IF(OR(ISBLANK($E50),$D50=0), \"\",IF(ISBLANK(Y50),0,INDEX(Luminaire_Table,MATCH(Y50,Luminaire_Types,0),3)))","v":""},null,null,"",{"$f":"IF(OR(ISBLANK($E50),$D50=0), \"\",IF(ISBLANK(AC50),0,INDEX(Luminaire_Table,MATCH(AC50,Luminaire_Types,0),3)))","v":""},null,null,"",{"$f":"IF(OR(ISBLANK($E50),$D50=0), \"\",IF(ISBLANK(AG50),0,INDEX(Luminaire_Table,MATCH(AG50,Luminaire_Types,0),3)))","v":""},null,null,"",{"$f":"IF(OR(ISBLANK($E50),$D50=0), \"\",IF(ISBLANK(AK50),0,INDEX(Luminaire_Table,MATCH(AK50,Luminaire_Types,0),3)))","v":""},null,null,"",{"$f":"IF(OR(ISBLANK($E50),$D50=0), \"\",IF(ISBLANK(AO50),0,INDEX(Luminaire_Table,MATCH(AO50,Luminaire_Types,0),3)))","v":""},"","","","","","","","","","",false]
[null,29,null,null,null,null,"","","",null,null,"",null,null,"",{"$f":"IF(OR(ISBLANK($E51),$D51=0), \"\",IF(ISBLANK(M51),0,INDEX(Luminaire_Table,MATCH(M51,Luminaire_Types,0),3)))","v":""},null,null,"",{"$f":"IF(OR(ISBLANK($E51),$D51=0), \"\",IF(ISBLANK(Q51),0,INDEX(Luminaire_Table,MATCH(Q51,Luminaire_Types,0),3)))","v":""},null,null,"",{"$f":"IF(OR(ISBLANK($E51),$D51=0), \"\",IF(ISBLANK(U51),0,INDEX(Luminaire_Table,MATCH(U51,Luminaire_Types,0),3)))","v":""},null,null,"",{"$f":"IF(OR(ISBLANK($E51),$D51=0), \"\",IF(ISBLANK(Y51),0,INDEX(Luminaire_Table,MATCH(Y51,Luminaire_Types,0),3)))","v":""},null,null,"",{"$f":"IF(OR(ISBLANK($E51),$D51=0), \"\",IF(ISBLANK(AC51),0,INDEX(Luminaire_Table,MATCH(AC51,Luminaire_Types,0),3)))","v":""},null,null,"",{"$f":"IF(OR(ISBLANK($E51),$D51=0), \"\",IF(ISBLANK(AG51),0,INDEX(Luminaire_Table,MATCH(AG51,Luminaire_Types,0),3)))","v":""},null,null,"",{"$f":"IF(OR(ISBLANK($E51),$D51=0), \"\",IF(ISBLANK(AK51),0,INDEX(Luminaire_Table,MATCH(AK51,Luminaire_Types,0),3)))","v":""},null,null,"",{"$f":"IF(OR(ISBLANK($E51),$D51=0), \"\",IF(ISBLANK(AO51),0,INDEX(Luminaire_Table,MATCH(AO51,Luminaire_Types,0),3)))","v":""},"","","","","","","","","","",false]
[null,30,null,null,null,null,"","","",null,null,"",null,null,{"$f":"IF(ISBLANK($E52),\"\",N52*$D52)","v":""},{"$f":"IF(OR(ISBLANK($E52),$D52=0), \"\",IF(ISBLANK(M52),0,INDEX(Luminaire_Table,MATCH(M52,Luminaire_Types,0),3)))","v":""},null,null,{"$f":"IF(ISBLANK($E52),\"\",R52*$D52)","v":""},{"$f":"IF(OR(ISBLANK($E52),$D52=0), \"\",IF(ISBLANK(Q52),0,INDEX(Luminaire_Table,MATCH(Q52,Luminaire_Types,0),3)))","v":""},null,null,{"$f":"IF(ISBLANK($E52),\"\",V52*$D52)","v":""},{"$f":"IF(OR(ISBLANK($E52),$D52=0), \"\",IF(ISBLANK(U52),0,INDEX(Luminaire_Table,MATCH(U52,Luminaire_Types,0),3)))","v":""},null,null,{"$f":"IF(ISBLANK($E52),\"\",Z52*$D52)","v":""},{"$f":"IF(OR(ISBLANK($E52),$D52=0), \"\",IF(ISBLANK(Y52),0,INDEX(Luminaire_Table,MATCH(Y52,Luminaire_Types,0),3)))","v":""},null,null,{"$f":"IF(ISBLANK($E52),\"\",AD52*$D52)","v":""},{"$f":"IF(OR(ISBLANK($E52),$D52=0), \"\",IF(ISBLANK(AC52),0,INDEX(Luminaire_Table,MATCH(AC52,Luminaire_Types,0),3)))","v":""},null,null,{"$f":"IF(ISBLANK($E52),\"\",AH52*$D52)","v":""},{"$f":"IF(OR(ISBLANK($E52),$D52=0), \"\",IF(ISBLANK(AG52),0,INDEX(Luminaire_Table,MATCH(AG52,Luminaire_Types,0),3)))","v":""},null,null,{"$f":"IF(ISBLANK($E52),\"\",AL52*$D52)","v":""},{"$f":"IF(OR(ISBLANK($E52),$D52=0), \"\",IF(ISBLANK(AK52),0,INDEX(Luminaire_Table,MATCH(AK52,Luminaire_Types,0),3)))","v":""},null,null,{"$f":"IF(ISBLANK($E52),\"\",AP52*$D52)","v":""},{"$f":"IF(OR(ISBLANK($E52),$D52=0), \"\",IF(ISBLANK(AO52),0,INDEX(Luminaire_Table,MATCH(AO52,Luminaire_Types,0),3)))","v":""},"","","","","","","","","","",false]
[null,31,null,null,null,null,"","","",null,null,"",null,null,"",{"$f":"IF(OR(ISBLANK($E53),$D53=0), \"\",IF(ISBLANK(M53),0,INDEX(Luminaire_Table,MATCH(M53,Luminaire_Types,0),3)))","v":""},null,null,"",{"$f":"IF(OR(ISBLANK($E53),$D53=0), \"\",IF(ISBLANK(Q53),0,INDEX(Luminaire_Table,MATCH(Q53,Luminaire_Types,0),3)))","v":""},null,null,"",{"$f":"IF(OR(ISBLANK($E53),$D53=0), \"\",IF(ISBLANK(U53),0,INDEX(Luminaire_Table,MATCH(U53,Luminaire_Types,0),3)))","v":""},null,null,"",{"$f":"IF(OR(ISBLANK($E53),$D53=0), \"\",IF(ISBLANK(Y53),0,INDEX(Luminaire_Table,MATCH(Y53,Luminaire_Types,0),3)))","v":""},null,null,"",{"$f":"IF(OR(ISBLANK($E53),$D53=0), \"\",IF(ISBLANK(AC53),0,INDEX(Luminaire_Table,MATCH(AC53,Luminaire_Types,0),3)))","v":""},null,null,"",{"$f":"IF(OR(ISBLANK($E53),$D53=0), \"\",IF(ISBLANK(AG53),0,INDEX(Luminaire_Table,MATCH(AG53,Luminaire_Types,0),3)))","v":""},null,null,"",{"$f":"IF(OR(ISBLANK($E53),$D53=0), \"\",IF(ISBLANK(AK53),0,INDEX(Luminaire_Table,MATCH(AK53,Luminaire_Types,0),3)))","v":""},null,null,"",{"$f":"IF(OR(ISBLANK($E53),$D53=0), \"\",IF(ISBLANK(AO53),0,INDEX(Luminaire_Table,MATCH(AO53,Luminaire_Types,0),3)))","v":""},"","","","","","","","","","",false]
[null,32,null,null,null,null,"","","",null,null,{"$f":"IF(ISBLANK($K54),\"\",IF($E54=\"Parking Garage Area\",0,INDEX(Interior_ControlsTable,MATCH($K54,Interior_ControlsTypes,0),IF(ISNUMBER(MATCH($E54,OSRequired_Spaces,0)),3,2))))","v":""},null,null,"",{"$f":"IF(OR(ISBLANK($E54),$D54=0), \"\",IF(ISBLANK(M54),0,INDEX(Luminaire_Table,MATCH(M54,Luminaire_Types,0),3)))","v":""},null,null,"",{"$f":"IF(OR(ISBLANK($E54),$D54=0), \"\",IF(ISBLANK(Q54),0,INDEX(Luminaire_Table,MATCH(Q54,Luminaire_Types,0),3)))","v":""},null,null,"",{"$f":"IF(OR(ISBLANK($E54),$D54=0), \"\",IF(ISBLANK(U54),0,INDEX(Luminaire_Table,MATCH(U54,Luminaire_Types,0),3)))","v":""},null,null,"",{"$f":"IF(OR(ISBLANK($E54),$D54=0), \"\",IF(ISBLANK(Y54),0,INDEX(Luminaire_Table,MATCH(Y54,Luminaire_Types,0),3)))","v":""},null,null,"",{"$f":"IF(OR(ISBLANK($E54),$D54=0), \"\",IF(ISBLANK(AC54),0,INDEX(Luminaire_Table,MATCH(AC54,Luminaire_Types,0),3)))","v":""},null,null,"",{"$f":"IF(OR(ISBLANK($E54),$D54=0), \"\",IF(ISBLANK(AG54),0,INDEX(Luminaire_Table,MATCH(AG54,Luminaire_Types,0),3)))","v":""},null,null,"",{"$f":"IF(OR(ISBLANK($E54),$D54=0), \"\",IF(ISBLANK(AK54),0,INDEX(Luminaire_Table,MATCH(AK54,Luminaire_Types,0),3)))","v":""},null,null,"",{"$f":"IF(OR(ISBLANK($E54),$D54=0), \"\",IF(ISBLANK(AO54),0,INDEX(Luminaire_Table,MATCH(AO54,Luminaire_Types,0),3)))","v":""},"","","","","","","","","","",false]
[null,33,null,null,null,null,"","","",null,null,"",null,null,{"$f":"IF(ISBLANK($E55),\"\",N55*$D55)","v":""},{"$f":"IF(OR(ISBLANK($E55),$D55=0), \"\",IF(ISBLANK(M55),0,INDEX(Luminaire_Table,MATCH(M55,Luminaire_Types,0),3)))","v":""},null,null,{"$f":"IF(ISBLANK($E55),\"\",R55*$D55)","v":""},{"$f":"IF(OR(ISBLANK($E55),$D55=0), \"\",IF(ISBLANK(Q55),0,INDEX(Luminaire_Table,MATCH(Q55,Luminaire_Types,0),3)))","v":""},null,null,{"$f":"IF(ISBLANK($E55),\"\",V55*$D55)","v":""},{"$f":"IF(OR(ISBLANK($E55),$D55=0), \"\",IF(ISBLANK(U55),0,INDEX(Luminaire_Table,MATCH(U55,Luminaire_Types,0),3)))","v":""},null,null,{"$f":"IF(ISBLANK($E55),\"\",Z55*$D55)","v":""},{"$f":"IF(OR(ISBLANK($E55),$D55=0), \"\",IF(ISBLANK(Y55),0,INDEX(Luminaire_Table,MATCH(Y55,Luminaire_Types,0),3)))","v":""},null,null,{"$f":"IF(ISBLANK($E55),\"\",AD55*$D55)","v":""},{"$f":"IF(OR(ISBLANK($E55),$D55=0), \"\",IF(ISBLANK(AC55),0,INDEX(Luminaire_Table,MATCH(AC55,Luminaire_Types,0),3)))","v":""},null,null,{"$f":"IF(ISBLANK($E55),\"\",AH55*$D55)","v":""},{"$f":"IF(OR(ISBLANK($E55),$D55=0), \"\",IF(ISBLANK(AG55),0,INDEX(Luminaire_Table,MATCH(AG55,Luminaire_Types,0),3)))","v":""},null,null,{"$f":"IF(ISBLANK($E55),\"\",AL55*$D55)","v":""},{"$f":"IF(OR(ISBLANK($E55),$D55=0), \"\",IF(ISBLANK(AK55),0,INDEX(Luminaire_Table,MATCH(AK55,Luminaire_Types,0),3)))","v":""},null,null,{"$f":"IF(ISBLANK($E55),\"\",AP55*$D55)","v":""},{"$f":"IF(OR(ISBLANK($E55),$D55=0), \"\",IF(ISBLANK(AO55),0,INDEX(Luminaire_Table,MATCH(AO55,Luminaire_Types,0),3)))","v":""},"","","","","","","","","","",false]
[null,null,null,null,null,null,null,null,null,{"$f":"SUMPRODUCT(J16:OFFSET(J56,-1,0),D16:OFFSET(D56,-1,0))","v":240},null,null,null,null,null,null,null,null,null,null,null,null,null,null,null,null,null,null,null,null,null,null,null,null,null,null,null,null,null,null,null,null,null,null,null,{"$f":"SUM(AT16:OFFSET(AT56,-1,0))","v":{"$error":"#VALUE!"}},{"$f":"SUM(AU16:OFFSET(AU56,-1,0))","v":{"$error":"#N/A"}},{"$f":"SUM(AV16:OFFSET(AV56,-1,0))","v":0},{"$f":"SUM(AW16:OFFSET(AW56,-1,0))","v":{"$error":"#N/A"}},null,{"$f":"SUM(AY16:OFFSET(AY56,-1,0))","v":{"$error":"#N/A"}},{"$f":"SUM(AZ16:OFFSET(AZ56,-1,0))","v":{"$error":"#N/A"}},{"$f":"SUM(BA16:OFFSET(BA56,-1,0))","v":{"$error":"#N/A"}},{"$f":"SUM(BB16:OFFSET(BB56,-1,0))","v":{"$error":"#N/A"}}]

{"sheet":"Exterior","index":5,"n_rows":70,"n_cols":34,"rows_kept":70,"cut":false,"hidden":false,"merged":[[15,29,15,30],[0,2,0,9],[1,2,1,9],[15,24,15,25],[11,2,11,3],[6,4,6,5],[7,4,7,5],[8,4,8,5],[9,4,9,5],[6,2,6,3],[7,2,7,3],[8,2,8,3],[9,2,9,3],[5,2,5,6],[15,9,15,11]]}
[null,null,"New Construction Program"]
[null,null,"Lighting Calculator"]
[null,null,{"$f":"'Basic Lists'!A100","v":"NCP LC v.4.0"}]
[null,null,"Exterior lighting calculator"]
[]
[null,null,"Exterior totals"]
[null,null,"Demand savings",null,{"$f":"$AE$70","v":0},null,"kW"]
[null,null,"Energy savings - LPD",null,{"$f":"$AF$70","v":0},null,"kWh"]
[null,null,"Energy savings - lighting controls",null,{"$f":"$AG$70","v":0},null,"kWh"]
[null,null,"Energy savings - total",null,{"$f":"$AH$70","v":0},null,"kWh"]
[]
[null,null,"Lighting zone"]
[null,null,"Lighting zone"]
[null,null,{"$f":"IF(ProjectZone='Basic Lists'!D5,'Basic Lists'!A104,\"\")","v":""},null,null,null," "]
[]
[null,"hide","Space information",null,null,null,null,null,"hide","Lighting information",null,null,null,null,null,null,null,null,null,null,null,null,null,null,"Calculated values",null,null,null,null,"Savings information"]
[null,"Space","Area name","Space type","Baseline LPD","Annual hours","Surface area / linear length","Lighting control type","Lighting Controls Hour Reduction","Luminaire [type 1]","Quantity [type 1]","W                       [type 1]","Luminaire [type 2]","Quantity [type 2]","W                     [type 2]","Luminaire [type 3]","Quantity [type 3]","W                     [type 3]","Luminaire [type 4]","Quantity [type 4]","W                     [type 4]","Luminaire [type 5]","Quantity [type 5]","W                     [type 5]","Design LPD","Baseline annual lighting energy","Design annual lighting energy","Baseline demand allowance","Design demand","LPD savings","Demand savings","Energy savings - LPD","Energy savings - controls","Energy savings - total"]
[null,"#",null,null,{"$f":"IF(ProjectUnits=\"Imperial\",\"W/sqft\",\"W/sqm\")","v":"W/sqm"},"hrs",{"$f":"IF(ProjectUnits=\"Imperial\",\"sqft\",\"sqm\")","v":"sqm"},null,"%",null,"#","W",null,"#","W",null,"#","W",null,"#","W",null,"#","W",{"$f":"IF(ProjectUnits=\"Imperial\",\"W/sqft\",\"W/sqm\")","v":"W/sqm"},"kWh","kWh","kW","kW",{"$f":"IF(ProjectUnits=\"Imperial\",\"W/sqft\",\"W/sqm\")","v":"W/sqm"},"kW","kWh","kWh","kWh"]
[null,{"$f":"ROW()-18","v":1},null,null,{"$f":"IF(ISBLANK($D19),\"\",IF(ProjectCode=NECB,INDEX(NECB_ExteriorTable,MATCH($D19,NECB_ExteriorSpaces,0),6),IF(ProjectCode=ASHRAE,INDEX(ASHRAE_ExteriorTable,MATCH($D19,ASHRAE_ExteriorSpaces,0),6),\"\")))","v":""},null,null,null,{"$f":"IF(ISBLANK($H19),\"\",INDEX(Exterior_ControlsTable,MATCH($H19,Exterior_ControlsTypes,0),2))","v":""},null,null,{"$f":"IF(ISBLANK($D19), \"\",IF(ISBLANK(J19),0,INDEX(Luminaire_Table,MATCH(J19,Luminaire_Types,0),3)))","v":""},null,null,{"$f":"IF(ISBLANK($D19), \"\",IF(ISBLANK(M19),0,INDEX(Luminaire_Table,MATCH(M19,Luminaire_Types,0),3)))","v":""},null,null,{"$f":"IF(ISBLANK($D19), \"\",IF(ISBLANK(P19),0,INDEX(Luminaire_Table,MATCH(P19,Luminaire_Types,0),3)))","v":""},null,null,{"$f":"IF(ISBLANK($D19), \"\",IF(ISBLANK(S19),0,INDEX(Luminaire_Table,MATCH(S19,Luminaire_Types,0),3)))","v":""},null,null,{"$f":"IF(ISBLANK($D19), \"\",IF(ISBLANK(V19),0,INDEX(Luminaire_Table,MATCH(V19,Luminaire_Types,0),3)))","v":""},{"$f":"IF(ISBLANK($D19),\"\",AC19*1000/G19)","v":""},{"$f":"IF(ISBLANK($D19),\"\",AB19*F19)","v":""},{"$f":"IF(ISBLANK($D19),\"\",AC19*F19*(1-I19))","v":""},{"$f":"IF(ISBLANK($D19),\"\",E19*G19/1000)","v":""},{"$f":"IF(ISBLANK($D19),\"\",(K19*L19+N19*O19+Q19*R19+T19*U19+W19*X19)/1000)","v":""},{"$f":"IF(ISBLANK($D19),\"\",E19-Y19)","v":""},{"$f":"IF(ISBLANK($D19),\"\",AB19-AC19)","v":""},{"$f":"IF(ISBLANK($D19),\"\",AE19*F19)","v":""},{"$f":"IF(ISBLANK($D19),\"\",AC19*F19*I19)","v":""},{"$f":"IF(ISBLANK($D19),\"\",Z19-AA19)","v":""}]
[null,{"$f":"ROW()-18","v":2},null,null,"",null,null,null,"",null,null,{"$f":"IF(ISBLANK($D20), \"\",IF(ISBLANK(J20),0,INDEX(Luminaire_Table,MATCH(J20,Luminaire_Types,0),3)))","v":""},null,null,{"$f":"IF(ISBLANK($D20), \"\",IF(ISBLANK(M20),0,INDEX(Luminaire_Table,MATCH(M20,Luminaire_Types,0),3)))","v":""},null,null,{"$f":"IF(ISBLANK($D20), \"\",IF(ISBLANK(P20),0,INDEX(Luminaire_Table,MATCH(P20,Luminaire_Types,0),3)))","v":""},null,null,{"$f":"IF(ISBLANK($D20), \"\",IF(ISBLANK(S20),0,INDEX(Luminaire_Table,MATCH(S20,Luminaire_Types,0),3)))","v":""},null,null,{"$f":"IF(ISBLANK($D20), \"\",IF(ISBLANK(V20),0,INDEX(Luminaire_Table,MATCH(V20,Luminaire_Types,0),3)))","v":""},"",{"$f":"IF(ISBLANK($D20),\"\",AB20*F20)","v":""},{"$f":"IF(ISBLANK($D20),\"\",AC20*F20*(1-I20))","v":""},"",{"$f":"IF(ISBLANK($D20),\"\",(K20*L20+N20*O20+Q20*R20+T20*U20+W20*X20)/1000)","v":""},"","",{"$f":"IF(ISBLANK($D20),\"\",AE20*F20)","v":""},{"$f":"IF(ISBLANK($D20),\"\",AC20*F20*I20)","v":""},""]
[null,3,null,null,"",null,null,null,"",null,null,{"$f":"IF(ISBLANK($D21), \"\",IF(ISBLANK(J21),0,INDEX(Luminaire_Table,MATCH(J21,Luminaire_Types,0),3)))","v":""},null,null,{"$f":"IF(ISBLANK($D21), \"\",IF(ISBLANK(M21),0,INDEX(Luminaire_Table,MATCH(M21,Luminaire_Types,0),3)))","v":""},null,null,{"$f":"IF(ISBLANK($D21), \"\",IF(ISBLANK(P21),0,INDEX(Luminaire_Table,MATCH(P21,Luminaire_Types,0),3)))","v":""},null,null,{"$f":"IF(ISBLANK($D21), \"\",IF(ISBLANK(S21),0,INDEX(Luminaire_Table,MATCH(S21,Luminaire_Types,0),3)))","v":""},null,null,{"$f":"IF(ISBLANK($D21), \"\",IF(ISBLANK(V21),0,INDEX(Luminaire_Table,MATCH(V21,Luminaire_Types,0),3)))","v":""},"","","","","","","","","",""]
[null,4,null,null,"",null,null,null,"",null,null,{"$f":"IF(ISBLANK($D22), \"\",IF(ISBLANK(J22),0,INDEX(Luminaire_Table,MATCH(J22,Luminaire_Types,0),3)))","v":""},null,null,{"$f":"IF(ISBLANK($D22), \"\",IF(ISBLANK(M22),0,INDEX(Luminaire_Table,MATCH(M22,Luminaire_Types,0),3)))","v":""},null,null,{"$f":"IF(ISBLANK($D22), \"\",IF(ISBLANK(P22),0,INDEX(Luminaire_Table,MATCH(P22,Luminaire_Types,0),3)))","v":""},null,null,{"$f":"IF(ISBLANK($D22), \"\",IF(ISBLANK(S22),0,INDEX(Luminaire_Table,MATCH(S22,Luminaire_Types,0),3)))","v":""},null,null,{"$f":"IF(ISBLANK($D22), \"\",IF(ISBLANK(V22),0,INDEX(Luminaire_Table,MATCH(V22,Luminaire_Types,0),3)))","v":""},"","","","","","","","","",""]
[null,5,null,null,"",null,null,null,"",null,null,{"$f":"IF(ISBLANK($D23), \"\",IF(ISBLANK(J23),0,INDEX(Luminaire_Table,MATCH(J23,Luminaire_Types,0),3)))","v":""},null,null,{"$f":"IF(ISBLANK($D23), \"\",IF(ISBLANK(M23),0,INDEX(Luminaire_Table,MATCH(M23,Luminaire_Types,0),3)))","v":""},null,null,{"$f":"IF(ISBLANK($D23), \"\",IF(ISBLANK(P23),0,INDEX(Luminaire_Table,MATCH(P23,Luminaire_Types,0),3)))","v":""},null,null,{"$f":"IF(ISBLANK($D23), \"\",IF(ISBLANK(S23),0,INDEX(Luminaire_Table,MATCH(S23,Luminaire_Types,0),3)))","v":""},null,null,{"$f":"IF(ISBLANK($D23), \"\",IF(ISBLANK(V23),0,INDEX(Luminaire_Table,MATCH(V23,Luminaire_Types,0),3)))","v":""},"","","","","","","","","",""]
[null,6,null,null,"",null,null,null,"",null,null,{"$f":"IF(ISBLANK($D24), \"\",IF(ISBLANK(J24),0,INDEX(Luminaire_Table,MATCH(J24,Luminaire_Types,0),3)))","v":""},null,null,{"$f":"IF(ISBLANK($D24), \"\",IF(ISBLANK(M24),0,INDEX(Luminaire_Table,MATCH(M24,Luminaire_Types,0),3)))","v":""},null,null,{"$f":"IF(ISBLANK($D24), \"\",IF(ISBLANK(P24),0,INDEX(Luminaire_Table,MATCH(P24,Luminaire_Types,0),3)))","v":""},null,null,{"$f":"IF(ISBLANK($D24), \"\",IF(ISBLANK(S24),0,INDEX(Luminaire_Table,MATCH(S24,Luminaire_Types,0),3)))","v":""},null,null,{"$f":"IF(ISBLANK($D24), \"\",IF(ISBLANK(V24),0,INDEX(Luminaire_Table,MATCH(V24,Luminaire_Types,0),3)))","v":""},"","","","","","","","","",""]
[null,7,null,null,"",null,null,null,"",null,null,{"$f":"IF(ISBLANK($D25), \"\",IF(ISBLANK(J25),0,INDEX(Luminaire_Table,MATCH(J25,Luminaire_Types,0),3)))","v":""},null,null,{"$f":"IF(ISBLANK($D25), \"\",IF(ISBLANK(M25),0,INDEX(Luminaire_Table,MATCH(M25,Luminaire_Types,0),3)))","v":""},null,null,{"$f":"IF(ISBLANK($D25), \"\",IF(ISBLANK(P25),0,INDEX(Luminaire_Table,MATCH(P25,Luminaire_Types,0),3)))","v":""},null,null,{"$f":"IF(ISBLANK($D25), \"\",IF(ISBLANK(S25),0,INDEX(Luminaire_Table,MATCH(S25,Luminaire_Types,0),3)))","v":""},null,null,{"$f":"IF(ISBLANK($D25), \"\",IF(ISBLANK(V25),0,INDEX(Luminaire_Table,MATCH(V25,Luminaire_Types,0),3)))","v":""},"","","","","","","","","",""]
[null,8,null,null,"",null,null,null,"",null,null,{"$f":"IF(ISBLANK($D26), \"\",IF(ISBLANK(J26),0,INDEX(Luminaire_Table,MATCH(J26,Luminaire_Types,0),3)))","v":""},null,null,{"$f":"IF(ISBLANK($D26), \"\",IF(ISBLANK(M26),0,INDEX(Luminaire_Table,MATCH(M26,Luminaire_Types,0),3)))","v":""},null,null,{"$f":"IF(ISBLANK($D26), \"\",IF(ISBLANK(P26),0,INDEX(Luminaire_Table,MATCH(P26,Luminaire_Types,0),3)))","v":""},null,null,{"$f":"IF(ISBLANK($D26), \"\",IF(ISBLANK(S26),0,INDEX(Luminaire_Table,MATCH(S26,Luminaire_Types,0),3)))","v":""},null,null,{"$f":"IF(ISBLANK($D26), \"\",IF(ISBLANK(V26),0,INDEX(Luminaire_Table,MATCH(V26,Luminaire_Types,0),3)))","v":""},"","","","","","","","","",""]
[null,9,null,null,"",null,null,null,"",null,null,{"$f":"IF(ISBLANK($D27), \"\",IF(ISBLANK(J27),0,INDEX(Luminaire_Table,MATCH(J27,Luminaire_Types,0),3)))","v":""},null,null,{"$f":"IF(ISBLANK($D27), \"\",IF(ISBLANK(M27),0,INDEX(Luminaire_Table,MATCH(M27,Luminaire_Types,0),3)))","v":""},null,null,{"$f":"IF(ISBLANK($D27), \"\",IF(ISBLANK(P27),0,INDEX(Luminaire_Table,MATCH(P27,Luminaire_Types,0),3)))","v":""},null,null,{"$f":"IF(ISBLANK($D27), \"\",IF(ISBLANK(S27),0,INDEX(Luminaire_Table,MATCH(S27,Luminaire_Types,0),3)))","v":""},null,null,{"$f":"IF(ISBLANK($D27), \"\",IF(ISBLANK(V27),0,INDEX(Luminaire_Table,MATCH(V27,Luminaire_Types,0),3)))","v":""},"","","","","","","","","",""]
[null,10,null,null,"",null,null,null,"",null,null,{"$f":"IF(ISBLANK($D28), \"\",IF(ISBLANK(J28),0,INDEX(Luminaire_Table,MATCH(J28,Luminaire_Types,0),3)))","v":""},null,null,{"$f":"IF(ISBLANK($D28), \"\",IF(ISBLANK(M28),0,INDEX(Luminaire_Table,MATCH(M28,Luminaire_Types,0),3)))","v":""},null,null,{"$f":"IF(ISBLANK($D28), \"\",IF(ISBLANK(P28),0,INDEX(Luminaire_Table,MATCH(P28,Luminaire_Types,0),3)))","v":""},null,null,{"$f":"IF(ISBLANK($D28), \"\",IF(ISBLANK(S28),0,INDEX(Luminaire_Table,MATCH(S28,Luminaire_Types,0),3)))","v":""},null,null,{"$f":"IF(ISBLANK($D28), \"\",IF(ISBLANK(V28),0,INDEX(Luminaire_Table,MATCH(V28,Luminaire_Types,0),3)))","v":""},"","","","","","","","","",""]
[null,11,null,null,"",null,null,null,"",null,null,{"$f":"IF(ISBLANK($D29), \"\",IF(ISBLANK(J29),0,INDEX(Luminaire_Table,MATCH(J29,Luminaire_Types,0),3)))","v":""},null,null,{"$f":"IF(ISBLANK($D29), \"\",IF(ISBLANK(M29),0,INDEX(Luminaire_Table,MATCH(M29,Luminaire_Types,0),3)))","v":""},null,null,{"$f":"IF(ISBLANK($D29), \"\",IF(ISBLANK(P29),0,INDEX(Luminaire_Table,MATCH(P29,Luminaire_Types,0),3)))","v":""},null,null,{"$f":"IF(ISBLANK($D29), \"\",IF(ISBLANK(S29),0,INDEX(Luminaire_Table,MATCH(S29,Luminaire_Types,0),3)))","v":""},null,null,{"$f":"IF(ISBLANK($D29), \"\",IF(ISBLANK(V29),0,INDEX(Luminaire_Table,MATCH(V29,Luminaire_Types,0),3)))","v":""},"","","","","","","","","",""]
[null,12,null,null,"",null,null,null,"",null,null,{"$f":"IF(ISBLANK($D30), \"\",IF(ISBLANK(J30),0,INDEX(Luminaire_Table,MATCH(J30,Luminaire_Types,0),3)))","v":""},null,null,{"$f":"IF(ISBLANK($D30), \"\",IF(ISBLANK(M30),0,INDEX(Luminaire_Table,MATCH(M30,Luminaire_Types,0),3)))","v":""},null,null,{"$f":"IF(ISBLANK($D30), \"\",IF(ISBLANK(P30),0,INDEX(Luminaire_Table,MATCH(P30,Luminaire_Types,0),3)))","v":""},null,null,{"$f":"IF(ISBLANK($D30), \"\",IF(ISBLANK(S30),0,INDEX(Luminaire_Table,MATCH(S30,Luminaire_Types,0),3)))","v":""},null,null,{"$f":"IF(ISBLANK($D30), \"\",IF(ISBLANK(V30),0,INDEX(Luminaire_Table,MATCH(V30,Luminaire_Types,0),3)))","v":""},"","","","","","","","","",""]
[null,13,null,null,"",null,null,null,"",null,null,{"$f":"IF(ISBLANK($D31), \"\",IF(ISBLANK(J31),0,INDEX(Luminaire_Table,MATCH(J31,Luminaire_Types,0),3)))","v":""},null,null,{"$f":"IF(ISBLANK($D31), \"\",IF(ISBLANK(M31),0,INDEX(Luminaire_Table,MATCH(M31,Luminaire_Types,0),3)))","v":""},null,null,{"$f":"IF(ISBLANK($D31), \"\",IF(ISBLANK(P31),0,INDEX(Luminaire_Table,MATCH(P31,Luminaire_Types,0),3)))","v":""},null,null,{"$f":"IF(ISBLANK($D31), \"\",IF(ISBLANK(S31),0,INDEX(Luminaire_Table,MATCH(S31,Luminaire_Types,0),3)))","v":""},null,null,{"$f":"IF(ISBLANK($D31), \"\",IF(ISBLANK(V31),0,INDEX(Luminaire_Table,MATCH(V31,Luminaire_Types,0),3)))","v":""},"","","","","","","","","",""]
[null,14,null,null,"",null,null,null,"",null,null,{"$f":"IF(ISBLANK($D32), \"\",IF(ISBLANK(J32),0,INDEX(Luminaire_Table,MATCH(J32,Luminaire_Types,0),3)))","v":""},null,null,{"$f":"IF(ISBLANK($D32), \"\",IF(ISBLANK(M32),0,INDEX(Luminaire_Table,MATCH(M32,Luminaire_Types,0),3)))","v":""},null,null,{"$f":"IF(ISBLANK($D32), \"\",IF(ISBLANK(P32),0,INDEX(Luminaire_Table,MATCH(P32,Luminaire_Types,0),3)))","v":""},null,null,{"$f":"IF(ISBLANK($D32), \"\",IF(ISBLANK(S32),0,INDEX(Luminaire_Table,MATCH(S32,Luminaire_Types,0),3)))","v":""},null,null,{"$f":"IF(ISBLANK($D32), \"\",IF(ISBLANK(V32),0,INDEX(Luminaire_Table,MATCH(V32,Luminaire_Types,0),3)))","v":""},"","","","","","","","","",""]
[null,15,null,null,"",null,null,null,"",null,null,{"$f":"IF(ISBLANK($D33), \"\",IF(ISBLANK(J33),0,INDEX(Luminaire_Table,MATCH(J33,Luminaire_Types,0),3)))","v":""},null,null,{"$f":"IF(ISBLANK($D33), \"\",IF(ISBLANK(M33),0,INDEX(Luminaire_Table,MATCH(M33,Luminaire_Types,0),3)))","v":""},null,null,{"$f":"IF(ISBLANK($D33), \"\",IF(ISBLANK(P33),0,INDEX(Luminaire_Table,MATCH(P33,Luminaire_Types,0),3)))","v":""},null,null,{"$f":"IF(ISBLANK($D33), \"\",IF(ISBLANK(S33),0,INDEX(Luminaire_Table,MATCH(S33,Luminaire_Types,0),3)))","v":""},null,null,{"$f":"IF(ISBLANK($D33), \"\",IF(ISBLANK(V33),0,INDEX(Luminaire_Table,MATCH(V33,Luminaire_Types,0),3)))","v":""},"","","","","","","","","",""]
[null,16,null,null,"",null,null,null,"",null,null,{"$f":"IF(ISBLANK($D34), \"\",IF(ISBLANK(J34),0,INDEX(Luminaire_Table,MATCH(J34,Luminaire_Types,0),3)))","v":""},null,null,{"$f":"IF(ISBLANK($D34), \"\",IF(ISBLANK(M34),0,INDEX(Luminaire_Table,MATCH(M34,Luminaire_Types,0),3)))","v":""},null,null,{"$f":"IF(ISBLANK($D34), \"\",IF(ISBLANK(P34),0,INDEX(Luminaire_Table,MATCH(P34,Luminaire_Types,0),3)))","v":""},null,null,{"$f":"IF(ISBLANK($D34), \"\",IF(ISBLANK(S34),0,INDEX(Luminaire_Table,MATCH(S34,Luminaire_Types,0),3)))","v":""},null,null,{"$f":"IF(ISBLANK($D34), \"\",IF(ISBLANK(V34),0,INDEX(Luminaire_Table,MATCH(V34,Luminaire_Types,0),3)))","v":""},"","","","","","","","","",""]
[null,17,null,null,"",null,null,null,"",null,null,{"$f":"IF(ISBLANK($D35), \"\",IF(ISBLANK(J35),0,INDEX(Luminaire_Table,MATCH(J35,Luminaire_Types,0),3)))","v":""},null,null,{"$f":"IF(ISBLANK($D35), \"\",IF(ISBLANK(M35),0,INDEX(Luminaire_Table,MATCH(M35,Luminaire_Types,0),3)))","v":""},null,null,{"$f":"IF(ISBLANK($D35), \"\",IF(ISBLANK(P35),0,INDEX(Luminaire_Table,MATCH(P35,Luminaire_Types,0),3)))","v":""},null,null,{"$f":"IF(ISBLANK($D35), \"\",IF(ISBLANK(S35),0,INDEX(Luminaire_Table,MATCH(S35,Luminaire_Types,0),3)))","v":""},null,null,{"$f":"IF(ISBLANK($D35), \"\",IF(ISBLANK(V35),0,INDEX(Luminaire_Table,MATCH(V35,Luminaire_Types,0),3)))","v":""},"","","","","","","","","",""]
[null,18,null,null,"",null,null,null,"",null,null,{"$f":"IF(ISBLANK($D36), \"\",IF(ISBLANK(J36),0,INDEX(Luminaire_Table,MATCH(J36,Luminaire_Types,0),3)))","v":""},null,null,{"$f":"IF(ISBLANK($D36), \"\",IF(ISBLANK(M36),0,INDEX(Luminaire_Table,MATCH(M36,Luminaire_Types,0),3)))","v":""},null,null,{"$f":"IF(ISBLANK($D36), \"\",IF(ISBLANK(P36),0,INDEX(Luminaire_Table,MATCH(P36,Luminaire_Types,0),3)))","v":""},null,null,{"$f":"IF(ISBLANK($D36), \"\",IF(ISBLANK(S36),0,INDEX(Luminaire_Table,MATCH(S36,Luminaire_Types,0),3)))","v":""},null,null,{"$f":"IF(ISBLANK($D36), \"\",IF(ISBLANK(V36),0,INDEX(Luminaire_Table,MATCH(V36,Luminaire_Types,0),3)))","v":""},"","","","","","","","","",""]
[null,19,null,null,"",null,null,null,"",null,null,{"$f":"IF(ISBLANK($D37), \"\",IF(ISBLANK(J37),0,INDEX(Luminaire_Table,MATCH(J37,Luminaire_Types,0),3)))","v":""},null,null,{"$f":"IF(ISBLANK($D37), \"\",IF(ISBLANK(M37),0,INDEX(Luminaire_Table,MATCH(M37,Luminaire_Types,0),3)))","v":""},null,null,{"$f":"IF(ISBLANK($D37), \"\",IF(ISBLANK(P37),0,INDEX(Luminaire_Table,MATCH(P37,Luminaire_Types,0),3)))","v":""},null,null,{"$f":"IF(ISBLANK($D37), \"\",IF(ISBLANK(S37),0,INDEX(Luminaire_Table,MATCH(S37,Luminaire_Types,0),3)))","v":""},null,null,{"$f":"IF(ISBLANK($D37), \"\",IF(ISBLANK(V37),0,INDEX(Luminaire_Table,MATCH(V37,Luminaire_Types,0),3)))","v":""},"","","","","","","","","",""]
[null,20,null,null,"",null,null,null,"",null,null,{"$f":"IF(ISBLANK($D38), \"\",IF(ISBLANK(J38),0,INDEX(Luminaire_Table,MATCH(J38,Luminaire_Types,0),3)))","v":""},null,null,{"$f":"IF(ISBLANK($D38), \"\",IF(ISBLANK(M38),0,INDEX(Luminaire_Table,MATCH(M38,Luminaire_Types,0),3)))","v":""},null,null,{"$f":"IF(ISBLANK($D38), \"\",IF(ISBLANK(P38),0,INDEX(Luminaire_Table,MATCH(P38,Luminaire_Types,0),3)))","v":""},null,null,{"$f":"IF(ISBLANK($D38), \"\",IF(ISBLANK(S38),0,INDEX(Luminaire_Table,MATCH(S38,Luminaire_Types,0),3)))","v":""},null,null,{"$f":"IF(ISBLANK($D38), \"\",IF(ISBLANK(V38),0,INDEX(Luminaire_Table,MATCH(V38,Luminaire_Types,0),3)))","v":""},"","","","","","","","","",""]
[null,21,null,null,"",null,null,null,"",null,null,{"$f":"IF(ISBLANK($D39), \"\",IF(ISBLANK(J39),0,INDEX(Luminaire_Table,MATCH(J39,Luminaire_Types,0),3)))","v":""},null,null,{"$f":"IF(ISBLANK($D39), \"\",IF(ISBLANK(M39),0,INDEX(Luminaire_Table,MATCH(M39,Luminaire_Types,0),3)))","v":""},null,null,{"$f":"IF(ISBLANK($D39), \"\",IF(ISBLANK(P39),0,INDEX(Luminaire_Table,MATCH(P39,Luminaire_Types,0),3)))","v":""},null,null,{"$f":"IF(ISBLANK($D39), \"\",IF(ISBLANK(S39),0,INDEX(Luminaire_Table,MATCH(S39,Luminaire_Types,0),3)))","v":""},null,null,{"$f":"IF(ISBLANK($D39), \"\",IF(ISBLANK(V39),0,INDEX(Luminaire_Table,MATCH(V39,Luminaire_Types,0),3)))","v":""},"","","","","","","","","",""]
[null,22,null,null,"",null,null,null,"",null,null,{"$f":"IF(ISBLANK($D40), \"\",IF(ISBLANK(J40),0,INDEX(Luminaire_Table,MATCH(J40,Luminaire_Types,0),3)))","v":""},null,null,{"$f":"IF(ISBLANK($D40), \"\",IF(ISBLANK(M40),0,INDEX(Luminaire_Table,MATCH(M40,Luminaire_Types,0),3)))","v":""},null,null,{"$f":"IF(ISBLANK($D40), \"\",IF(ISBLANK(P40),0,INDEX(Luminaire_Table,MATCH(P40,Luminaire_Types,0),3)))","v":""},null,null,{"$f":"IF(ISBLANK($D40), \"\",IF(ISBLANK(S40),0,INDEX(Luminaire_Table,MATCH(S40,Luminaire_Types,0),3)))","v":""},null,null,{"$f":"IF(ISBLANK($D40), \"\",IF(ISBLANK(V40),0,INDEX(Luminaire_Table,MATCH(V40,Luminaire_Types,0),3)))","v":""},"","","","","","","","","",""]
[null,23,null,null,"",null,null,null,"",null,null,{"$f":"IF(ISBLANK($D41), \"\",IF(ISBLANK(J41),0,INDEX(Luminaire_Table,MATCH(J41,Luminaire_Types,0),3)))","v":""},null,null,{"$f":"IF(ISBLANK($D41), \"\",IF(ISBLANK(M41),0,INDEX(Luminaire_Table,MATCH(M41,Luminaire_Types,0),3)))","v":""},null,null,{"$f":"IF(ISBLANK($D41), \"\",IF(ISBLANK(P41),0,INDEX(Luminaire_Table,MATCH(P41,Luminaire_Types,0),3)))","v":""},null,null,{"$f":"IF(ISBLANK($D41), \"\",IF(ISBLANK(S41),0,INDEX(Luminaire_Table,MATCH(S41,Luminaire_Types,0),3)))","v":""},null,null,{"$f":"IF(ISBLANK($D41), \"\",IF(ISBLANK(V41),0,INDEX(Luminaire_Table,MATCH(V41,Luminaire_Types,0),3)))","v":""},"","","","","","","","","",""]
[null,24,null,null,"",null,null,null,"",null,null,{"$f":"IF(ISBLANK($D42), \"\",IF(ISBLANK(J42),0,INDEX(Luminaire_Table,MATCH(J42,Luminaire_Types,0),3)))","v":""},null,null,{"$f":"IF(ISBLANK($D42), \"\",IF(ISBLANK(M42),0,INDEX(Luminaire_Table,MATCH(M42,Luminaire_Types,0),3)))","v":""},null,null,{"$f":"IF(ISBLANK($D42), \"\",IF(ISBLANK(P42),0,INDEX(Luminaire_Table,MATCH(P42,Luminaire_Types,0),3)))","v":""},null,null,{"$f":"IF(ISBLANK($D42), \"\",IF(ISBLANK(S42),0,INDEX(Luminaire_Table,MATCH(S42,Luminaire_Types,0),3)))","v":""},null,null,{"$f":"IF(ISBLANK($D42), \"\",IF(ISBLANK(V42),0,INDEX(Luminaire_Table,MATCH(V42,Luminaire_Types,0),3)))","v":""},"","","","","","","","","",""]
[null,25,null,null,"",null,null,null,"",null,null,{"$f":"IF(ISBLANK($D43), \"\",IF(ISBLANK(J43),0,INDEX(Luminaire_Table,MATCH(J43,Luminaire_Types,0),3)))","v":""},null,null,{"$f":"IF(ISBLANK($D43), \"\",IF(ISBLANK(M43),0,INDEX(Luminaire_Table,MATCH(M43,Luminaire_Types,0),3)))","v":""},null,null,{"$f":"IF(ISBLANK($D43), \"\",IF(ISBLANK(P43),0,INDEX(Luminaire_Table,MATCH(P43,Luminaire_Types,0),3)))","v":""},null,null,{"$f":"IF(ISBLANK($D43), \"\",IF(ISBLANK(S43),0,INDEX(Luminaire_Table,MATCH(S43,Luminaire_Types,0),3)))","v":""},null,null,{"$f":"IF(ISBLANK($D43), \"\",IF(ISBLANK(V43),0,INDEX(Luminaire_Table,MATCH(V43,Luminaire_Types,0),3)))","v":""},"","","","","","","","","",""]
[null,26,null,null,"",null,null,null,"",null,null,{"$f":"IF(ISBLANK($D44), \"\",IF(ISBLANK(J44),0,INDEX(Luminaire_Table,MATCH(J44,Luminaire_Types,0),3)))","v":""},null,null,{"$f":"IF(ISBLANK($D44), \"\",IF(ISBLANK(M44),0,INDEX(Luminaire_Table,MATCH(M44,Luminaire_Types,0),3)))","v":""},null,null,{"$f":"IF(ISBLANK($D44), \"\",IF(ISBLANK(P44),0,INDEX(Luminaire_Table,MATCH(P44,Luminaire_Types,0),3)))","v":""},null,null,{"$f":"IF(ISBLANK($D44), \"\",IF(ISBLANK(S44),0,INDEX(Luminaire_Table,MATCH(S44,Luminaire_Types,0),3)))","v":""},null,null,{"$f":"IF(ISBLANK($D44), \"\",IF(ISBLANK(V44),0,INDEX(Luminaire_Table,MATCH(V44,Luminaire_Types,0),3)))","v":""},"","","","","","","","","",""]
[null,27,null,null,"",null,null,null,"",null,null,{"$f":"IF(ISBLANK($D45), \"\",IF(ISBLANK(J45),0,INDEX(Luminaire_Table,MATCH(J45,Luminaire_Types,0),3)))","v":""},null,null,{"$f":"IF(ISBLANK($D45), \"\",IF(ISBLANK(M45),0,INDEX(Luminaire_Table,MATCH(M45,Luminaire_Types,0),3)))","v":""},null,null,{"$f":"IF(ISBLANK($D45), \"\",IF(ISBLANK(P45),0,INDEX(Luminaire_Table,MATCH(P45,Luminaire_Types,0),3)))","v":""},null,null,{"$f":"IF(ISBLANK($D45), \"\",IF(ISBLANK(S45),0,INDEX(Luminaire_Table,MATCH(S45,Luminaire_Types,0),3)))","v":""},null,null,{"$f":"IF(ISBLANK($D45), \"\",IF(ISBLANK(V45),0,INDEX(Luminaire_Table,MATCH(V45,Luminaire_Types,0),3)))","v":""},"","","","","","","","","",""]
[null,28,null,null,"",null,null,null,"",null,null,{"$f":"IF(ISBLANK($D46), \"\",IF(ISBLANK(J46),0,INDEX(Luminaire_Table,MATCH(J46,Luminaire_Types,0),3)))","v":""},null,null,{"$f":"IF(ISBLANK($D46), \"\",IF(ISBLANK(M46),0,INDEX(Luminaire_Table,MATCH(M46,Luminaire_Types,0),3)))","v":""},null,null,{"$f":"IF(ISBLANK($D46), \"\",IF(ISBLANK(P46),0,INDEX(Luminaire_Table,MATCH(P46,Luminaire_Types,0),3)))","v":""},null,null,{"$f":"IF(ISBLANK($D46), \"\",IF(ISBLANK(S46),0,INDEX(Luminaire_Table,MATCH(S46,Luminaire_Types,0),3)))","v":""},null,null,{"$f":"IF(ISBLANK($D46), \"\",IF(ISBLANK(V46),0,INDEX(Luminaire_Table,MATCH(V46,Luminaire_Types,0),3)))","v":""},"","","","","","","","","",""]
[null,29,null,null,"",null,null,null,"",null,null,{"$f":"IF(ISBLANK($D47), \"\",IF(ISBLANK(J47),0,INDEX(Luminaire_Table,MATCH(J47,Luminaire_Types,0),3)))","v":""},null,null,{"$f":"IF(ISBLANK($D47), \"\",IF(ISBLANK(M47),0,INDEX(Luminaire_Table,MATCH(M47,Luminaire_Types,0),3)))","v":""},null,null,{"$f":"IF(ISBLANK($D47), \"\",IF(ISBLANK(P47),0,INDEX(Luminaire_Table,MATCH(P47,Luminaire_Types,0),3)))","v":""},null,null,{"$f":"IF(ISBLANK($D47), \"\",IF(ISBLANK(S47),0,INDEX(Luminaire_Table,MATCH(S47,Luminaire_Types,0),3)))","v":""},null,null,{"$f":"IF(ISBLANK($D47), \"\",IF(ISBLANK(V47),0,INDEX(Luminaire_Table,MATCH(V47,Luminaire_Types,0),3)))","v":""},"","","","","","","","","",""]
[null,30,null,null,"",null,null,null,"",null,null,{"$f":"IF(ISBLANK($D48), \"\",IF(ISBLANK(J48),0,INDEX(Luminaire_Table,MATCH(J48,Luminaire_Types,0),3)))","v":""},null,null,{"$f":"IF(ISBLANK($D48), \"\",IF(ISBLANK(M48),0,INDEX(Luminaire_Table,MATCH(M48,Luminaire_Types,0),3)))","v":""},null,null,{"$f":"IF(ISBLANK($D48), \"\",IF(ISBLANK(P48),0,INDEX(Luminaire_Table,MATCH(P48,Luminaire_Types,0),3)))","v":""},null,null,{"$f":"IF(ISBLANK($D48), \"\",IF(ISBLANK(S48),0,INDEX(Luminaire_Table,MATCH(S48,Luminaire_Types,0),3)))","v":""},null,null,{"$f":"IF(ISBLANK($D48), \"\",IF(ISBLANK(V48),0,INDEX(Luminaire_Table,MATCH(V48,Luminaire_Types,0),3)))","v":""},"","","","","","","","","",""]
[null,31,null,null,"",null,null,null,"",null,null,{"$f":"IF(ISBLANK($D49), \"\",IF(ISBLANK(J49),0,INDEX(Luminaire_Table,MATCH(J49,Luminaire_Types,0),3)))","v":""},null,null,{"$f":"IF(ISBLANK($D49), \"\",IF(ISBLANK(M49),0,INDEX(Luminaire_Table,MATCH(M49,Luminaire_Types,0),3)))","v":""},null,null,{"$f":"IF(ISBLANK($D49), \"\",IF(ISBLANK(P49),0,INDEX(Luminaire_Table,MATCH(P49,Luminaire_Types,0),3)))","v":""},null,null,{"$f":"IF(ISBLANK($D49), \"\",IF(ISBLANK(S49),0,INDEX(Luminaire_Table,MATCH(S49,Luminaire_Types,0),3)))","v":""},null,null,{"$f":"IF(ISBLANK($D49), \"\",IF(ISBLANK(V49),0,INDEX(Luminaire_Table,MATCH(V49,Luminaire_Types,0),3)))","v":""},"","","","","","","","","",""]
[null,null,null,null,{"$f":"IF(ISBLANK($D50),\"\",IF(ProjectCode=NECB,INDEX(NECB_ExteriorTable,MATCH($D50,NECB_ExteriorSpaces,0),6),IF(ProjectCode=ASHRAE,INDEX(ASHRAE_ExteriorTable,MATCH($D50,ASHRAE_ExteriorSpaces,0),6),\"\")))","v":""},null,null,null,{"$f":"IF(ISBLANK($H50),\"\",INDEX(Exterior_ControlsTable,MATCH($H50,Exterior_ControlsTypes,0),2))","v":""},null,null,{"$f":"IF(ISBLANK($D50), \"\",IF(ISBLANK(J50),0,INDEX(Luminaire_Table,MATCH(J50,Luminaire_Types,0),3)))","v":""},null,null,{"$f":"IF(ISBLANK($D50), \"\",IF(ISBLANK(M50),0,INDEX(Luminaire_Table,MATCH(M50,Luminaire_Types,0),3)))","v":""},null,null,{"$f":"IF(ISBLANK($D50), \"\",IF(ISBLANK(P50),0,INDEX(Luminaire_Table,MATCH(P50,Luminaire_Types,0),3)))","v":""},null,null,{"$f":"IF(ISBLANK($D50), \"\",IF(ISBLANK(S50),0,INDEX(Luminaire_Table,MATCH(S50,Luminaire_Types,0),3)))","v":""},null,null,{"$f":"IF(ISBLANK($D50), \"\",IF(ISBLANK(V50),0,INDEX(Luminaire_Table,MATCH(V50,Luminaire_Types,0),3)))","v":""},"","","","","","","","","",""]
[null,null,null,null,"",null,null,null,"",null,null,{"$f":"IF(ISBLANK($D51), \"\",IF(ISBLANK(J51),0,INDEX(Luminaire_Table,MATCH(J51,Luminaire_Types,0),3)))","v":""},null,null,{"$f":"IF(ISBLANK($D51), \"\",IF(ISBLANK(M51),0,INDEX(Luminaire_Table,MATCH(M51,Luminaire_Types,0),3)))","v":""},null,null,{"$f":"IF(ISBLANK($D51), \"\",IF(ISBLANK(P51),0,INDEX(Luminaire_Table,MATCH(P51,Luminaire_Types,0),3)))","v":""},null,null,{"$f":"IF(ISBLANK($D51), \"\",IF(ISBLANK(S51),0,INDEX(Luminaire_Table,MATCH(S51,Luminaire_Types,0),3)))","v":""},null,null,{"$f":"IF(ISBLANK($D51), \"\",IF(ISBLANK(V51),0,INDEX(Luminaire_Table,MATCH(V51,Luminaire_Types,0),3)))","v":""},"","","","","","","","","",""]
[null,null,null,null,"",null,null,null,"",null,null,{"$f":"IF(ISBLANK($D52), \"\",IF(ISBLANK(J52),0,INDEX(Luminaire_Table,MATCH(J52,Luminaire_Types,0),3)))","v":""},null,null,{"$f":"IF(ISBLANK($D52), \"\",IF(ISBLANK(M52),0,INDEX(Luminaire_Table,MATCH(M52,Luminaire_Types,0),3)))","v":""},null,null,{"$f":"IF(ISBLANK($D52), \"\",IF(ISBLANK(P52),0,INDEX(Luminaire_Table,MATCH(P52,Luminaire_Types,0),3)))","v":""},null,null,{"$f":"IF(ISBLANK($D52), \"\",IF(ISBLANK(S52),0,INDEX(Luminaire_Table,MATCH(S52,Luminaire_Types,0),3)))","v":""},null,null,{"$f":"IF(ISBLANK($D52), \"\",IF(ISBLANK(V52),0,INDEX(Luminaire_Table,MATCH(V52,Luminaire_Types,0),3)))","v":""},"","","","","","","","","",""]
[null,null,null,null,"",null,null,null,"",null,null,{"$f":"IF(ISBLANK($D53), \"\",IF(ISBLANK(J53),0,INDEX(Luminaire_Table,MATCH(J53,Luminaire_Types,0),3)))","v":""},null,null,{"$f":"IF(ISBLANK($D53), \"\",IF(ISBLANK(M53),0,INDEX(Luminaire_Table,MATCH(M53,Luminaire_Types,0),3)))","v":""},null,null,{"$f":"IF(ISBLANK($D53), \"\",IF(ISBLANK(P53),0,INDEX(Luminaire_Table,MATCH(P53,Luminaire_Types,0),3)))","v":""},null,null,{"$f":"IF(ISBLANK($D53), \"\",IF(ISBLANK(S53),0,INDEX(Luminaire_Table,MATCH(S53,Luminaire_Types,0),3)))","v":""},null,null,{"$f":"IF(ISBLANK($D53), \"\",IF(ISBLANK(V53),0,INDEX(Luminaire_Table,MATCH(V53,Luminaire_Types,0),3)))","v":""},"","","","","","","","","",""]
[null,null,null,null,"",null,null,null,"",null,null,{"$f":"IF(ISBLANK($D54), \"\",IF(ISBLANK(J54),0,INDEX(Luminaire_Table,MATCH(J54,Luminaire_Types,0),3)))","v":""},null,null,{"$f":"IF(ISBLANK($D54), \"\",IF(ISBLANK(M54),0,INDEX(Luminaire_Table,MATCH(M54,Luminaire_Types,0),3)))","v":""},null,null,{"$f":"IF(ISBLANK($D54), \"\",IF(ISBLANK(P54),0,INDEX(Luminaire_Table,MATCH(P54,Luminaire_Types,0),3)))","v":""},null,null,{"$f":"IF(ISBLANK($D54), \"\",IF(ISBLANK(S54),0,INDEX(Luminaire_Table,MATCH(S54,Luminaire_Types,0),3)))","v":""},null,null,{"$f":"IF(ISBLANK($D54), \"\",IF(ISBLANK(V54),0,INDEX(Luminaire_Table,MATCH(V54,Luminaire_Types,0),3)))","v":""},"","","","","","","","","",""]
[null,null,null,null,"",null,null,null,"",null,null,{"$f":"IF(ISBLANK($D55), \"\",IF(ISBLANK(J55),0,INDEX(Luminaire_Table,MATCH(J55,Luminaire_Types,0),3)))","v":""},null,null,{"$f":"IF(ISBLANK($D55), \"\",IF(ISBLANK(M55),0,INDEX(Luminaire_Table,MATCH(M55,Luminaire_Types,0),3)))","v":""},null,null,{"$f":"IF(ISBLANK($D55), \"\",IF(ISBLANK(P55),0,INDEX(Luminaire_Table,MATCH(P55,Luminaire_Types,0),3)))","v":""},null,null,{"$f":"IF(ISBLANK($D55), \"\",IF(ISBLANK(S55),0,INDEX(Luminaire_Table,MATCH(S55,Luminaire_Types,0),3)))","v":""},null,null,{"$f":"IF(ISBLANK($D55), \"\",IF(ISBLANK(V55),0,INDEX(Luminaire_Table,MATCH(V55,Luminaire_Types,0),3)))","v":""},"","","","","","","","","",""]
[null,null,null,null,"",null,null,null,"",null,null,{"$f":"IF(ISBLANK($D56), \"\",IF(ISBLANK(J56),0,INDEX(Luminaire_Table,MATCH(J56,Luminaire_Types,0),3)))","v":""},null,null,{"$f":"IF(ISBLANK($D56), \"\",IF(ISBLANK(M56),0,INDEX(Luminaire_Table,MATCH(M56,Luminaire_Types,0),3)))","v":""},null,null,{"$f":"IF(ISBLANK($D56), \"\",IF(ISBLANK(P56),0,INDEX(Luminaire_Table,MATCH(P56,Luminaire_Types,0),3)))","v":""},null,null,{"$f":"IF(ISBLANK($D56), \"\",IF(ISBLANK(S56),0,INDEX(Luminaire_Table,MATCH(S56,Luminaire_Types,0),3)))","v":""},null,null,{"$f":"IF(ISBLANK($D56), \"\",IF(ISBLANK(V56),0,INDEX(Luminaire_Table,MATCH(V56,Luminaire_Types,0),3)))","v":""},"","","","","","","","","",""]
[null,null,null,null,"",null,null,null,"",null,null,{"$f":"IF(ISBLANK($D57), \"\",IF(ISBLANK(J57),0,INDEX(Luminaire_Table,MATCH(J57,Luminaire_Types,0),3)))","v":""},null,null,{"$f":"IF(ISBLANK($D57), \"\",IF(ISBLANK(M57),0,INDEX(Luminaire_Table,MATCH(M57,Luminaire_Types,0),3)))","v":""},null,null,{"$f":"IF(ISBLANK($D57), \"\",IF(ISBLANK(P57),0,INDEX(Luminaire_Table,MATCH(P57,Luminaire_Types,0),3)))","v":""},null,null,{"$f":"IF(ISBLANK($D57), \"\",IF(ISBLANK(S57),0,INDEX(Luminaire_Table,MATCH(S57,Luminaire_Types,0),3)))","v":""},null,null,{"$f":"IF(ISBLANK($D57), \"\",IF(ISBLANK(V57),0,INDEX(Luminaire_Table,MATCH(V57,Luminaire_Types,0),3)))","v":""},"","","","","","","","","",""]
[null,null,null,null,"",null,null,null,"",null,null,{"$f":"IF(ISBLANK($D58), \"\",IF(ISBLANK(J58),0,INDEX(Luminaire_Table,MATCH(J58,Luminaire_Types,0),3)))","v":""},null,null,{"$f":"IF(ISBLANK($D58), \"\",IF(ISBLANK(M58),0,INDEX(Luminaire_Table,MATCH(M58,Luminaire_Types,0),3)))","v":""},null,null,{"$f":"IF(ISBLANK($D58), \"\",IF(ISBLANK(P58),0,INDEX(Luminaire_Table,MATCH(P58,Luminaire_Types,0),3)))","v":""},null,null,{"$f":"IF(ISBLANK($D58), \"\",IF(ISBLANK(S58),0,INDEX(Luminaire_Table,MATCH(S58,Luminaire_Types,0),3)))","v":""},null,null,{"$f":"IF(ISBLANK($D58), \"\",IF(ISBLANK(V58),0,INDEX(Luminaire_Table,MATCH(V58,Luminaire_Types,0),3)))","v":""},"","","","","","","","","",""]
[null,null,null,null,"",null,null,null,"",null,null,{"$f":"IF(ISBLANK($D59), \"\",IF(ISBLANK(J59),0,INDEX(Luminaire_Table,MATCH(J59,Luminaire_Types,0),3)))","v":""},null,null,{"$f":"IF(ISBLANK($D59), \"\",IF(ISBLANK(M59),0,INDEX(Luminaire_Table,MATCH(M59,Luminaire_Types,0),3)))","v":""},null,null,{"$f":"IF(ISBLANK($D59), \"\",IF(ISBLANK(P59),0,INDEX(Luminaire_Table,MATCH(P59,Luminaire_Types,0),3)))","v":""},null,null,{"$f":"IF(ISBLANK($D59), \"\",IF(ISBLANK(S59),0,INDEX(Luminaire_Table,MATCH(S59,Luminaire_Types,0),3)))","v":""},null,null,{"$f":"IF(ISBLANK($D59), \"\",IF(ISBLANK(V59),0,INDEX(Luminaire_Table,MATCH(V59,Luminaire_Types,0),3)))","v":""},"","","","","","","","","",""]
[null,null,null,null,"",null,null,null,"",null,null,{"$f":"IF(ISBLANK($D60), \"\",IF(ISBLANK(J60),0,INDEX(Luminaire_Table,MATCH(J60,Luminaire_Types,0),3)))","v":""},null,null,{"$f":"IF(ISBLANK($D60), \"\",IF(ISBLANK(M60),0,INDEX(Luminaire_Table,MATCH(M60,Luminaire_Types,0),3)))","v":""},null,null,{"$f":"IF(ISBLANK($D60), \"\",IF(ISBLANK(P60),0,INDEX(Luminaire_Table,MATCH(P60,Luminaire_Types,0),3)))","v":""},null,null,{"$f":"IF(ISBLANK($D60), \"\",IF(ISBLANK(S60),0,INDEX(Luminaire_Table,MATCH(S60,Luminaire_Types,0),3)))","v":""},null,null,{"$f":"IF(ISBLANK($D60), \"\",IF(ISBLANK(V60),0,INDEX(Luminaire_Table,MATCH(V60,Luminaire_Types,0),3)))","v":""},"","","","","","","","","",""]
[null,null,null,null,"",null,null,null,"",null,null,{"$f":"IF(ISBLANK($D61), \"\",IF(ISBLANK(J61),0,INDEX(Luminaire_Table,MATCH(J61,Luminaire_Types,0),3)))","v":""},null,null,{"$f":"IF(ISBLANK($D61), \"\",IF(ISBLANK(M61),0,INDEX(Luminaire_Table,MATCH(M61,Luminaire_Types,0),3)))","v":""},null,null,{"$f":"IF(ISBLANK($D61), \"\",IF(ISBLANK(P61),0,INDEX(Luminaire_Table,MATCH(P61,Luminaire_Types,0),3)))","v":""},null,null,{"$f":"IF(ISBLANK($D61), \"\",IF(ISBLANK(S61),0,INDEX(Luminaire_Table,MATCH(S61,Luminaire_Types,0),3)))","v":""},null,null,{"$f":"IF(ISBLANK($D61), \"\",IF(ISBLANK(V61),0,INDEX(Luminaire_Table,MATCH(V61,Luminaire_Types,0),3)))","v":""},"","","","","","","","","",""]
[null,null,null,null,"",null,null,null,"",null,null,{"$f":"IF(ISBLANK($D62), \"\",IF(ISBLANK(J62),0,INDEX(Luminaire_Table,MATCH(J62,Luminaire_Types,0),3)))","v":""},null,null,{"$f":"IF(ISBLANK($D62), \"\",IF(ISBLANK(M62),0,INDEX(Luminaire_Table,MATCH(M62,Luminaire_Types,0),3)))","v":""},null,null,{"$f":"IF(ISBLANK($D62), \"\",IF(ISBLANK(P62),0,INDEX(Luminaire_Table,MATCH(P62,Luminaire_Types,0),3)))","v":""},null,null,{"$f":"IF(ISBLANK($D62), \"\",IF(ISBLANK(S62),0,INDEX(Luminaire_Table,MATCH(S62,Luminaire_Types,0),3)))","v":""},null,null,{"$f":"IF(ISBLANK($D62), \"\",IF(ISBLANK(V62),0,INDEX(Luminaire_Table,MATCH(V62,Luminaire_Types,0),3)))","v":""},"","","","","","","","","",""]
[null,null,null,null,"",null,null,null,"",null,null,{"$f":"IF(ISBLANK($D63), \"\",IF(ISBLANK(J63),0,INDEX(Luminaire_Table,MATCH(J63,Luminaire_Types,0),3)))","v":""},null,null,{"$f":"IF(ISBLANK($D63), \"\",IF(ISBLANK(M63),0,INDEX(Luminaire_Table,MATCH(M63,Luminaire_Types,0),3)))","v":""},null,null,{"$f":"IF(ISBLANK($D63), \"\",IF(ISBLANK(P63),0,INDEX(Luminaire_Table,MATCH(P63,Luminaire_Types,0),3)))","v":""},null,null,{"$f":"IF(ISBLANK($D63), \"\",IF(ISBLANK(S63),0,INDEX(Luminaire_Table,MATCH(S63,Luminaire_Types,0),3)))","v":""},null,null,{"$f":"IF(ISBLANK($D63), \"\",IF(ISBLANK(V63),0,INDEX(Luminaire_Table,MATCH(V63,Luminaire_Types,0),3)))","v":""},"","","","","","","","","",""]
[null,null,null,null,"",null,null,null,"",null,null,{"$f":"IF(ISBLANK($D64), \"\",IF(ISBLANK(J64),0,INDEX(Luminaire_Table,MATCH(J64,Luminaire_Types,0),3)))","v":""},null,null,{"$f":"IF(ISBLANK($D64), \"\",IF(ISBLANK(M64),0,INDEX(Luminaire_Table,MATCH(M64,Luminaire_Types,0),3)))","v":""},null,null,{"$f":"IF(ISBLANK($D64), \"\",IF(ISBLANK(P64),0,INDEX(Luminaire_Table,MATCH(P64,Luminaire_Types,0),3)))","v":""},null,null,{"$f":"IF(ISBLANK($D64), \"\",IF(ISBLANK(S64),0,INDEX(Luminaire_Table,MATCH(S64,Luminaire_Types,0),3)))","v":""},null,null,{"$f":"IF(ISBLANK($D64), \"\",IF(ISBLANK(V64),0,INDEX(Luminaire_Table,MATCH(V64,Luminaire_Types,0),3)))","v":""},"","","","","","","","","",""]
[null,47,null,null,"",null,null,null,"",null,null,{"$f":"IF(ISBLANK($D65), \"\",IF(ISBLANK(J65),0,INDEX(Luminaire_Table,MATCH(J65,Luminaire_Types,0),3)))","v":""},null,null,{"$f":"IF(ISBLANK($D65), \"\",IF(ISBLANK(M65),0,INDEX(Luminaire_Table,MATCH(M65,Luminaire_Types,0),3)))","v":""},null,null,{"$f":"IF(ISBLANK($D65), \"\",IF(ISBLANK(P65),0,INDEX(Luminaire_Table,MATCH(P65,Luminaire_Types,0),3)))","v":""},null,null,{"$f":"IF(ISBLANK($D65), \"\",IF(ISBLANK(S65),0,INDEX(Luminaire_Table,MATCH(S65,Luminaire_Types,0),3)))","v":""},null,null,{"$f":"IF(ISBLANK($D65), \"\",IF(ISBLANK(V65),0,INDEX(Luminaire_Table,MATCH(V65,Luminaire_Types,0),3)))","v":""},"","","","","","","","","",""]
[null,48,null,null,"",null,null,null,"",null,null,{"$f":"IF(ISBLANK($D66), \"\",IF(ISBLANK(J66),0,INDEX(Luminaire_Table,MATCH(J66,Luminaire_Types,0),3)))","v":""},null,null,{"$f":"IF(ISBLANK($D66), \"\",IF(ISBLANK(M66),0,INDEX(Luminaire_Table,MATCH(M66,Luminaire_Types,0),3)))","v":""},null,null,{"$f":"IF(ISBLANK($D66), \"\",IF(ISBLANK(P66),0,INDEX(Luminaire_Table,MATCH(P66,Luminaire_Types,0),3)))","v":""},null,null,{"$f":"IF(ISBLANK($D66), \"\",IF(ISBLANK(S66),0,INDEX(Luminaire_Table,MATCH(S66,Luminaire_Types,0),3)))","v":""},null,null,{"$f":"IF(ISBLANK($D66), \"\",IF(ISBLANK(V66),0,INDEX(Luminaire_Table,MATCH(V66,Luminaire_Types,0),3)))","v":""},"","","","","","","","","",""]
[null,null,null,null,{"$f":"IF(ISBLANK($D67),\"\",IF(ProjectCode=NECB,INDEX(NECB_ExteriorTable,MATCH($D67,NECB_ExteriorSpaces,0),6),IF(ProjectCode=ASHRAE,INDEX(ASHRAE_ExteriorTable,MATCH($D67,ASHRAE_ExteriorSpaces,0),6),\"\")))","v":""},null,null,null,"",null,null,{"$f":"IF(ISBLANK($D67), \"\",IF(ISBLANK(J67),0,INDEX(Luminaire_Table,MATCH(J67,Luminaire_Types,0),3)))","v":""},null,null,{"$f":"IF(ISBLANK($D67), \"\",IF(ISBLANK(M67),0,INDEX(Luminaire_Table,MATCH(M67,Luminaire_Types,0),3)))","v":""},null,null,{"$f":"IF(ISBLANK($D67), \"\",IF(ISBLANK(P67),0,INDEX(Luminaire_Table,MATCH(P67,Luminaire_Types,0),3)))","v":""},null,null,{"$f":"IF(ISBLANK($D67), \"\",IF(ISBLANK(S67),0,INDEX(Luminaire_Table,MATCH(S67,Luminaire_Types,0),3)))","v":""},null,null,{"$f":"IF(ISBLANK($D67), \"\",IF(ISBLANK(V67),0,INDEX(Luminaire_Table,MATCH(V67,Luminaire_Types,0),3)))","v":""},"","","","","","","","","",""]
[null,50,null,null,"",null,null,null,"",null,null,{"$f":"IF(ISBLANK($D68), \"\",IF(ISBLANK(J68),0,INDEX(Luminaire_Table,MATCH(J68,Luminaire_Types,0),3)))","v":""},null,null,{"$f":"IF(ISBLANK($D68), \"\",IF(ISBLANK(M68),0,INDEX(Luminaire_Table,MATCH(M68,Luminaire_Types,0),3)))","v":""},null,null,{"$f":"IF(ISBLANK($D68), \"\",IF(ISBLANK(P68),0,INDEX(Luminaire_Table,MATCH(P68,Luminaire_Types,0),3)))","v":""},null,null,{"$f":"IF(ISBLANK($D68), \"\",IF(ISBLANK(S68),0,INDEX(Luminaire_Table,MATCH(S68,Luminaire_Types,0),3)))","v":""},null,null,{"$f":"IF(ISBLANK($D68), \"\",IF(ISBLANK(V68),0,INDEX(Luminaire_Table,MATCH(V68,Luminaire_Types,0),3)))","v":""},"","","","","","","","","",""]
[null,51,null,null,"",null,null,null,"",null,null,{"$f":"IF(ISBLANK($D69), \"\",IF(ISBLANK(J69),0,INDEX(Luminaire_Table,MATCH(J69,Luminaire_Types,0),3)))","v":""},null,null,{"$f":"IF(ISBLANK($D69), \"\",IF(ISBLANK(M69),0,INDEX(Luminaire_Table,MATCH(M69,Luminaire_Types,0),3)))","v":""},null,null,{"$f":"IF(ISBLANK($D69), \"\",IF(ISBLANK(P69),0,INDEX(Luminaire_Table,MATCH(P69,Luminaire_Types,0),3)))","v":""},null,null,{"$f":"IF(ISBLANK($D69), \"\",IF(ISBLANK(S69),0,INDEX(Luminaire_Table,MATCH(S69,Luminaire_Types,0),3)))","v":""},null,null,{"$f":"IF(ISBLANK($D69), \"\",IF(ISBLANK(V69),0,INDEX(Luminaire_Table,MATCH(V69,Luminaire_Types,0),3)))","v":""},"","","","","","","","","",""]
[null,null,null,null,null,null,null,null,null,null,null,null,null,null,null,null,null,null,null,null,null,null,null,null,null,{"$f":"SUM(Z19:OFFSET(Z70,-1,0))","v":0},{"$f":"SUM(AA19:OFFSET(AA70,-1,0))","v":0},{"$f":"IFERROR(SUM(AB19:OFFSET(AB70,-1,0)),\"\")","v":0},{"$f":"SUM(AC19:OFFSET(AC70,-1,0))","v":0},null,{"$f":"AB70-AC70","v":0},{"$f":"SUM(AF19:OFFSET(AF70,-1,0))","v":0},{"$f":"SUM(AG19:OFFSET(AG70,-1,0))","v":0},{"$f":"SUM(AH19:OFFSET(AH70,-1,0))","v":0}]

{"sheet":"ASHRAE","index":6,"n_rows":105,"n_cols":21,"rows_kept":105,"cut":false,"hidden":true,"merged":[]}
["ASHRAE/IES Standard 90.1-2016 Part 9 Lighting"]
[null,null,null,null,null,null,null,null,null,null,null,null,null,null,{"$f":"N2+1","v":1},{"$f":"O2+1","v":2},3,4,5,6,7]
["INTERIOR",null,null,null,null,null,null,"EXTERIOR",null,null,null,null,null,null,"BUILDING TYPES"]
["Proposed effective table",null,null,null,null,null,null,"Proposed effective table",null,null,null,null,null,null,"Proposed effective table",null,null,null,"*","*","*"]
["Proposed space names","LPD (W/sqft ) [default units]",{"$f":"IF(ProjectUnits=\"Imperial\",\"LPD (W/sqft) [active units]\",\"LPD (W/sqm) [active units]\")","v":"LPD (W/sqm) [active units]"},"Annual hours","OS/ TC required?","RCR threshold",null,"Proposed space names","Zone 1 LPD (W/sqft ) [default units]","Zone 2 LPD (W/sqft ) [default units]","Zone 3 LPD (W/sqft ) [default units]","Zone 4 LPD (W/sqft ) [default units]",{"$f":"\"Zone \"&IF(ISBLANK(ProjectZone),\"N/A\",RIGHT(ProjectZone))&\" LPD \"&IF(ProjectUnits=\"Imperial\",\"(W/sqft)\",\"(W/sqm)\")&\" [active zone, active units]\"","v":"Zone N/A LPD (W/sqm) [active zone, active units]"},null,"Proposed building type names","LPD (W/sqft) [default units]",{"$f":"IF(ProjectUnits=\"Imperial\",\"LPD (W/sqft) [active units]\",\"LPD (W/sqm) [active units]\")","v":"LPD (W/sqm) [active units]"},"Hours","Common areas","Washroom/ Locker room","Stairwell"]
["Atrium - first 40ft in height",0.03,{"$f":"IF(ProjectUnits=\"Imperial\",B6,ROUND(B6*3.2808399,1))","v":0.1},3880,null,1000000,null,"Entry canopies",0.2,0.25,0.4,0.4,{"$f":"ROUND(IF(ProjectUnits=\"Imperial\",INDEX(ASHRAE_ExteriorTable,1,RIGHT(ProjectZone)+1),INDEX(ASHRAE_ExteriorTable,1,RIGHT(ProjectZone)+1)*'Basic Lists'!B107),2)","v":{"$error":"#VALUE!"}},null,"Automotive facility",0.71,{"$f":"IF(ProjectUnits=\"Imperial\",P6,ROUND(P6*10.7639104,1))","v":7.6},3210,3880,3100,2910]
["Atrium - height above 40ft",0.02,{"$f":"IF(ProjectUnits=\"Imperial\",B7,ROUND(B7*3.2808399,2))","v":7.0000000000000007E-2},3880,null,1000000,null,"Entrances and exits [linear]",14,14,21,21,{"$f":"ROUND(IF(ProjectUnits=\"Imperial\",INDEX(ASHRAE_ExteriorTable,2,RIGHT(ProjectZone)+1),INDEX(ASHRAE_ExteriorTable,2,RIGHT(ProjectZone)+1)*'Basic Lists'!B106),2)","v":{"$error":"#VALUE!"}},null,"Convention centre",0.76,8.1999999999999993,3530,3880,3100,2910]
["Audience/seating area - for auditorium",0.63,{"$f":"IF(ProjectUnits=\"Imperial\",B8,ROUND(B8*10.7639104,1))","v":6.8},2980,true,6,null,"Dining areas",0.65,0.65,0.75,0.95,{"$f":"ROUND(IF(ProjectUnits=\"Imperial\",INDEX(ASHRAE_ExteriorTable,3,RIGHT(ProjectZone)+1),INDEX(ASHRAE_ExteriorTable,3,RIGHT(ProjectZone)+1)*'Basic Lists'!B107),2)","v":{"$error":"#VALUE!"}},null,"Courthouse",0.9,9.6999999999999993,2820,2930,2340,2200]
["Audience/seating area - for convention centre",0.82,8.8000000000000007,3880,null,4,null,"Landscaping",0.03,0.04,0.04,0.04,{"$f":"ROUND(IF(ProjectUnits=\"Imperial\",INDEX(ASHRAE_ExteriorTable,4,RIGHT(ProjectZone)+1),INDEX(ASHRAE_ExteriorTable,4,RIGHT(ProjectZone)+1)*'Basic Lists'!B107),2)","v":{"$error":"#VALUE!"}},null,"Dining: bar lounge/leisure",0.9,9.6999999999999993,4740,5220,4180,3920]
["Audience/seating area - general",0.42,4.5,2930,null,4,null,"Loading docks - exterior",0.35,0.35,0.35,0.35,{"$f":"ROUND(IF(ProjectUnits=\"Imperial\",INDEX(ASHRAE_ExteriorTable,5,RIGHT(ProjectZone)+1),INDEX(ASHRAE_ExteriorTable,5,RIGHT(ProjectZone)+1)*'Basic Lists'!B107),2)","v":{"$error":"#VALUE!"}},null,"Dining: cafeteria/fast food",0.79,8.5,4590,5220,4180,3920]
["Audience/seating area - for gymnasium",0.65,7,2950,null,6,null,"Open outdoor sales areas, vehicle sales lots",0.2,0.2,0.35,0.5,{"$f":"ROUND(IF(ProjectUnits=\"Imperial\",INDEX(ASHRAE_ExteriorTable,6,RIGHT(ProjectZone)+1),INDEX(ASHRAE_ExteriorTable,6,RIGHT(ProjectZone)+1)*'Basic Lists'!B107),2)","v":{"$error":"#VALUE!"}},null,"Dining: family",0.78,8.4,4750,5220,4180,3920]
["Audience/seating area - for motion picture theatre",1.1399999999999999,12.3,2180,null,4,null,"Parking areas and drives",0.03,0.04,0.06,0.08,{"$f":"ROUND(IF(ProjectUnits=\"Imperial\",INDEX(ASHRAE_ExteriorTable,7,RIGHT(ProjectZone)+1),INDEX(ASHRAE_ExteriorTable,7,RIGHT(ProjectZone)+1)*'Basic Lists'!B107),2)","v":{"$error":"#VALUE!"}},null,"Dormitory",0.61,6.6,3870,8760,2380,5260]
["Audience/seating area - penitentiary",0.28000000000000003,{"$f":"IF(ProjectUnits=\"Imperial\",B13,ROUND(B13*10.7639104,1))","v":3},2930,null,4,null,"Pedestrian tunnels",0.12,0.12,0.14000000000000001,0.21,{"$f":"ROUND(IF(ProjectUnits=\"Imperial\",INDEX(ASHRAE_ExteriorTable,8,RIGHT(ProjectZone)+1),INDEX(ASHRAE_ExteriorTable,8,RIGHT(ProjectZone)+1)*'Basic Lists'!B107),2)","v":{"$error":"#VALUE!"}},null,"Exercise centre",0.65,7,2820,2950,2360,2660]
["Audience/seating area - for performing arts theatre",2.0299999999999998,21.9,1040,null,8,null,"Sales canopies",0.4,0.4,0.6,0.7,{"$f":"ROUND(IF(ProjectUnits=\"Imperial\",INDEX(ASHRAE_ExteriorTable,9,RIGHT(ProjectZone)+1),INDEX(ASHRAE_ExteriorTable,9,RIGHT(ProjectZone)+1)*'Basic Lists'!B107),2)","v":{"$error":"#VALUE!"}},null,"Fire station",0.53,5.7,5880,8760,7010,6570]
["Audience/seating area - for religious building ",1.53,16.5,2180,null,4,null,"Stairways",0.6,0.7,0.7,0.7,{"$f":"ROUND(IF(ProjectUnits=\"Imperial\",INDEX(ASHRAE_ExteriorTable,10,RIGHT(ProjectZone)+1),INDEX(ASHRAE_ExteriorTable,10,RIGHT(ProjectZone)+1)*'Basic Lists'!B107),2)","v":{"$error":"#VALUE!"}},null,"Gymnasium",0.68,7.3,2870,2950,2360,2660]
["Audience/seating area - for sports arena",0.43,4.5999999999999996,2950,null,4,null,"Street frontage for vehicle sales lots [linear]",0,7,7,21,{"$f":"ROUND(IF(ProjectUnits=\"Imperial\",INDEX(ASHRAE_ExteriorTable,11,RIGHT(ProjectZone)+1),INDEX(ASHRAE_ExteriorTable,11,RIGHT(ProjectZone)+1)*'Basic Lists'!B106),2)","v":{"$error":"#VALUE!"}},null,"Health-care clinic",0.82,8.8000000000000007,3290,2930,2340,2200]
["Audience/seating area - for transportation",0.43,4.5999999999999996,8760,null,4,null,"Walkways 10ft wide or greater, plazas",0.1,0.1,0.11,0.14000000000000001,{"$f":"ROUND(IF(ProjectUnits=\"Imperial\",INDEX(ASHRAE_ExteriorTable,12,RIGHT(ProjectZone)+1),INDEX(ASHRAE_ExteriorTable,12,RIGHT(ProjectZone)+1)*'Basic Lists'!B107),2)","v":{"$error":"#VALUE!"}},null,"Hospital",1.05,11.3,4720,8760,7010,6570]
["Banking activity area and office",0.86,9.3000000000000007,2930,null,6,null,"Walkways less than 10ft wide [linear]",0.5,0.5,0.6,0.7,{"$f":"ROUND(IF(ProjectUnits=\"Imperial\",INDEX(ASHRAE_ExteriorTable,13,RIGHT(ProjectZone)+1),INDEX(ASHRAE_ExteriorTable,13,RIGHT(ProjectZone)+1)*'Basic Lists'!B106),2)","v":{"$error":"#VALUE!"}},null,"Hotel",0.75,8.1,3310,8760,1630,6570]
["Classroom/lecture/training - for penitentiary",1.34,14.4,2330,true,4,null,"Base site allowance, kW",0.35,0.4,0.5,0.9,{"$f":"INDEX(ASHRAE_ExteriorTable,14,RIGHT(ProjectZone)+1)","v":{"$error":"#VALUE!"}},null,"Library",0.78,8.4,3610,3880,3100,3490]
["Classroom/lecture/training - general",0.92,9.9,2330,true,4,null,null,null,null,null,null,null,null,"Manufacturing facility",0.9,9.6999999999999993,3760,3880,3100,3490]
["Computer/server room",1.33,14.3,2300,null,4,null,null,null,null,null,null,null,null,"Motel",0.75,8.1,3620,8760,1630,6570]
["Conference/meeting/multipurpose",1.07,11.5,3370,true,6,null,null,null,null,null,null,null,null,"Motion picture theatre",0.83,8.9,2620,2980,1740,2680]
["Confinement cells",0.81,8.6999999999999993,5820,null,6,null,null,null,null,null,null,null,null,"Multifamily*",0.68,7.3,6210,8760,7010,4820]
["Copy/print room",0.56000000000000005,6,2300,true,6,null,null,null,null,null,null,null,null,"Museum",1.06,11.4,3500,3880,3100,3490]
["Corridor/transition - for hospital/visully impaired",0.92,9.9,8760,null,{"$f":"IF(ProjectUnits=\"Imperial\",8,8/3.28083989)","v":2.4384000037258748},null,null,null,null,null,null,null,null,"Office",0.79,8.5,2870,2930,2340,2200]
["Corridor/transition - for manufacturing",0.28999999999999998,3.1,3880,null,{"$f":"IF(ProjectUnits=\"Imperial\",8,8/3.28083989)","v":2.4384000037258748},null,null,null,null,null,null,null,null,"Parking garage",0.15,1.6,5760,8760,7010,5260]
["Corridor/transition - for visually impaired",0.92,{"$f":"IF(ProjectUnits=\"Imperial\",B27,ROUND(B27*10.7639104,1))","v":9.9},8760,null,{"$f":"IF(ProjectUnits=\"Imperial\",8,8/3.28083989)","v":2.4384000037258748},null,null,null,null,null,null,null,null,"Penitentiary",0.75,8.1,4450,8760,2340,5260]
["Corridor/transition - general",0.66,7.1,{"$f":"INDEX(ASHRAE_BuildingTable,MATCH(ProjectBuilding,ASHRAE_BuildingTypes,0),5)","v":{"$error":"#N/A"}},null,{"$f":"IF(ProjectUnits=\"Imperial\",8,8/3.28083989)","v":2.4384000037258748},null,null,null,null,null,null,null,null,"Performing arts theatre",1.18,12.7,1940,2980,830,2680]
["Courtroom",1.39,{"$f":"IF(ProjectUnits=\"Imperial\",B29,ROUND(B29*10.7639104,1))","v":15},2930,null,6,null,null,null,null,null,null,null,null,"Police station",0.8,8.6,4100,8760,7010,6570]
["Dining area - for bar lounge/leisure",0.93,10,5220,null,4,null,null,null,null,null,null,null,null,"Post office",0.67,7.2,3140,3880,3100,2910]
["Dining area - for cafeteria/ fast food",0.63,{"$f":"IF(ProjectUnits=\"Imperial\",B31,ROUND(B31*10.7639104,1))","v":6.8},5220,null,4,null,null,null,null,null,null,null,null,"Religious building",0.94,10.1,2350,2180,1740,1960]
["Dining area - for family dining",0.71,7.6,5220,null,4,null,null,null,null,null,null,null,null,"Retail",1.06,11.4,3750,3880,3100,3490]
["Dining area - for visually impaired",2,21.5,5220,null,4,null,null,null,null,null,null,null,null,"School/ university",0.81,8.6999999999999993,2580,2930,2340,2200]
["Dining area - for penitentiary",0.96,{"$f":"IF(ProjectUnits=\"Imperial\",B34,ROUND(B34*10.7639104,1))","v":10.3},5220,null,6,null,null,null,null,null,null,null,null,"Sports arena",0.87,9.4,4170,5220,4180,4700]
["Dining area - general",0.63,6.8,5220,null,4,null,null,null,null,null,null,null,null,"Town hall",0.8,8.6,3040,3370,2700,2530]
["Dormitory - living/sleeping quarters",0.54,5.8,2970,null,8,null,null,null,null,null,null,null,null,"Transportation",0.61,6.6,5190,8760,7010,7880]
["Dressing/fitting room - for performance arts theatre",0.36,3.9,2800,true,6,null,null,null,null,null,null,null,null,"Warehouse",0.48,5.2,2830,2830,2260,2120]
["Dressing/fitting room - for retail",0.5,5.4,3680,true,8,null,null,null,null,null,null,null,null,"Workshop",0.9,9.6999999999999993,3580,3880,3100,2910]
["Electrical/mechanical",0.43,4.5999999999999996,1000,null,6]
["Emergency vehicle garage",0.41,4.4000000000000004,8760,null,4]
["Exhibit space - for convention centre",0.88,9.5,3880,null,4]
["Fire station - sleeping quarters",0.2,2.2000000000000002,2970,null,6]
["Food preparation",1.06,11.4,5220,null,6]
["Guest room",0.77,8.3000000000000007,2040,true,6]
["Gymnasium/fitness centre - exersize area",0.5,5.4,2950,null,4]
["Gymnasium/fitness centre - playing area",0.82,8.8000000000000007,2950,null,4]
["Healthcare - exam/treatment",1.68,{"$f":"IF(ProjectUnits=\"Imperial\",B47,ROUND(B47*10.7639104,1))","v":18.100000000000001},3880,null,8]
["Healthcare - imaging",1.06,{"$f":"IF(ProjectUnits=\"Imperial\",B48,ROUND(B48*10.7639104,1))","v":11.4},8760,null,6]
["Health care - lounge/break",0.78,8.4,3880,true,6]
["Health care - medical supply",0.54,5.8,8760,null,6]
["Health care - nursery",1,10.8,8760,null,6]
["Health care - nurses' station",0.81,8.6999999999999993,8760,null,6]
["Health care - operating ",2.17,23.4,8760,null,6]
["Health care - patient room",0.62,6.7,5820,null,6]
["Health care - physical therapy",0.84,9,3880,null,6]
["Health care - recovery",1.03,11.1,8760,null,6]
["Laboratory - for classrooms",1.2,12.9,3020,true,6]
["Laboratory - for medical/industrial/research",1.45,15.6,2930,null,6]
["Laundry/washing",0.43,4.5999999999999996,5220,null,4]
["Library - reading",0.82,8.8000000000000007,3880,null,4]
["Library - stacks",1.2,12.9,3880,true,4]
["Loading dock - interior",0.57999999999999996,6.2,2830,null,6]
["Lobby - for elevator",0.69,7.4,{"$f":"INDEX(ASHRAE_BuildingTable,MATCH(ProjectBuilding,ASHRAE_BuildingTypes,0),5)","v":{"$error":"#N/A"}},null,6]
["Lobby - for hotel",1.06,11.4,8760,null,4]
["Lobby - for motion picture theatre",0.45,4.8,2950,null,4]
["Lobby - for performing arts theatre",1.7,18.3,2950,true,6]
["Lobby - for visually impaired",2.0299999999999998,21.9,8760,true,4]
["Lobby - general",1,10.8,3880,true,4]
["Locker room",0.48,5.2,{"$f":"INDEX(ASHRAE_BuildingTable,MATCH(ProjectBuilding,ASHRAE_BuildingTypes,0),6)","v":{"$error":"#N/A"}},true,6]
["Lounge/break",0.62,6.7,5220,true,4]
["Manufacturing - detailed",0.93,10,3880,null,4]
["Manufacturing - equipment room",0.65,7,3880,null,6]
["Manufacturing - extra high bay (ceiling height >50ft)",1.05,11.3,3880,null,4]
["Manufacturing - high bay (ceiling height 25 to 50ft)",0.75,8.1,3880,null,4]
["Manufacturing - low bay (ceiling height <25ft)",0.96,10.3,3880,null,4]
["Museum - general exhibition",1.05,11.3,3880,null,6]
["Museum - restoration ",0.85,9.1,2930,null,6]
["Office - enclosed ≤250ft2",0.93,10,2300,true,8]
["Office - enclosed >250ft2",0.93,{"$f":"IF(ProjectUnits=\"Imperial\",B79,ROUND(B79*10.7639104,1))","v":10},2930,null,8]
["Office - open plan",0.81,8.6999999999999993,2930,null,4]
["Parking/storage garage area",0.14000000000000001,1.5,6730,true,4]
["Pharmacy",1.34,14.4,3880,null,6]
["Post office - sorting area",0.68,7.3,2930,true,4]
["Religious building - fellowship hall",0.55000000000000004,5.9,2180,null,4]
["Religious building - worship/pulpit/choir",1.53,16.5,2180,null,4]
["Retail - mall concourse",0.9,9.6999999999999993,3880,null,4]
["Retail - sales area",1.22,13.1,3880,null,6]
["Sports arena playing area - class I",2.4700000000000002,{"$f":"IF(ProjectUnits=\"Imperial\",B88,ROUND(B88*10.7639104,1))","v":26.6},2950,null,4]
["Sports arena playing area - class II",1.96,21.1,2950,null,4]
["Sports arena playing area - class III",1.7,18.3,2950,null,4]
["Sports arena playing area - class IV",1.1299999999999999,12.2,2950,null,4]
["Stairwell",0.57999999999999996,6.2,{"$f":"INDEX(ASHRAE_BuildingTable,MATCH(ProjectBuilding,ASHRAE_BuildingTypes,0),7)","v":{"$error":"#N/A"}},true,10]
["Storage < 50ft2",0.97,10.4,1910,null,6]
["Storage ≥50ft2",0.46,{"$f":"IF(ProjectUnits=\"Imperial\",B94,ROUND(B94*10.7639104,1))","v":5},1910,true,6]
["Transportation - airport concourse",0.31,{"$f":"IF(ProjectUnits=\"Imperial\",B95,ROUND(B95*10.7639104,1))","v":3.3},8760,null,4]
["Transportation - baggage area",0.45,{"$f":"IF(ProjectUnits=\"Imperial\",B96,ROUND(B96*10.7639104,1))","v":4.8},8760,null,4]
["Transportation - terminal ticket counter",0.62,6.7,8760,null,4]
["Vehicle maintenance/repair area",0.56000000000000005,6,3880,null,4]
["Visually impaired design (RP-28) - chapel",1.06,11.4,2950,null,4]
["Visually impaired design (RP-28) - recreation room",1.8,19.399999999999999,5220,null,6]
["Warehouse storage - fine material",0.69,7.4,2830,true,6]
["Warehouse storage - medium/bulky material ",0.35,3.8,2830,true,4]
["Washroom - for visually impared",0.96,{"$f":"IF(ProjectUnits=\"Imperial\",B103,ROUND(B103*10.7639104,1))","v":10.3},5220,true,8]
["Washroom - general",0.85,9.1,{"$f":"INDEX(ASHRAE_BuildingTable,MATCH(ProjectBuilding,ASHRAE_BuildingTypes,0),6)","v":{"$error":"#N/A"}},true,8]
["Workshop",1.1399999999999999,12.3,3880,null,6]

{"sheet":"NECB","index":7,"n_rows":104,"n_cols":17,"rows_kept":104,"cut":false,"hidden":true,"merged":[]}
["National Energy Code of Canada for Buildings (NECB) 2015 Division B Part 4 Lighting"]
[null,null,null,null,null,null,null,null,null,null,null,null,null,{"$f":"M2+1","v":1},{"$f":"N2+1","v":2},3,4]
["INTERIOR",null,null,null,null,null,"EXTERIOR",null,null,null,null,null,null,"BUILDING TYPES"]
["Proposed effective table",null,null,null,null,null,"Proposed effective table",null,null,null,null,null,null,"Proposed effective table"]
["Proposed space names","LPD (W/sqm) [default units]",{"$f":"IF(ProjectUnits=\"Imperial\",\"LPD (W/sqft) [active units]\",\"LPD (W/sqm) [active units]\")","v":"LPD (W/sqm) [active units]"},"Annual hours","OS/ TC Required?",null,"Proposed space names","Zone 1 LPD (W/sqm ) [default units]","Zone 2 LPD (W/sqm ) [default units]","Zone 3 LPD (W/sqm ) [default units]","Zone 4 LPD (W/sqm ) [default units]",{"$f":"\"Zone \"&IF(ISBLANK(ProjectZone),\"N/A\",RIGHT(ProjectZone))&\" LPD \"&IF(ProjectUnits=\"Imperial\",\"(W/sqft)\",\"(W/sqm)\")&\" [active zone, active units]\"","v":"Zone N/A LPD (W/sqm) [active zone, active units]"},null,"Proposed building type names","LPD (W/sqm) [default units]",{"$f":"IF(ProjectUnits=\"Imperial\",\"LPD (W/sqft) [active units]\",\"LPD (W/sqm) [active units]\")","v":"LPD (W/sqm) [active units]"},"Hours"]
[{"$f":"IF(ProjectUnits = \"Imperial\", \"Atrium - first 40ft in height\", \"Atrium - first 12m in height\")","v":"Atrium - first 12m in height"},0.106,{"$f":"IF(ProjectUnits=\"Imperial\",ROUND(B6/3.2808399,2),B6)","v":0.106},3880,null,null,"Entry canopies",2.7,2.7,4.3,4.3,{"$f":"IF(ProjectUnits=\"Imperial\",INDEX(NECB_ExteriorTable,1,RIGHT(ProjectZone)+1)/10.7639104,INDEX(NECB_ExteriorTable,1,RIGHT(ProjectZone)+1))","v":{"$error":"#VALUE!"}},null,"Automotive facility",8.6,{"$f":"IF(ProjectUnits=\"Imperial\",ROUND(O6/10.7639104,2),O6)","v":8.6},3210]
[{"$f":"IF(ProjectUnits = \"Imperial\", \"Atrium - height above 40ft\", \"Atrium - height above 12m\")","v":"Atrium - height above 12m"},7.0999999999999994E-2,{"$f":"IF(ProjectUnits=\"Imperial\",ROUND(B7/3.2808399,2),B7)","v":7.0999999999999994E-2},3880,null,null,"Landscape lighting",0.4,0.5,0.5,0.5,{"$f":"IF(ProjectUnits=\"Imperial\",INDEX(NECB_ExteriorTable,2,RIGHT(ProjectZone)+1)/10.7639104,INDEX(NECB_ExteriorTable,2,RIGHT(ProjectZone)+1))","v":{"$error":"#VALUE!"}},null,"Convention centre",10.9,10.9,3530]
["Audience/seating area - for auditorium",6.8,{"$f":"IF(ProjectUnits=\"Imperial\",ROUND(B8/10.7639104,2),B8)","v":6.8},2980,true,null,"Main entries [linear]",66,66,98,98,{"$f":"ROUND(IF(ProjectUnits=\"Imperial\",INDEX(NECB_ExteriorTable,3,RIGHT(ProjectZone)+1)/'Basic Lists'!$B106,INDEX(NECB_ExteriorTable,3,RIGHT(ProjectZone)+1)),2)","v":{"$error":"#VALUE!"}},null,"Courthouse",10.9,10.9,2820]
["Audience/ seating area - for convention centre",8.9,8.9,3880,null,null,"Open outdoor sales areas, vehicle sales lots",2.7,2.7,5.4,7.5,{"$f":"IF(ProjectUnits=\"Imperial\",INDEX(NECB_ExteriorTable,4,RIGHT(ProjectZone)+1)/10.7639104,INDEX(NECB_ExteriorTable,4,RIGHT(ProjectZone)+1))","v":{"$error":"#VALUE!"}},null,"Dining: bar lounge/leisure",10.9,10.9,4740]
["Audience/seating area - general",4.5999999999999996,4.5999999999999996,2950,null,null,"Other (non-main) entries [linear]",66,66,66,66,{"$f":"ROUND(IF(ProjectUnits=\"Imperial\",INDEX(NECB_ExteriorTable,5,RIGHT(ProjectZone)+1)/'Basic Lists'!$B106,INDEX(NECB_ExteriorTable,5,RIGHT(ProjectZone)+1)),2)","v":{"$error":"#VALUE!"}},null,"Dining: cafeteria/fast food",9.6999999999999993,9.6999999999999993,4590]
["Audience/seating area - for gymnasium",7,7,2950,null,null,"Parking areas and drives",0.4,0.7,1.1000000000000001,1.4,{"$f":"IF(ProjectUnits=\"Imperial\",INDEX(NECB_ExteriorTable,6,RIGHT(ProjectZone)+1)/10.7639104,INDEX(NECB_ExteriorTable,6,RIGHT(ProjectZone)+1))","v":{"$error":"#VALUE!"}},null,"Dining: family",10.199999999999999,10.199999999999999,4750]
["Audience/seating area - for motion picture theatre",12.3,12.3,2180,null,null,"Pedestrian tunnels",1.6,1.6,2.2000000000000002,3.2,{"$f":"IF(ProjectUnits=\"Imperial\",INDEX(NECB_ExteriorTable,7,RIGHT(ProjectZone)+1)/10.7639104,INDEX(NECB_ExteriorTable,7,RIGHT(ProjectZone)+1))","v":{"$error":"#VALUE!"}},null,"Dormitory",6.1,6.1,3870]
["Audience/seating area - for penitentiary",3,3,2930,null,null,"Sales canopies",6.5,6.5,8.6,11,{"$f":"IF(ProjectUnits=\"Imperial\",INDEX(NECB_ExteriorTable,8,RIGHT(ProjectZone)+1)/10.7639104,INDEX(NECB_ExteriorTable,8,RIGHT(ProjectZone)+1))","v":{"$error":"#VALUE!"}},null,"Exercise centre",9,9,2820]
["Audience/seating area - for performing arts theatre",26.2,{"$f":"IF(ProjectUnits=\"Imperial\",ROUND(B14/10.7639104,2),B14)","v":26.2},1040,null,null,"Stairways",8.1,11,11,11,{"$f":"ROUND(IF(ProjectUnits=\"Imperial\",INDEX(NECB_ExteriorTable,9,RIGHT(ProjectZone)+1)/'Basic Lists'!B107,INDEX(NECB_ExteriorTable,9,RIGHT(ProjectZone)+1)),2)","v":{"$error":"#VALUE!"}},null,"Fire station",7.2,7.2,5880]
["Audience seating area - for religious building",16.5,16.5,2180,null,null,"Street frontage for vehicle sales lots [linear]",0,33,33,98,{"$f":"ROUND(IF(ProjectUnits=\"Imperial\",INDEX(NECB_ExteriorTable,10,RIGHT(ProjectZone)+1)/'Basic Lists'!B106,INDEX(NECB_ExteriorTable,10,RIGHT(ProjectZone)+1)),2)","v":{"$error":"#VALUE!"}},null,"Gymnasium",10.1,10.1,2870]
["Audience/seating area - for sports arena",4.5999999999999996,{"$f":"IF(ProjectUnits=\"Imperial\",ROUND(B16/10.7639104,2),B16)","v":4.5999999999999996},2950,null,null,"Walkways 10ft wide or greater, plazas",1.5,1.5,1.7,2.2000000000000002,{"$f":"IF(ProjectUnits=\"Imperial\",INDEX(NECB_ExteriorTable,11,RIGHT(ProjectZone)+1)/10.7639104,INDEX(NECB_ExteriorTable,11,RIGHT(ProjectZone)+1))","v":{"$error":"#VALUE!"}},null,"Health-care clinic",9.6999999999999993,9.6999999999999993,3290]
["Banking activity area and office",10.9,10.9,2930,null,null,"Walkways less than 10ft wide [linear]",2.2999999999999998,2.2999999999999998,2.6,3.3,{"$f":"ROUND(IF(ProjectUnits=\"Imperial\",INDEX(NECB_ExteriorTable,12,RIGHT(ProjectZone)+1)/'Basic Lists'!B106,INDEX(NECB_ExteriorTable,12,RIGHT(ProjectZone)+1)),2)","v":{"$error":"#VALUE!"}},null,"Hospital",11.3,11.3,4720]
["Classroom/lecture hall/training - for penitentiary",14.5,14.5,2330,true,null,"Base site allowance, kW",0.5,0.6,0.75,1.3,{"$f":"INDEX(NECB_ExteriorTable,13,RIGHT(ProjectZone)+1)","v":{"$error":"#VALUE!"}},null,"Hotel/ Motel",9.4,9.4,3310]
["Classroom/lecture hall/training - general",13.3,13.3,2330,true,null,null,null,null,null,null,null,null,"Library",12.8,12.8,3610]
["Computer/server room",18.399999999999999,18.399999999999999,1000,null,null,null,null,null,null,null,null,null,"Manufacturing facility",12.6,12.6,3760]
["Conference/meeting/multipurpose",13.3,13.3,3370,true,null,null,null,null,null,null,null,null,"Motion picture theatre",8.1999999999999993,8.1999999999999993,2620]
["Confinement cells",8.8000000000000007,8.8000000000000007,5820,null,null,null,null,null,null,null,null,null,"Multifamily*",5.5,5.5,6210]
["Copy/print room",7.8,7.8,2300,true,null,null,null,null,null,null,null,null,"Museum",11,11,3500]
["Corridor/transition - for hospital",10.7,10.7,8760,null,null,null,null,null,null,null,null,null,"Office",8.8000000000000007,8.8000000000000007,2870]
["Corridor/transition - for manufacturing",4.4000000000000004,4.4000000000000004,3880,null,null,null,null,null,null,null,null,null,"Penitentiary",8.6999999999999993,{"$f":"IF(ProjectUnits=\"Imperial\",ROUND(O25/10.7639104,2),O25)","v":8.6999999999999993},4450]
["Corridor/transition - for visually impaired",9.9,9.9,8760,null,null,null,null,null,null,null,null,null,"Performing arts theatre",14.9,14.9,1940]
["Corridor/transition - general",7.1,7.1,{"$f":"INDEX(ASHRAE_BuildingTable,MATCH(ProjectBuilding,ASHRAE_BuildingTypes,0),5)","v":{"$error":"#N/A"}},null,null,null,null,null,null,null,null,null,"Police station",9.4,9.4,4100]
["Courtroom",18.5,{"$f":"IF(ProjectUnits=\"Imperial\",ROUND(B28/10.7639104,2),B28)","v":18.5},2930,null,null,null,null,null,null,null,null,null,"Post office",9.4,9.4,3140]
["Dining area -  for bar lounge/leisure ",11.6,11.6,5220,null,null,null,null,null,null,null,null,null,"Religious building",10.8,10.8,2350]
["Dining area - for cafeteria/ fast food",7,{"$f":"IF(ProjectUnits=\"Imperial\",ROUND(B30/10.7639104,2),B30)","v":7},5220,null,null,null,null,null,null,null,null,null,"Retail",13.5,13.5,3750]
["Dining area - for family dining ",9.6,{"$f":"IF(ProjectUnits=\"Imperial\",ROUND(B31/10.7639104,2),B31)","v":9.6},5220,null,null,null,null,null,null,null,null,null,"School/ university",9.4,9.4,2580]
["Dining area - general",7,7,5220,null,null,null,null,null,null,null,null,null,"Sports arena",9.8000000000000007,9.8000000000000007,4170]
["Dining area - for penitentiary",10.3,10.3,5220,null,null,null,null,null,null,null,null,null,"Storage garage",2.2999999999999998,2.2999999999999998,5760]
["Dining area - for visually impaired",28.5,28.5,5220,null,null,null,null,null,null,null,null,null,"Town hall",9.6,9.6,3040]
["Dormitory - living/sleeping quarters",4.2,4.2,2970,null,null,null,null,null,null,null,null,null,"Transportation",7.5,7.5,5190]
["Dressing/fitting room - for performance arts theatre",6.6,6.6,2560,true,null,null,null,null,null,null,null,null,"Warehouse",7.1,7.1,2830]
["Dressing/fitting room - for retail",7.7,7.7,3680,true,null,null,null,null,null,null,null,null,"Workshop",12.8,12.8,3580]
["Electrical/mechanical",4.5999999999999996,4.5999999999999996,1000]
["Emergency vehicle garage",6.1,6.1,8760]
["Exhibit space - for convention centre",15.7,15.7,3880]
["Fire station - sleeping quarters",2.4,2.4,2970]
["Food preparation",13.1,13.1,5220]
["Guest room",5.0999999999999996,5.0999999999999996,1630,true]
["Gymnasium/fitness centre - exersize area",7.8,7.8,2950]
["Gymnasium/fitness centre - playing area",13,13,2950]
["Health care - exam/treatment",18,18,3880]
["Health care - imaging",16.3,16.3,8760]
["Health care - lounge/break",10,10,4800,true]
["Health care - medical supply",8,8,8040,true]
["Health care - nursery",9.5,9.5,8760]
["Health care - nurses' station",7.6,7.6,8760]
["Health care - operating ",26.8,26.8,8760]
["Health care - patient room",6.7,6.7,5820]
["Heath care - physical therapy",9.9,9.9,3880]
["Heath care - recovery",12.4,12.4,8760]
["Laboratory - for classroom",15.5,15.5,2420,true]
["Laboratory - for medical/industrial/research",19.5,19.5,2930]
["Laundry/washing",6.5,6.5,3880]
["Library - reading ",11.5,11.5,3880]
["Library - stacks",18.399999999999999,18.399999999999999,3100,true]
["Loading dock - interior",5.0999999999999996,5.0999999999999996,2930]
["Lobby - for elevator",7,7,{"$f":"INDEX(ASHRAE_BuildingTable,MATCH(ProjectBuilding,ASHRAE_BuildingTypes,0),5)","v":{"$error":"#N/A"}}]
["Lobby - for hotel",11.5,11.5,8760]
["Lobby - for motion picture theatre",6.4,6.4,2950]
["Lobby - for performing arts theatre",21.6,21.6,2360,true]
["Lobby - for visually impared",19.399999999999999,19.399999999999999,8040,true]
["Lobby - general",9.6999999999999993,{"$f":"IF(ProjectUnits=\"Imperial\",ROUND(B67/10.7639104,2),B67)","v":9.6999999999999993},3100,true]
["Locker room",8.1,8.1,{"$f":"INDEX(ASHRAE_BuildingTable,MATCH(ProjectBuilding,ASHRAE_BuildingTypes,0),6)","v":{"$error":"#N/A"}},true]
["Lounge/break",7.9,7.9,4530,true]
["Manufacturing - detailed",13.9,13.9,3880]
["Manufacturing - equipment room",8,{"$f":"IF(ProjectUnits=\"Imperial\",ROUND(B71/10.7639104,2),B71)","v":8},3880]
["Manufacturing - extra high bay (ceiling height >50ft)",11.3,11.3,3880]
["Manufacturing - high bay (ceiling height 25 to 50ft)",13.3,13.3,3880]
["Manufacturing - low bay (ceiling height <25ft)",12.9,12.9,3880]
["Museum - general exhibition",11.4,11.4,3880]
["Museum - restoration",11,11,2930]
["Office - enclosed ≤250ft2",12,12,2300,true]
["Office - enclosed >250ft2",12,{"$f":"IF(ProjectUnits=\"Imperial\",ROUND(B78/10.7639104,2),B78)","v":12},2930]
["Office - open plan",9.6,9.6,2930]
["Parking/storage garage area",2.1,2.1,6730,true]
["Pharmacy",18.100000000000001,18.100000000000001,3880]
["Post office - sorting area",10.199999999999999,10.199999999999999,2350,true]
["Religious building - fellowship hall",6.9,6.9,2180]
["Religious building - worship/pulpit/choir",16.5,16.5,2180]
["Retail - mall concourse",11.9,11.9,3880]
["Retail - sales area",15.5,15.5,3880]
["Sports arena playing area - class I",39.700000000000003,{"$f":"IF(ProjectUnits=\"Imperial\",ROUND(B87/10.7639104,2),B87)","v":39.700000000000003},2950]
["Sports arena playing area - class II",25.9,25.9,2950]
["Sports arena playing area - class III",19.399999999999999,19.399999999999999,2950]
["Sports arena playing area - class IV",13,13,2950]
["Stairwell",7.4,7.4,{"$f":"INDEX(ASHRAE_BuildingTable,MATCH(ProjectBuilding,ASHRAE_BuildingTypes,0),7)","v":{"$error":"#N/A"}},true]
["Storage < 50ft2",13.3,13.3,2830]
["Storage ≥50ft2",6.8,6.8,1910,true]
["Transportation - airport concourse",3.9,{"$f":"IF(ProjectUnits=\"Imperial\",ROUND(B94/10.7639104,2),B94)","v":3.9},8760]
["Transportation - baggage/carousel ",5.7,{"$f":"IF(ProjectUnits=\"Imperial\",ROUND(B95/10.7639104,2),B95)","v":5.7},8760]
["Transportation - terminal ticket counter",8.6999999999999993,8.6999999999999993,8760]
["Vehicle maintenance area",7.3,7.3,3880]
["Visually impaired design (RP-28) - chapel",23.8,23.8,2950]
["Visually impaired design (RP-28) - recreation room",25.9,25.9,5220]
["Warehouse storage - fine material",10.199999999999999,{"$f":"IF(ProjectUnits=\"Imperial\",ROUND(B100/10.7639104,2),B100)","v":10.199999999999999},2270,true]
["Warehouse storage - medium/bulky material ",6.2,6.2,2270,true]
["Washroom - for visually impaired",13.1,13.1,4800,true]
["Washroom - general",10.5,10.5,{"$f":"INDEX(ASHRAE_BuildingTable,MATCH(ProjectBuilding,ASHRAE_BuildingTypes,0),6)","v":{"$error":"#N/A"}},true]
["Workshop",17.2,17.2,3880]

{"sheet":"Basic Lists","index":8,"n_rows":107,"n_cols":18,"rows_kept":107,"cut":false,"hidden":true,"merged":[]}
["Yes_No","Project_Types","Compliance_Types","Building_Zones","Units","Compliance_Code","Interior_ControlsTypes","Control Reduction","Control Reduction (OS Req)","Exterior_ControlsTypes","Control Reduction","OSRequired_Spaces","Technology_Types","Ballast List","BallastTypes_Linear","BallastTypes_HID","N_A","Luminaire_Count"]
["Yes","Energy-Efficient Lighting Design","Building area method","Zone 1","Imperial","ASHRAE/IES Standard 90.1-2016",null,null,null,"Photocell and/or timer",0,"Audience/seating area - for auditorium","T8 Fluor linear ","BallastTypes_Linear","IS-NBF","Magn"," ",3]
["No","System Design","Space-by-space method","Zone 2","Metric","NECB 2015","Manual local switch",0,0,"Photocell and/or timer+OS",0.25,"Classroom/lecture/training - for penitentiary","T5/T5HO Fluor linear","BallastTypes_Linear","IS-LBF","Elec",null,4]
[null,"Whole Building Design",null,"Zone 3",null,null,"Scheduling  (building/ floor level)",0,0,null,null,"Classroom/lecture/training - general","Other Fluor linear ","BallastTypes_Linear","IS-HBF",null,null,5]
[null,"NOT USED",null,"Zone 4",null,null,"High-end trim/ output tuning",0.2,0.2,null,null,"Conference/meeting/multipurpose","CFL pin-based","BallastTypes_HID","HE-IS-NBF",null,null,6]
[null,null,null,null,null,null,"Timer local (enclosed area)",0.2,0,null,null,"Copy/print room","CFL screw-in","N_A","HE-IS-LBF",null,null,7]
[null,null,null,null,null,null,"Dimming manual (enclosed area)",0.1,0.1,null,null,"Dressing/fitting room - for performance arts theatre","Induction","N_A","HE-IS-HBF",null,null,8]
[null,null,null,null,null,null,"Dimming (workstation PC-controlled)",0.15,0.15,null,null,"Dressing/fitting room - for retail","LED","N_A","PrS-NBF"]
[null,null,null,null,null,null,"OS (open space)",0.15,0,null,null,"Guest room","OLED","N_A","PrS-LBF"]
[null,null,null,null,null,null,"OS (private/zoned)",0.25,0,null,null,"Health care - lounge/break","MH/CMH/PSMH","BallastTypes_HID","PrS-HBF"]
[null,null,null,null,null,null,"OS+dimming (private/zoned)",0.25,0.1,null,null,"Health care - medical supply","HPS/LPS","BallastTypes_HID","HE-PrS-NBF"]
[null,null,null,null,null,null,null,null,null,null,null,"Laboratory - for classrooms","Plasma","N_A","HE-PrS-LBF"]
[null,null,null,null,null,null,null,null,null,null,null,"Library - stacks","Incand/Halogen ","N_A","HE-PrS-HBF"]
[null,null,null,null,null,null,null,null,null,null,null,"Lobby - for performing arts theatre","Halogen IR","N_A"]
[null,null,null,null,null,null,null,null,null,null,null,"Lobby - for visually impaired","Other","N_A"]
[null,"updated",null,null,null,null,"NLC (building/ floor level)",0.3,0.2,null,null,"Lobby - general"]
[null,"requires work",null,null,null,null,null,null,null,null,null,"Locker room","NOT USED","NOT USED","NOT USED","NOT USED"]
[null,null,null,null,null,null,null,null,null,null,null,"Lounge/break"]
[null,null,null,null,null,null,"v.3.2",null,null,null,null,"Office - enclosed ≤250ft2"]
[null,null,null,null,null,null,"None",0,0,null,null,"Parking/storage garage area"]
[null,null,null,null,null,null,"DDC Controls",0,0,null,null,"Post office - sorting area"]
[null,null,null,null,null,null,"Timer (enclosed area)",0.2,0,null,null,"Stairwell"]
[null,null,null,null,null,null,"Photocell (private or zoned area)",0,0,null,null,"Storage ≥50ft2"]
[null,null,null,null,null,null,"Individual Dimmer (private)",0.1,0.1,null,null,"Warehouse storage - fine material"]
[null,null,null,null,null,null,"OS (open space)",0.15,0,null,null,"Warehouse storage - medium/bulky material "]
[null,null,null,null,null,null,"OS (private/zoned area)",0.25,0,null,null,"Washroom - for visually impared"]
[null,null,null,null,null,null,"OS + Photocell (open space)",0.15,0,null,null,"Washroom - general"]
[null,null,null,null,null,null,"OS + Photocell (private/zoned area)",0.25,0]
[null,null,null,null,null,null,"OS + Indiv. Dim. (private/zoned area)",0.3,0.1]
[null,null,null,null,null,null,"OS (open) + Indiv. Dim. (prvt/zoned)",0.2,0.1]
[null,null,null,null,null,null,"OS + Photo + Indiv. Dim. (prvt/zoned)",0.2,0.1]
[null,null,null,null,null,null,"Photo + Indiv. Dim. (prvt/zoned)",0.1,0.1]
[]
[]
[]
[]
[]
[]
[]
[]
[]
[]
[]
[]
[]
[]
[]
[]
[]
[]
[]
[]
[]
[]
[]
[]
[]
[]
[]
[]
[]
[]
[]
[]
[]
[]
[]
[]
[]
[]
[]
[]
[]
[]
[]
[]
[]
[]
[]
[]
[]
[]
[]
[]
[]
[]
[]
[]
[]
[]
[]
[]
[]
[]
[]
[]
[]
[]
[]
["NCP LC v.4.0"]
["2019-01-15"]
[]
["*For residential type buildings only the area of common spaces shall be included; no residential dwelling suites are eligible for lighting energy savings claim "]
["*Exterior Lighting Zone 4 may be used only when specifically designated by AHJ"]
[]
["m/ft",3.2808399000000001]
["m2/ft2",10.7639104]

{"sheet":"Sheet1","index":9,"n_rows":0,"n_cols":0,"rows_kept":0,"cut":false,"hidden":true,"merged":[]}