{"text_format":"1","workbook":"xlsx","n_sheets":10,"sheets":["User Guide","Introduction","Preliminary","General","Site","Lighting","Results","Ballast Change","Standard Data","Calculations"],"not_rendered":{"charts":0,"images":8,"macros":1,"external_links":0,"defined_names":28,"comments":3,"pivot_tables":0},"unopened":[],"bounds":{"document_bytes":16777216,"sheet_cells":100000,"rows_first":2000,"rows_last":500,"rows_between":2000,"halvings":0,"cell_chars":16384,"cell_head_chars":4096},"cells_cut":0,"cells_raw":0,"read":"whole","date_system":"1900"}

{"sheet":"User Guide","index":0,"n_rows":45,"n_cols":1,"rows_kept":45,"cut":false,"hidden":false,"merged":[[11,0,11,4],[0,0,0,4],[1,0,1,4],[2,0,2,4],[3,0,3,4],[4,0,4,4],[5,0,5,4],[6,0,6,4],[7,0,7,4],[8,0,8,4],[9,0,9,4],[10,0,10,1],[23,0,23,4],[12,0,12,4],[13,0,13,4],[14,0,14,4],[15,0,15,2],[16,0,16,4],[17,0,17,4],[18,0,18,2],[19,0,19,4],[20,0,20,4],[21,0,21,4],[22,0,22,4],[35,0,35,4],[24,0,24,4],[25,0,25,4],[26,0,26,4],[27,0,27,4],[28,0,28,4],[29,0,29,4],[30,0,30,4],[31,0,31,4],[32,0,32,2],[33,0,33,2],[34,0,34,4],[42,0,42,4],[43,0,43,4],[44,0,44,4],[36,0,36,4],[37,0,37,4],[38,0,38,4],[39,0,39,4],[40,0,40,4],[41,0,41,4]]}
["Welcome to BC Hydro PS Greenhouse Lighting Opportunity Assessment Tool! "]
["This tool helps to find an appropriate path for your future energy-savings greenhouse lighting retrofit or new construction project as well as providing a preliminary assessment of possible energy savings."]
["The tool allows you to enter data and get the assessment results on up to 3 sites. When all necessary data has been entered, the tool will calculate the estimated energy savings for each site and for"]
["the entire project and provide the information which route the project should go to. Please note you can enter data in the white fields only; the light green fields are locked."]
["Attention users of Excel versions 2007 and newer! Macros shall be enabled by allowing the active content for the tool. "]
["Watch a for pop-up massage when you complete the first sheet!"]
["The tool is an Excel workbook which consists of 4 worksheets:"]
["• General (Contact information, number of sites)"]
["• Site Information (Information on types, sizes, locations, and working schedule of each site)"]
["• Lighting (General description of existing lighting system for each site)  "]
["• Results (Outcome) "]
["To complete the tool, please follow the instructions below:"]
["Make sure you have all necessary cells filled in, otherwise \"Missing information!\" warning will appear, disabling the proper calculations."]
["1. In General, fill in general project information in the white fields (refer to the comments). As soon as the necessary information is filled in the next two worksheets will come up."]
["Units: Please select your chosen units for area (sqm or sqft) and light units (Lux or PAR)"]
{"$rows_left_out":31}
{"sheet":"Introduction","index":1,"n_rows":27,"n_cols":15,"rows_kept":27,"cut":false,"hidden":false,"merged":[]}
[]
[]
[null,null,null,null,null,null,null,"Welcome to the BC Hydro Power Smart Greenhouse Lighting Opportunity Assessment"]
[]
[null,null,null,null,null,null,null,"To begin, please choose an option below:"]
[]
[]
[]
[]
[]
[]
[]
[]
[]
[]
{"$rows_left_out":13}
{"sheet":"Preliminary","index":2,"n_rows":18,"n_cols":11,"rows_kept":18,"cut":false,"hidden":true,"merged":[[22,1,22,3],[12,4,12,6],[13,4,13,6],[14,4,14,6],[17,4,17,10]]}
[]
[null,"Greenhouse Opportunity Assessment"]
[null,"BCH-QMS-9462-C-093-Greenhouse LOA-Rev000"]
[null,"Retrofit Preliminary Test",null,null,null,null,"Ballast Acronyms"]
[]
[null,"Demand Reduction"]
[null,"Existing Baseline",null,null,null,null,"New Proposed"]
[null,"Luminaire","Luminaire","Luminaire","Existing Annual ","Annual ","Luminaire","Luminaire","Luminaire","Annual ","Annual "]
[null,"Description","Watts","Quantity","Lit Hours","Energy kWh/yr","Description","Watts","Quantity","Lit Hours","Energy kWh/yr"]
[null,null,{"$f":"IFERROR(VLOOKUP(B10,HID_Data1,3,FALSE),0)","v":0},null,null,{"$f":"C10*D10*E10/1000","v":0},null,{"$f":"IFERROR(VLOOKUP(G10,HID_Data1,3,FALSE),0)","v":0},null,null,{"$f":"H10*I10*E10/1000","v":0}]
[]
[null,"Lighting Controls"]
[null,"Project Has Lighting Controls?"]
[null,"Control Type"]
[null,"New Proposed Annual Hours"]
{"$rows_left_out":4}
{"sheet":"General","index":3,"n_rows":24,"n_cols":6,"rows_kept":24,"cut":false,"hidden":true,"merged":[[23,1,23,2],[3,1,3,2]]}
[]
[null,"Greenhouse Opportunity Assessment"]
[null,"BCH-QMS-9462-C-093-Greenhouse LOA-Rev000"]
[null,"General Information"]
[]
[null,"Project Information"]
[null,"Project Type",null,{"$f":"IF(C7=\"\",\"*\",\"\")","v":"*"},{"$f":"IF(D7=\"*\",0,1)","v":0}]
[null,"Customer",null,{"$f":"IF(C8=\"\",\"*\",\"\")","v":"*"},{"$f":"IF(D8=\"*\",0,1)","v":0}]
[null,"Contact Name",null,{"$f":"IF(C9=\"\",\"*\",\"\")","v":"*"},{"$f":"IF(D9=\"*\",0,1)","v":0}]
[null,"Contact Phone",null,{"$f":"IF(C10=\"\",\"*\",\"\")","v":"*"},{"$f":"IF(D10=\"*\",0,1)","v":0}]
[null,"Number of Sites (max. 3)",null,{"$f":"IF(C11=\"\",\"*\",\"\")","v":"*"},{"$f":"IF(D11=\"*\",0,1)","v":0}]
[null,null,null,null,0,"always 0"]
[null,"Information Collected By",null,null,0,"always 0"]
[null,"Company Name",null,{"$f":"IF(C14=\"\",\"*\",\"\")","v":"*"},{"$f":"IF(D14=\"*\",0,1)","v":0}]
[null,"Contact Name",null,{"$f":"IF(C15=\"\",\"*\",\"\")","v":"*"},{"$f":"IF(D15=\"*\",0,1)","v":0}]
{"$rows_left_out":10}
{"sheet":"Site","index":4,"n_rows":25,"n_cols":13,"rows_kept":25,"cut":false,"hidden":true,"merged":[]}
[]
[null,"Greenhouse Lighting OA"]
[null,"BCH-QMS-9462-C-093-Greenhouse LOA-Rev000"]
[null,"Site Information"]
[]
[null,null,1,null,2,null,3,null,null,"Site 1","Site 2","Site 3"]
[null,"Site Name",null,{"$f":"IF(C7=\"\",\"*\",\"\")","v":"*"},null,{"$f":"IF(E7=\"\",\"*\",\"\")","v":"*"},null,{"$f":"IF(G7=\"\",\"*\",\"\")","v":"*"},null,{"$f":"IF(C7=\"\",0,1)","v":0},{"$f":"IF(E7=\"\",0,1)","v":0},{"$f":"IF(G7=\"\",0,1)","v":0}]
[null,"Address",null,null,null,null,null,null,null,0,0,0,"always 0"]
[null,"City",null,null,null,null,null,null,null,0,0,0,"always 0"]
[null,{"$f":"IF(Proj_Area_Units=\"sqm\", \"Existing total lighting area (sqm)\",\"Existing total lighting area (sqft)\")","v":"Existing total lighting area (sqft)"},null,{"$f":"IF(C10=\"\",\"*\",\"\")","v":"*"},null,{"$f":"IF(E10=\"\",\"*\",\"\")","v":"*"},null,{"$f":"IF(G10=\"\",\"*\",\"\")","v":"*"},null,{"$f":"IF(C10=\"\",0,1)","v":0},{"$f":"IF(E10=\"\",0,1)","v":0},{"$f":"IF(G10=\"\",0,1)","v":0}]
[null,{"$f":"IF(Proj_Area_Units=\"sqm\", \"Proposed lighting site area (sqm)\",\"Proposed lighting site area (sqft)\")","v":"Proposed lighting site area (sqft)"},null,"*",null,"*",null,"*",null,{"$f":"IF(C11=\"\",0,1)","v":0},{"$f":"IF(E11=\"\",0,1)","v":0},{"$f":"IF(G11=\"\",0,1)","v":0}]
[null,"Existing crop type",null,"*",null,"*",null,"*",null,0,0,0]
[null,"Proposed crop type",null,"*",null,"*",null,"*",null,0,0,0]
[null,{"$f":"IF('Standard Data'!H31=FALSE,\"Annual lighting hours\",IF(OR(Proj_Type=\"New greenhouse\",Proj_Type=\"Lighting in previously unlit area\"),\"Annual lighting hours (without controls)\",\"Existing annual lighting hours\"))","v":"Annual lighting hours"},null,"*",null,"*",null,"*",null,0,0,0]
[null,{"$f":"IF(OR(Proj_Type=\"New greenhouse\",Proj_Type=\"Lighting in previously unlit area\"),\"Annual lighting hours (with controls)\",\"Proposed annual lighting hours\")","v":"Proposed annual lighting hours"},null,"*",null,"*",null,"*",null,0,0,0]
{"$rows_left_out":11}
{"sheet":"Lighting","index":5,"n_rows":25,"n_cols":16,"rows_kept":25,"cut":false,"hidden":true,"merged":[[24,6,26,6],[24,11,26,11],[24,1,26,1],[21,2,21,4]]}
[]
[null,"Greenhouse Lighting OA"]
[null,"BCH-QMS-9462-C-093-Greenhouse LOA-Rev000"]
[null,"Lighting Information"]
[]
[null,"Luminaire Replacement"]
[null,"Site 1 :",{"$f":"IF(Site!C7=\"\",\"\",Site!C7)","v":""},null,null,null,"Site 2 :",{"$f":"IF(Site!E7=\"\",\"\",Site!E7)","v":""},null,null,null,"Site 3:",{"$f":"IF(Site!G7=\"\",\"\",Site!G7)","v":""}]
[null,"Existing Luminaire Type","Existing Luminaire Quantity","Proposed Luminaire Type","Proposed Luminaire Quantity",null,"Existing Luminaire Type","Existing Luminaire Quantity","Proposed Luminaire Type","Proposed Luminaire Quantity",null,"Existing Luminaire Type","Existing Luminaire Quantity","Proposed Luminaire Type","Proposed Luminaire Quantity"]
[null,null,null,null,null,{"$f":"IF(OR(B9=\"\",C9=\"\",D9=\"\",E9=\"\"),\"*\",\"\")","v":"*"},null,null,null,null,{"$f":"IF(OR(G9=\"\",H9=\"\",I9=\"\",J9=\"\"),\"*\",\"\")","v":"*"},null,null,null,null,{"$f":"IF(OR(L9=\"\",M9=\"\",N9=\"\",O9=\"\"),\"*\",\"\")","v":"*"}]
[]
[]
[]
[]
[]
[]
{"$rows_left_out":11}
{"sheet":"Results","index":6,"n_rows":11,"n_cols":7,"rows_kept":11,"cut":false,"hidden":true,"merged":[[11,1,11,2]]}
[]
[null,"Greenhouse Lighting Opportunity Assessment"]
[null,"BCH-QMS-9462-C-093-Greenhouse LOA-Rev000"]
[null,"Assessment Results - Potentially Incentable Savings"]
[null,null,null,null,{"$f":"IF(Proj_Type=\"Lighting Retrofit (same illuminance)\",\"Values relative to existing levels\",\"Values relative to PSE-calculated virtual baseline\")","v":"Values relative to PSE-calculated virtual baseline"}]
[null,"Site Name","Proposed Luminaire Savings (kWh/yr)","Proposed Controls Savings (kWh/yr)","Total Proposed Savings (kWh/yr)","Calculated illuminance matches with proposed levels?"]
[1,{"$f":"IF(Site!C7=\"\",\"\",Site!C7)","v":""},{"$f":"IF(ISNUMBER(Calculations!F35),-Calculations!F35,\"MISSING INFO!\")","v":0},{"$f":"IF(ISNUMBER(Calculations!H35),-Calculations!H35,\"MISSING INFO!\")","v":0},{"$f":"C7+D7","v":0},{"$f":"IFERROR(IF(ABS((Calculations!$N$25-Calculations!$O$25)/Calculations!$N$25)<0.1,\"YES\",\">10% difference between baseline and calculated\"),\"N/A\")","v":"N/A"},{"$f":"IFERROR(IF(ABS((Calculations!$Q$25-Calculations!$R$25)/Calculations!$Q$25)<0.1,\"YES\",\">10% difference between proposed and calculated\"),\"N/A\")","v":"N/A"}]
[2,{"$f":"IF(Site!E7=\"\",\"\",Site!E7)","v":""},{"$f":"IF(ISNUMBER(Calculations!F68),-Calculations!F68,\"MISSING INFO!\")","v":0},{"$f":"IF(ISNUMBER(Calculations!H68),-Calculations!H68,\"MISSING INFO!\")","v":0},{"$f":"C8+D8","v":0},{"$f":"IFERROR(IF(ABS((Calculations!$N$58-Calculations!$O$58)/Calculations!$N$58)<0.1,\"YES\",\">10% difference between baseline and calculated\"),\"N/A\")","v":"N/A"},{"$f":"IFERROR(IF(ABS((Calculations!$Q$58-Calculations!$R$58)/Calculations!$Q$58)<0.1,\"YES\",\">10% difference between proposed and calculated\"),\"N/A\")","v":"N/A"}]
[3,{"$f":"IF(Site!G7=\"\",\"\",Site!G7)","v":""},{"$f":"IF(ISNUMBER(Calculations!F101),-Calculations!F101,\"MISSING INFO!\")","v":0},{"$f":"IF(ISNUMBER(Calculations!H101),-Calculations!H101,\"MISSING INFO!\")","v":0},{"$f":"C9+D9","v":0},{"$f":"IFERROR(IF(ABS((Calculations!$N$91-Calculations!$O$91)/Calculations!$N$91)<0.1,\"YES\",\">10% difference between baseline and calculated\"),\"N/A\")","v":"N/A"},{"$f":"IFERROR(IF(ABS((Calculations!$Q$91-Calculations!$R$91)/Calculations!$Q$91)<0.1,\"YES\",\">10% difference between proposed and calculated\"),\"N/A\")","v":"N/A"}]
[null,"Total",{"$f":"SUM(C7:C9)","v":0},{"$f":"SUM(D7:D9)","v":0},{"$f":"SUM(E7:E9)","v":0}]
[null,null,null,null,"Negative values signify increased energy consumption"]

{"sheet":"Ballast Change","index":7,"n_rows":12,"n_cols":4,"rows_kept":12,"cut":false,"hidden":true,"merged":[[3,1,3,2],[24,1,24,2]]}
[]
[null,"Greenhouse Opportunity Assessment"]
[null,"BCH-QMS-9462-C-093-Greenhouse LOA-Rev000"]
[null,"Simple Ballast Change"]
[]
[null,"Luminaire Quantity"]
[null,"Lamp Wattage",null,{"$f":"IF(C7=\"600W\",20,IF(C7=\"750W\",45,IF(C7=\"1000W\",68,\"\")))","v":""}]
[null,"Existing Ballast Type"]
[null,"Proposed Ballast Type"]
[null,"Annual Lighting Hours"]
[]
[null,"Energy Savings (kWh/yr)",{"$f":"IFERROR(IF(D7*C6*C10/1000=0,\"\",D7*C6*C10/1000),\"\")","v":""}]

{"sheet":"Standard Data","index":8,"n_rows":42,"n_cols":27,"rows_kept":42,"cut":false,"hidden":true,"merged":[]}
["Greenhouse HIDs 1","Nominal W","Input W","Degraded Mean Output lm","Degraded Mean Output µmols","#Sites","Control Types","Crop Types","Baseline (No Lighting) Data",null,null,null,null,"Proj Types","Yes/No","Length Units","Area Units","Illuminance Units","Standard Illuminance Levels",null,"Illuminance","Line Voltages","Lighting Functions","Ballast Types","Lamp Wattages","Start BT","Control Types"]
["No Lighting",0,{"$f":"IF(Site!$C$20=\"\",\"MISS INFO\",VLOOKUP(Site!$C$20,No_Light_Data,2,FALSE))","v":"MISS INFO"},{"$f":"IF(OR(Site!$C$20=\"\"),\"MISS INFO\",VLOOKUP(Site!$C$20,No_Light_Data,3,FALSE))","v":"MISS INFO"},{"$f":"IF(OR(Site!$C$20=\"\"),\"MISS INFO\",VLOOKUP(Site!$C$20,No_Light_Data,4,FALSE))","v":"MISS INFO"},1,"Manual On/Off","Tomatoes","Eq. HID","Height","Equiv W","Equiv lm","µmols",{"$f":"IF(H29=\"Retrofit\",\"Lighting Retrofit (same illuminance)\",IF(H29=\"New\",\"New Greenhouse\",\"ERROR\"))","v":"Lighting Retrofit (same illuminance)"},"Yes","m","sqm","Lux","µmol (PAR)","lx",{"$f":"IF(Proj_Illum_Units=\"Lux\",T3,S3)","v":13.2},120,"Propagation","Single-Coil Reactor","600W","Constant-Wattage","Manual controls"]
["UNUSED",0,{"$f":"IF(Site!$C$20=\"\",\"MISS INFO\",VLOOKUP(Site!$C$20,No_Light_Data,2,FALSE))","v":"MISS INFO"},{"$f":"IF(OR(Site!$C$20=\"\"),\"MISS INFO\",VLOOKUP(Site!$C$20,No_Light_Data,3,FALSE))","v":"MISS INFO"},{"$f":"IF(OR(Site!$C$20=\"\"),\"MISS INFO\",VLOOKUP(Site!$C$20,No_Light_Data,4,FALSE))","v":"MISS INFO"},2,"Photosensor: On/Off","Cucumbers","600W.CWA","0 to 4",665,77000,990,{"$f":"IF(H29=\"Retrofit\",\"Lighting Retrofit (increased illuminance)\",IF(H29=\"New\",\"Lighting in previously unlit area\",\"ERROR\"))","v":"Lighting Retrofit (increased illuminance)"},"No","ft","sqft","PAR",13.2,1000,26.4,208,"Production","Electronic","750W",null,"Photosensor with Computer Control"]
["400W.HPS.CWA",400,455,50000,645,3,"Photosensor: 50%-50% On/Off","Sweet Peppers","600W.CWA","4 to 8",665,77000,990,null,null,null,null,null,26.4,2000,39.6,240,"Production & Photoperiod",null,"1000W",null,"Photosensor with Computer Hardwired Zone Control"]
["600W.HPS.CWA",600,665,77000,990,null,"Photosensor: 25%-50%-75% On/Off","Hot Peppers","750W.CWA","6 to 10",840,93000,1200,null,null,null,null,null,39.6,3000,52.8,347]
["750W.HPS.CWA",750,830,93000,1200,null,"Photosensor: Dimming","Bedding Plants","1,000W.CWA","8 to 12",1100,121000,1665,null,null,null,null,null,52.8,4000,66,400]
["1000W.HPS.CWA",1000,1100,121000,1665,null,"Programming/Scheduling","Potted Flowers",null,null,null,null,null,null,null,null,null,null,66,5000,79.2,480]
["600W.HPS.SRB",600,645,80000,1030,null,null,"Potted Foliage",null,null,null,null,null,null,null,null,null,null,79.2,6000,92.4]
["750W.HPS.SRB",750,795,94000,1250,null,null,"Gerbera",null,null,null,null,null,null,null,null,null,null,92.4,7000,105.6]
["600W.HPS.EI",600,645,80000,1030,null,null,"Roses",null,null,null,null,null,null,null,null,null,null,105.6,8000,118.8]
["750W.HPS.EI",750,771,95000,1255,null,null,"Alstroemeria",null,null,null,null,null,null,null,null,null,null,118.8,9000,132]
["1000W.HPS.EI",1000,1032,126000,1720,null,null,"Lilies",null,null,null,null,null,null,null,null,null,null,132,10000,145.19999999999999]
[" ",0,0,0,0,null,null,"Iris",null,null,null,null,null,null,null,null,null,null,145.19999999999999,11000,158.4]
["empty row at bottom is for unused rows in Lighting sheet",null,null,null,null,null,null,null,null,null,null,null,null,null,null,null,null,null,158.4,12000,171.6]
["Greenhouse HIDs 2","Nominal W","Input W","Degraded Mean Output lm","Degraded Mean Output µmols",null,null,null,null,null,null,null,null,null,null,null,null,null,171.6,13000,184.8]
{"$rows_left_out":28}
{"sheet":"Calculations","index":9,"n_rows":101,"n_cols":20,"rows_kept":101,"cut":false,"hidden":true,"merged":[[92,6,92,7],[89,9,89,10],[90,9,90,10],[91,9,91,10],[88,6,88,8],[89,6,89,7],[90,6,90,7],[91,6,91,7],[22,6,22,8],[23,6,23,7],[24,6,24,7],[25,6,25,7],[26,6,26,7],[28,9,28,10],[29,9,29,10],[30,9,30,10],[31,9,31,10],[23,9,23,10],[24,9,24,10],[25,9,25,10],[26,9,26,10],[27,9,27,10],[97,1,97,2],[98,1,98,2],[99,1,99,2],[100,1,100,2],[92,1,92,2],[93,1,93,2],[94,1,94,2],[95,1,95,2],[96,1,96,2],[66,1,66,2],[67,1,67,2],[89,1,89,2],[90,1,90,2],[91,1,91,2],[61,1,61,2],[62,1,62,2],[63,1,63,2],[64,1,64,2],[65,1,65,2],[56,1,56,2],[57,1,57,2],[58,1,58,2],[59,1,59,2],[60,1,60,2],[34,1,34,2],[31,1,31,2],[32,1,32,2],[33,1,33,2],[23,1,23,2],[24,1,24,2],[25,1,25,2],[26,1,26,2],[27,1,27,2],[28,1,28,2],[29,1,29,2],[30,1,30,2],[59,6,59,7],[56,9,56,10],[57,9,57,10],[58,9,58,10],[55,6,55,8],[56,6,56,7],[57,6,57,7],[58,6,58,7]]}
[null,"This color means: VALUE COPIED FROM INFO",null,null,null,"Compliance:"]
[null,"This color means: VALUE CALCULATED FROM INFO",null,null,null,"Passes A","Passes B","Passes C","Passes D",null,"Compliance Result","Failure Reason"]
[null,"This color means: TOTALLED VALUE",null,null,null,{"$f":"(Preliminary!F10>Preliminary!K10)","v":false},{"$f":"Preliminary!E13=\"Yes\"","v":false},{"$f":"Preliminary!F10>(Preliminary!H10*Preliminary!I10*Preliminary!E15/1000)","v":false},{"$f":"Preliminary!E14='Standard Data'!AA4","v":false},null,{"$f":"IF(F3,\"PROJECT POTENTIALLY INCENTABLE\",\"PROJECT DOES NOT APPEAR INCENTABLE: \")","v":"PROJECT DOES NOT APPEAR INCENTABLE: "},{"$f":"IF(F3=FALSE,\"PROJECT MUST HAVE DEMAND REDUCTION\",\"\")&IF(OR(AND(G3,I3=FALSE),G3=FALSE),\"; CONTROL SCHEME INELIGIBLE FOR INCENTIVE\",\"\")&IF(AND(H3=FALSE,F3),\"PROJECT MUST HAVE FINAL ENERGY SAVINGS\",\"\")","v":"PROJECT MUST HAVE DEMAND REDUCTION; CONTROL SCHEME INELIGIBLE FOR INCENTIVE"}]
[]
[]
[]
[]
[null,"Site 1"]
[null,null,null,null,"single","single","total","total","total",null,null,null,null,"single","single","total","total","total"]
[null,"Existing Luminaire","# of Existing Luminaires","Existing Annual Hrs","Existing Input W Per Luminaire","Existing Lm per Luminaire","Existing Total Input W","Existing Total Lm","Existing Total kWh/yr",null,"Proposed Luminaire","# of Proposed Luminaires","Proposed Annual Hrs","Proposed Input W Per Luminaire","Proposed Lm per Luminaire","Proposed Total Input W","Proposed Total Lm","Proposed Total kWh/yr",null,"exist lumens"]
[null,{"$f":"IF(Lighting!B$9=\"\",\" \",IF(Proj_Type=\"Lighting Retrofit (increased illuminance)\",\"UNUSED\",Lighting!B$9))","v":" "},{"$f":"IF(K11=\" \",0,IF(Proj_Type=\"Lighting Retrofit (same illuminance)\",IF(Lighting!C9=\"\",0,Lighting!C9),IF(OR(B11=\"No Lighting\",B11=\"UNUSED\"),IF(ISNUMBER($I$27),$I$27,0),0)))","v":0},{"$f":"IF(OR(K11=\" \",B11=\" \"),0,Site!$C$14)","v":0},{"$f":"IF(K11=\" \",0,VLOOKUP(B11,HID_Data1,3,FALSE))","v":0},{"$f":"IF(K11=\" \",0,VLOOKUP(B11,HID_Data1,4,FALSE))","v":0},{"$f":"IFERROR(C11*E11,\"MISS INFO\")","v":0},{"$f":"IFERROR(C11*F11,\"MISS INFO\")","v":0},{"$f":"IFERROR(D11*G11/1000,\"MISS INFO\")","v":0},null,{"$f":"IF(Lighting!D9=\"\",\" \",Lighting!D9)","v":" "},{"$f":"IF(Lighting!E9=\"\",0,Lighting!E9)","v":0},{"$f":"IF(K11=\" \",0,Site!$C$15)","v":0},{"$f":"VLOOKUP(K11,HID_Data1,3,FALSE)","v":0},{"$f":"VLOOKUP(K11,HID_Data1,4,FALSE)","v":0},{"$f":"IFERROR(L11*N11,\"MISS INFO\")","v":0},{"$f":"IFERROR(L11*O11,\"MISS INFO\")","v":0},{"$f":"IFERROR(M11*P11/1000,\"MISS INFO\")","v":0},null,{"$f":"IF(Lighting!B$9=\"\",0,VLOOKUP(Lighting!B$9,HID_Data1,4,FALSE)*Lighting!C$9)","v":0}]
[null,{"$f":"IF(Lighting!B$10=\"\",\" \",IF(Proj_Type=\"Lighting Retrofit (increased illuminance)\",\"UNUSED\",Lighting!B$10))","v":" "},{"$f":"IF(K12=\" \",0,IF(Proj_Type=\"Lighting Retrofit (same illuminance)\",IF(Lighting!C10=\"\",0,Lighting!C10),IF(OR(B12=\"No Lighting\",B12=\"UNUSED\"),IF(ISNUMBER($I$27),$I$27,0),0)))","v":0},{"$f":"IF(OR(K12=\" \",B12=\" \"),0,Site!$C$15)","v":0},{"$f":"IF(K12=\" \",0,VLOOKUP(B12,HID_Data1,3,FALSE))","v":0},0,{"$f":"IFERROR(C12*E12,\"MISS INFO\")","v":0},{"$f":"IFERROR(C12*F12,\"MISS INFO\")","v":0},{"$f":"IFERROR(D12*G12/1000,\"MISS INFO\")","v":0},null,{"$f":"IF(Lighting!D10=\"\",\" \",Lighting!D10)","v":" "},{"$f":"IF(Lighting!E10=\"\",0,Lighting!E10)","v":0},{"$f":"IF(K12=\" \",0,Site!$C$15)","v":0},0,0,{"$f":"IFERROR(L12*N12,\"MISS INFO\")","v":0},{"$f":"IFERROR(L12*O12,\"MISS INFO\")","v":0},{"$f":"IFERROR(M12*P12/1000,\"MISS INFO\")","v":0},null,{"$f":"IF(Lighting!B$10=\"\",0,VLOOKUP(Lighting!B$10,HID_Data1,4,FALSE)*Lighting!C$10)","v":0}]
[null,{"$f":"IF(Lighting!B$11=\"\",\" \",IF(Proj_Type=\"Lighting Retrofit (increased illuminance)\",\"UNUSED\",Lighting!B$11))","v":" "},{"$f":"IF(K13=\" \",0,IF(Proj_Type=\"Lighting Retrofit (same illuminance)\",IF(Lighting!C11=\"\",0,Lighting!C11),IF(OR(B13=\"No Lighting\",B13=\"UNUSED\"),IF(ISNUMBER($I$27),$I$27,0),0)))","v":0},{"$f":"IF(OR(K13=\" \",B13=\" \"),0,Site!$C$16)","v":0},0,0,0,0,0,null,{"$f":"IF(Lighting!D11=\"\",\" \",Lighting!D11)","v":" "},{"$f":"IF(Lighting!E11=\"\",0,Lighting!E11)","v":0},{"$f":"IF(K13=\" \",0,Site!$C$15)","v":0},0,0,0,0,0,null,{"$f":"IF(Lighting!B$11=\"\",0,VLOOKUP(Lighting!B$11,HID_Data1,4,FALSE)*Lighting!C$11)","v":0}]
[null,{"$f":"IF(Lighting!B$12=\"\",\" \",IF(Proj_Type=\"Lighting Retrofit (increased illuminance)\",\"UNUSED\",Lighting!B$12))","v":" "},{"$f":"IF(K14=\" \",0,IF(Proj_Type=\"Lighting Retrofit (same illuminance)\",IF(Lighting!C12=\"\",0,Lighting!C12),IF(OR(B14=\"No Lighting\",B14=\"UNUSED\"),IF(ISNUMBER($I$27),$I$27,0),0)))","v":0},{"$f":"IF(OR(K14=\" \",B14=\" \"),0,Site!$C$17)","v":0},0,0,0,0,0,null,{"$f":"IF(Lighting!D12=\"\",\" \",Lighting!D12)","v":" "},{"$f":"IF(Lighting!E12=\"\",0,Lighting!E12)","v":0},{"$f":"IF(K14=\" \",0,Site!$C$15)","v":0},0,0,0,0,0,null,{"$f":"IF(Lighting!B$12=\"\",0,VLOOKUP(Lighting!B$12,HID_Data1,4,FALSE)*Lighting!C$12)","v":0}]
[null,{"$f":"IF(Lighting!B$13=\"\",\" \",IF(Proj_Type=\"Lighting Retrofit (increased illuminance)\",\"UNUSED\",Lighting!B$13))","v":" "},{"$f":"IF(K15=\" \",0,IF(Proj_Type=\"Lighting Retrofit (same illuminance)\",IF(Lighting!C13=\"\",0,Lighting!C13),IF(OR(B15=\"No Lighting\",B15=\"UNUSED\"),IF(ISNUMBER($I$27),$I$27,0),0)))","v":0},{"$f":"IF(OR(K15=\" \",B15=\" \"),0,Site!$C$18)","v":0},0,0,0,0,0,null,{"$f":"IF(Lighting!D13=\"\",\" \",Lighting!D13)","v":" "},{"$f":"IF(Lighting!E13=\"\",0,Lighting!E13)","v":0},{"$f":"IF(K15=\" \",0,Site!$C$15)","v":0},0,0,0,0,0,null,{"$f":"IF(Lighting!B$13=\"\",0,VLOOKUP(Lighting!B$13,HID_Data1,4,FALSE)*Lighting!C$13)","v":0}]
{"$rows_left_out":86}