{"text_format":"1","workbook":"xlsx","n_sheets":9,"sheets":["Intro","Project Info & Results","Luminaire Schedule","Interior - Building Area Method","Interior - Space-By-Space","Exterior","ASHRAE","NECB","Basic Lists"],"not_rendered":{"charts":2,"images":6,"macros":1,"external_links":2,"defined_names":61,"comments":3,"pivot_tables":0},"unopened":[],"bounds":{"document_bytes":16777216,"sheet_cells":100000,"rows_first":2000,"rows_last":500,"rows_between":2000,"halvings":0,"cell_chars":16384,"cell_head_chars":4096},"cells_cut":0,"cells_raw":0,"read":"whole","date_system":"1900"}

{"sheet":"Intro","index":0,"n_rows":3,"n_cols":1,"rows_kept":3,"cut":false,"hidden":false,"merged":[[1,0,1,12]]}
["BC Hydro Power Smart Commercial New Construction Program"]
[]
[{"$f":"'Basic Lists'!A100","v":"BC Hydro Power Smart CNC LC v.3.1"}]

{"sheet":"Project Info & Results","index":1,"n_rows":24,"n_cols":8,"rows_kept":24,"cut":false,"hidden":false,"merged":[[0,1,0,4],[1,1,1,4],[3,4,3,7],[18,5,18,7],[19,5,19,7]]}
[null,"BC Hydro Power Smart Commercial New Construction Program"]
[null,"New Construction Lighting Calculator"]
[null,{"$f":"'Basic Lists'!A100","v":"BC Hydro Power Smart CNC LC v.3.1"}]
[null,"Project Information",null,null,"Project Totals"]
[]
[null,"Project Name",null,null,null,"Interior","Exterior","Total"]
[null,"Project Site Address",null,null,"Baseline Demand, kW",{"$f":"IF(ProjectMethod=SBS,'Interior - Space-By-Space'!$AV$65,IF(ProjectMethod=BAM,'Interior - Building Area Method'!$O$59,0))","v":0},{"$f":"IF(ISNUMBER(Exterior!$AB$54),Exterior!$AB$54,0)","v":0},{"$f":"F7+G7","v":0}]
[null,"Customer Contact Name",null,null,"Baseline Energy Consumption, kWh",{"$f":"IF(ProjectMethod=SBS,'Interior - Space-By-Space'!$AT$65,IF(ProjectMethod=BAM,'Interior - Building Area Method'!$O$60,0))","v":0},{"$f":"IF(ISNUMBER(Exterior!$Z$54),Exterior!$Z$54,0)","v":0},{"$f":"F8+G8","v":0}]
[null,"Customer Contact Tel. #",null,null,"Design Demand, kW",{"$f":"IF(ProjectMethod=SBS,'Interior - Space-By-Space'!$AW$65,IF(ProjectMethod=BAM,'Interior - Building Area Method'!$O$61,0))","v":0},{"$f":"Exterior!$AC$54","v":0},0]
[null,"Consultant Company",null,null,"Design Energy Consumption, kWh",{"$f":"IF(ProjectMethod=SBS,'Interior - Space-By-Space'!$AU$65,IF(ProjectMethod=BAM,'Interior - Building Area Method'!$O$62,0))","v":0},{"$f":"Exterior!$AA$54","v":0},0]
{"$rows_left_out":15}
{"sheet":"Luminaire Schedule","index":2,"n_rows":157,"n_cols":9,"rows_kept":157,"cut":false,"hidden":false,"merged":[[3,1,3,2],[0,1,0,8],[1,1,1,8]]}
[null,"BC Hydro Power Smart Commercial New Construction Program"]
[null,"New Construction Lighting Calculator"]
[null,{"$f":"'Basic Lists'!A100","v":"BC Hydro Power Smart CNC LC v.3.1"}]
[null,"Luminaire Schedule"]
["Example","A1","4' suspended ",28,2,"T8 Fluor linear ","HE-PrS-NBF",48,100]
[null,"Luminaire Type","Luminaire Description","Lamp Wattage","Number of Lamps","Technology Type","Ballast Type","Total Wattage","# of Luminaires"]
[null,null,null,null,null,null,null,null,{"$f":"IF(ProjectMethod=SBS,SUM(SUMIF('Interior - Space-By-Space'!$M$16:OFFSET('Interior - Space-By-Space'!$M$65,-1,0),$B7,'Interior - Space-By-Space'!$O$16:OFFSET('Interior - Space-By-Space'!$O$65,-1,0)),SUMIF('Interior - Space-By-Space'!$Q$16:OFFSET('Interior - Space-By-Space'!$Q$65,-1,0),$B7,'Interior - Space-By-Space'!$S$16:OFFSET('Interior - Space-By-Space'!$S$65,-1,0)),SUMIF('Interior - Space-By-Space'!$U$16:OFFSET('Interior - Space-By-Space'!$U$65,-1,0),$B7,'Interior - Space-By-Space'!$W$16:OFFSET('Interior - Space-By-Space'!$W$65,-1,0)),SUMIF('Interior - Space-By-Space'!$Y$16:OFFSET('Interior - Space-By-Space'!$Y$65,-1,0),$B7,'Interior - Space-By-Space'!$AA$16:OFFSET('Interior - Space-By-Space'!$AA$65,-1,0)),SUMIF('Interior - Space-By-Space'!$AC$16:OFFSET('Interior - Space-By-Space'!$AC$65,-1,0),$B7,'Interior - Space-By-Space'!$AE$16:OFFSET('Interior - Space-By-Space'!$AE$65,-1,0)),SUMIF('Interior - Space-By-Space'!$AG$16:OFFSET('Interior - Space-By-Space'!$AG$65,-1,0),$B7,'Interior - Space-By-Space'!$AI$16:OFFSET('Interior - Space-By-Space'!$AI$65,-1,0)),SUMIF('Interior - Space-By-Space'!$AK$16:OFFSET('Interior - Space-By-Space'!$AK$65,-1,0),$B7,'Interior - Space-By-Space'!$AM$16:OFFSET('Interior - Space-By-Space'!$AM$65,-1,0)),SUMIF('Interior - Space-By-Space'!$AO$16:OFFSET('Interior - Space-By-Space'!$AO$65,-1,0),$B7,'Interior - Space-By-Space'!$AQ$16:OFFSET('Interior - Space-By-Space'!$AQ$65,-1,0))),IF(ProjectMethod=BAM,SUM('Interior - Building Area Method'!$C18,'Interior - Building Area Method'!$E18,'Interior - Building Area Method'!$G18,'Interior - Building Area Method'!$I18,'Interior - Building Area Method'!$K18),0))+SUM(SUMIF(Exterior!$J$19:$J$53,$B7,Exterior!$K$19:$K$53),SUMIF(Exterior!$M$19:$M$53,$B7,Exterior!$N$19:$N$53),SUMIF(Exterior!$P$19:$P$53,$B7,Exterior!$Q$19:$Q$53),SUMIF(Exterior!$S$19:$S$53,$B7,Exterior!$T$19:$T$53),SUMIF(Exterior!$V$19:$V$53,$B7,Exterior!$W$19:$W$53))","v":0}]
[null,null,null,null,null,null,null,null,{"$f":"IF(ProjectMethod=SBS,SUM(SUMIF('Interior - Space-By-Space'!$M$16:OFFSET('Interior - Space-By-Space'!$M$65,-1,0),$B8,'Interior - Space-By-Space'!$O$16:OFFSET('Interior - Space-By-Space'!$O$65,-1,0)),SUMIF('Interior - Space-By-Space'!$Q$16:OFFSET('Interior - Space-By-Space'!$Q$65,-1,0),$B8,'Interior - Space-By-Space'!$S$16:OFFSET('Interior - Space-By-Space'!$S$65,-1,0)),SUMIF('Interior - Space-By-Space'!$U$16:OFFSET('Interior - Space-By-Space'!$U$65,-1,0),$B8,'Interior - Space-By-Space'!$W$16:OFFSET('Interior - Space-By-Space'!$W$65,-1,0)),SUMIF('Interior - Space-By-Space'!$Y$16:OFFSET('Interior - Space-By-Space'!$Y$65,-1,0),$B8,'Interior - Space-By-Space'!$AA$16:OFFSET('Interior - Space-By-Space'!$AA$65,-1,0)),SUMIF('Interior - Space-By-Space'!$AC$16:OFFSET('Interior - Space-By-Space'!$AC$65,-1,0),$B8,'Interior - Space-By-Space'!$AE$16:OFFSET('Interior - Space-By-Space'!$AE$65,-1,0)),SUMIF('Interior - Space-By-Space'!$AG$16:OFFSET('Interior - Space-By-Space'!$AG$65,-1,0),$B8,'Interior - Space-By-Space'!$AI$16:OFFSET('Interior - Space-By-Space'!$AI$65,-1,0)),SUMIF('Interior - Space-By-Space'!$AK$16:OFFSET('Interior - Space-By-Space'!$AK$65,-1,0),$B8,'Interior - Space-By-Space'!$AM$16:OFFSET('Interior - Space-By-Space'!$AM$65,-1,0)),SUMIF('Interior - Space-By-Space'!$AO$16:OFFSET('Interior - Space-By-Space'!$AO$65,-1,0),$B8,'Interior - Space-By-Space'!$AQ$16:OFFSET('Interior - Space-By-Space'!$AQ$65,-1,0))),IF(ProjectMethod=BAM,SUM('Interior - Building Area Method'!$C19,'Interior - Building Area Method'!$E19,'Interior - Building Area Method'!$G19,'Interior - Building Area Method'!$I19,'Interior - Building Area Method'!$K19),0))+SUM(SUMIF(Exterior!$J$19:$J$53,$B8,Exterior!$K$19:$K$53),SUMIF(Exterior!$M$19:$M$53,$B8,Exterior!$N$19:$N$53),SUMIF(Exterior!$P$19:$P$53,$B8,Exterior!$Q$19:$Q$53),SUMIF(Exterior!$S$19:$S$53,$B8,Exterior!$T$19:$T$53),SUMIF(Exterior!$V$19:$V$53,$B8,Exterior!$W$19:$W$53))","v":0}]
[null,null,null,null,null,null,null,null,{"$f":"IF(ProjectMethod=SBS,SUM(SUMIF('Interior - Space-By-Space'!$M$16:OFFSET('Interior - Space-By-Space'!$M$65,-1,0),$B9,'Interior - Space-By-Space'!$O$16:OFFSET('Interior - Space-By-Space'!$O$65,-1,0)),SUMIF('Interior - Space-By-Space'!$Q$16:OFFSET('Interior - Space-By-Space'!$Q$65,-1,0),$B9,'Interior - Space-By-Space'!$S$16:OFFSET('Interior - Space-By-Space'!$S$65,-1,0)),SUMIF('Interior - Space-By-Space'!$U$16:OFFSET('Interior - Space-By-Space'!$U$65,-1,0),$B9,'Interior - Space-By-Space'!$W$16:OFFSET('Interior - Space-By-Space'!$W$65,-1,0)),SUMIF('Interior - Space-By-Space'!$Y$16:OFFSET('Interior - Space-By-Space'!$Y$65,-1,0),$B9,'Interior - Space-By-Space'!$AA$16:OFFSET('Interior - Space-By-Space'!$AA$65,-1,0)),SUMIF('Interior - Space-By-Space'!$AC$16:OFFSET('Interior - Space-By-Space'!$AC$65,-1,0),$B9,'Interior - Space-By-Space'!$AE$16:OFFSET('Interior - Space-By-Space'!$AE$65,-1,0)),SUMIF('Interior - Space-By-Space'!$AG$16:OFFSET('Interior - Space-By-Space'!$AG$65,-1,0),$B9,'Interior - Space-By-Space'!$AI$16:OFFSET('Interior - Space-By-Space'!$AI$65,-1,0)),SUMIF('Interior - Space-By-Space'!$AK$16:OFFSET('Interior - Space-By-Space'!$AK$65,-1,0),$B9,'Interior - Space-By-Space'!$AM$16:OFFSET('Interior - Space-By-Space'!$AM$65,-1,0)),SUMIF('Interior - Space-By-Space'!$AO$16:OFFSET('Interior - Space-By-Space'!$AO$65,-1,0),$B9,'Interior - Space-By-Space'!$AQ$16:OFFSET('Interior - Space-By-Space'!$AQ$65,-1,0))),IF(ProjectMethod=BAM,SUM('Interior - Building Area Method'!$C20,'Interior - Building Area Method'!$E20,'Interior - Building Area Method'!$G20,'Interior - Building Area Method'!$I20,'Interior - Building Area Method'!$K20),0))+SUM(SUMIF(Exterior!$J$19:$J$53,$B9,Exterior!$K$19:$K$53),SUMIF(Exterior!$M$19:$M$53,$B9,Exterior!$N$19:$N$53),SUMIF(Exterior!$P$19:$P$53,$B9,Exterior!$Q$19:$Q$53),SUMIF(Exterior!$S$19:$S$53,$B9,Exterior!$T$19:$T$53),SUMIF(Exterior!$V$19:$V$53,$B9,Exterior!$W$19:$W$53))","v":0}]
[null,null,null,null,null,null,null,null,{"$f":"IF(ProjectMethod=SBS,SUM(SUMIF('Interior - Space-By-Space'!$M$16:OFFSET('Interior - Space-By-Space'!$M$65,-1,0),$B10,'Interior - Space-By-Space'!$O$16:OFFSET('Interior - Space-By-Space'!$O$65,-1,0)),SUMIF('Interior - Space-By-Space'!$Q$16:OFFSET('Interior - Space-By-Space'!$Q$65,-1,0),$B10,'Interior - Space-By-Space'!$S$16:OFFSET('Interior - Space-By-Space'!$S$65,-1,0)),SUMIF('Interior - Space-By-Space'!$U$16:OFFSET('Interior - Space-By-Space'!$U$65,-1,0),$B10,'Interior - Space-By-Space'!$W$16:OFFSET('Interior - Space-By-Space'!$W$65,-1,0)),SUMIF('Interior - Space-By-Space'!$Y$16:OFFSET('Interior - Space-By-Space'!$Y$65,-1,0),$B10,'Interior - Space-By-Space'!$AA$16:OFFSET('Interior - Space-By-Space'!$AA$65,-1,0)),SUMIF('Interior - Space-By-Space'!$AC$16:OFFSET('Interior - Space-By-Space'!$AC$65,-1,0),$B10,'Interior - Space-By-Space'!$AE$16:OFFSET('Interior - Space-By-Space'!$AE$65,-1,0)),SUMIF('Interior - Space-By-Space'!$AG$16:OFFSET('Interior - Space-By-Space'!$AG$65,-1,0),$B10,'Interior - Space-By-Space'!$AI$16:OFFSET('Interior - Space-By-Space'!$AI$65,-1,0)),SUMIF('Interior - Space-By-Space'!$AK$16:OFFSET('Interior - Space-By-Space'!$AK$65,-1,0),$B10,'Interior - Space-By-Space'!$AM$16:OFFSET('Interior - Space-By-Space'!$AM$65,-1,0)),SUMIF('Interior - Space-By-Space'!$AO$16:OFFSET('Interior - Space-By-Space'!$AO$65,-1,0),$B10,'Interior - Space-By-Space'!$AQ$16:OFFSET('Interior - Space-By-Space'!$AQ$65,-1,0))),IF(ProjectMethod=BAM,SUM('Interior - Building Area Method'!$C21,'Interior - Building Area Method'!$E21,'Interior - Building Area Method'!$G21,'Interior - Building Area Method'!$I21,'Interior - Building Area Method'!$K21),0))+SUM(SUMIF(Exterior!$J$19:$J$53,$B10,Exterior!$K$19:$K$53),SUMIF(Exterior!$M$19:$M$53,$B10,Exterior!$N$19:$N$53),SUMIF(Exterior!$P$19:$P$53,$B10,Exterior!$Q$19:$Q$53),SUMIF(Exterior!$S$19:$S$53,$B10,Exterior!$T$19:$T$53),SUMIF(Exterior!$V$19:$V$53,$B10,Exterior!$W$19:$W$53))","v":0}]
{"$rows_left_out":148}
{"sheet":"Interior - Building Area Method","index":3,"n_rows":168,"n_cols":16,"rows_kept":168,"cut":false,"hidden":false,"merged":[[49,14,49,15],[10,1,10,4],[0,1,0,12],[1,1,1,12],[15,1,15,4],[16,13,16,15],[3,1,3,2],[17,14,17,15],[25,14,25,15],[33,14,33,15],[41,14,41,15],[6,2,6,4],[7,2,7,4],[8,2,8,4],[5,1,5,6]]}
[null,"BC Hydro Power Smart Commercial New Construction Program"]
[null,"New Construction Lighting Calculator"]
[null,{"$f":"'Basic Lists'!A100","v":"BC Hydro Power Smart CNC LC v.3.1"}]
[null,"Interior Lighting Calculator"]
[]
[null,"Interior Totals"]
[null,"LPD Savings",{"$f":"IF(SUM($C$14:$K$14)=0,0,(C8*1000)/SUM($C$14:$K$14))","v":0},null,null,null,{"$f":"IF(ProjectUnits=\"Imperial\",\"W/sqft\",\"W/sqm\")","v":"W/sqm"}]
[null,"Demand Savings",{"$f":"O59-O61","v":0},null,null,null,"kW"]
[null,"Energy Savings",{"$f":"O60-O62","v":0},null,null,null,"kWh"]
[]
{"$rows_left_out":159}
{"sheet":"Interior - Space-By-Space","index":4,"n_rows":65,"n_cols":55,"rows_kept":65,"cut":false,"hidden":false,"merged":[[12,44,12,45],[12,49,12,50],[0,2,0,12],[1,2,1,12],[12,12,12,13],[5,2,5,5],[6,2,6,3],[7,2,7,3],[8,2,8,3],[9,2,9,3],[8,8,9,10],[8,12,9,12]]}
[null,null,"BC Hydro Power Smart Commercial New Construction Program"]
[null,null,"New Construction Lighting Calculator"]
[null,null,{"$f":"'Basic Lists'!A100","v":"BC Hydro Power Smart CNC LC v.3.1"}]
[null,null,"Interior Lighting Calculator"]
[]
[null,null,"Interior Totals"]
[null,null,"Demand Savings",null,{"$f":"$AY$65","v":0},"kW"]
[null,null,"Energy Savings - LPD",null,{"$f":"$AZ$65","v":0},"kWh"]
[null,null,"Energy Savings - LIGHTING CONTROLS",null,{"$f":"$BA$65","v":0},"kWh",null,null,"Number of Luminaire Columns to Show:",null,null,null,4]
[null,null,"Energy Savings - TOTAL",null,{"$f":"$BB$65","v":0},"kWh"]
{"$rows_left_out":56}
{"sheet":"Exterior","index":5,"n_rows":54,"n_cols":34,"rows_kept":54,"cut":false,"hidden":false,"merged":[[15,29,15,30],[0,2,0,9],[1,2,1,9],[15,9,15,10],[15,24,15,25],[11,2,11,3],[6,4,6,5],[7,4,7,5],[8,4,8,5],[9,4,9,5],[6,2,6,3],[7,2,7,3],[8,2,8,3],[9,2,9,3],[5,2,5,6]]}
[null,null,"BC Hydro Power Smart Commercial New Construction Program"]
[null,null,"New Construction Lighting Calculator"]
[null,null,{"$f":"'Basic Lists'!A100","v":"BC Hydro Power Smart CNC LC v.3.1"}]
[null,null,"Exterior Lighting Calculator"]
[]
[null,null,"Exterior Totals"]
[null,null,"Demand Savings",null,{"$f":"$AE$54","v":{"$error":"#VALUE!"}},null,"kW"]
[null,null,"Energy Savings - LPD",null,{"$f":"$AF$54","v":{"$error":"#VALUE!"}},null,"kWh"]
[null,null,"Energy Savings - LIGHTING CONTROLS",null,{"$f":"$AG$54","v":0},null,"kWh"]
[null,null,"Energy Savings - TOTAL",null,{"$f":"$AH$54","v":{"$error":"#VALUE!"}},null,"kWh"]
{"$rows_left_out":45}
{"sheet":"ASHRAE","index":6,"n_rows":100,"n_cols":21,"rows_kept":100,"cut":false,"hidden":true,"merged":[]}
["ASHRAE/IES Standard 90.1-2010 Part 9 Lighting"]
[null,null,null,null,null,null,null,null,null,null,null,null,null,null,{"$f":"N2+1","v":1},{"$f":"O2+1","v":2},3,4,5,6,7]
["INTERIOR",null,null,null,null,null,null,"EXTERIOR",null,null,null,null,null,null,"BUILDING TYPES"]
["Proposed Effective Table",null,null,null,null,null,null,"Proposed Effective Table",null,null,null,null,null,null,"Proposed Effective Table",null,null,null,"*","*","*"]
["Proposed Space Names","LPD (W/sqft ) [default units]",{"$f":"IF(ProjectUnits=\"Imperial\",\"LPD (W/sqft) [active units]\",\"LPD (W/sqm) [active units]\")","v":"LPD (W/sqm) [active units]"},"Annual Hours","OS/ TC Required?","RCR Threshold",null,"Proposed Space Names","Zone 1 LPD (W/sqft ) [default units]","Zone 2 LPD (W/sqft ) [default units]","Zone 3 LPD (W/sqft ) [default units]","Zone 4 LPD (W/sqft ) [default units]",{"$f":"\"Zone \"&IF(ISBLANK(ProjectZone),\"N/A\",RIGHT(ProjectZone))&\" LPD \"&IF(ProjectUnits=\"Imperial\",\"(W/sqft)\",\"(W/sqm)\")&\" [active zone, active units]\"","v":"Zone N/A LPD (W/sqm) [active zone, active units]"},null,"Proposed Building Type Names","LPD (W/sqft) [default units]",{"$f":"IF(ProjectUnits=\"Imperial\",\"LPD (W/sqft) [active units]\",\"LPD (W/sqm) [active units]\")","v":"LPD (W/sqm) [active units]"},"Hours","Common areas","Washroom/ Locker room","Stairway"]
["Airport - Concourse",0.36,{"$f":"IF(ProjectUnits=\"Imperial\",B6,ROUND(B6*10.7639104,1))","v":3.9},8760,null,4,null,"Entry canopies",0.25,0.25,0.4,0.4,{"$f":"ROUND(IF(ProjectUnits=\"Imperial\",INDEX(ASHRAE_ExteriorTable,1,RIGHT(ProjectZone)+1),INDEX(ASHRAE_ExteriorTable,1,RIGHT(ProjectZone)+1)*10.7639104),2)","v":{"$error":"#VALUE!"}},null,"Automotive facility",0.82,{"$f":"IF(ProjectUnits=\"Imperial\",P6,ROUND(P6*10.7639104,1))","v":8.8000000000000007},3210,3880,3100,2910]
[{"$f":"IF(ProjectUnits = \"Imperial\", \"Atrium - First 40ft in height\", \"Atrium - First 13m in height\")","v":"Atrium - First 13m in height"},0.03,{"$f":"IF(ProjectUnits=\"Imperial\",B7,ROUND(B7*3.2808399,1))","v":0.1},3880,null,1000000,null,"Landscaping",0.04,0.05,0.05,0.05,{"$f":"ROUND(IF(ProjectUnits=\"Imperial\",INDEX(ASHRAE_ExteriorTable,2,RIGHT(ProjectZone)+1),INDEX(ASHRAE_ExteriorTable,2,RIGHT(ProjectZone)+1)*10.7639104),2)","v":{"$error":"#VALUE!"}},null,"Convention centre",1.08,11.6,3530,3880,3100,2910]
[{"$f":"IF(ProjectUnits = \"Imperial\", \"Atrium - Height above 40ft\", \"Atrium - Height above 13m\")","v":"Atrium - Height above 13m"},0.02,{"$f":"IF(ProjectUnits=\"Imperial\",B8,ROUND(B8*3.2808399,2))","v":7.0000000000000007E-2},3880,null,1000000,null,"Main entries [linear]",20,20,30,30,{"$f":"ROUND(IF(ProjectUnits=\"Imperial\",INDEX(ASHRAE_ExteriorTable,3,RIGHT(ProjectZone)+1),INDEX(ASHRAE_ExteriorTable,3,RIGHT(ProjectZone)+1)*'Basic Lists'!B106),2)","v":{"$error":"#VALUE!"}},null,"Courthouse",1.05,11.3,2820,2930,2340,2200]
["Audience/Seating Area - For auditorium",0.79,{"$f":"IF(ProjectUnits=\"Imperial\",B9,ROUND(B9*10.7639104,1))","v":8.5},2980,true,6,null,"Open outdoor sales areas, vehicle sales lots",0.25,0.25,0.5,0.7,{"$f":"ROUND(IF(ProjectUnits=\"Imperial\",INDEX(ASHRAE_ExteriorTable,4,RIGHT(ProjectZone)+1),INDEX(ASHRAE_ExteriorTable,4,RIGHT(ProjectZone)+1)*10.7639104),2)","v":{"$error":"#VALUE!"}},null,"Dining: bar lounge/leisure",0.99,10.7,4740,5220,4180,3920]
["Audience/Seating Area - For Convention Centre",0.82,8.8000000000000007,3880,null,4,null,"Other (non-main) entries [linear]",20,20,20,20,{"$f":"ROUND(IF(ProjectUnits=\"Imperial\",INDEX(ASHRAE_ExteriorTable,5,RIGHT(ProjectZone)+1),INDEX(ASHRAE_ExteriorTable,5,RIGHT(ProjectZone)+1)*'Basic Lists'!B106),2)","v":{"$error":"#VALUE!"}},null,"Dining: cafeteria/fast food",0.9,9.6999999999999993,4590,5220,4180,3920]
{"$rows_left_out":91}
{"sheet":"NECB","index":7,"n_rows":104,"n_cols":17,"rows_kept":104,"cut":false,"hidden":true,"merged":[]}
["National Energy Code of Canada for Buildings (NECB) 2011 Division B Part 4 Lighting"]
[null,null,null,null,null,null,null,null,null,null,null,null,null,{"$f":"M2+1","v":1},{"$f":"N2+1","v":2},3,4]
["INTERIOR",null,null,null,null,null,"EXTERIOR",null,null,null,null,null,null,"BUILDING TYPES"]
["Proposed Effective Table",null,null,null,null,null,"Proposed Effective Table",null,null,null,null,null,null,"Proposed Effective Table"]
["Proposed Space Names","LPD (W/sqm) [default units]",{"$f":"IF(ProjectUnits=\"Imperial\",\"LPD (W/sqft) [active units]\",\"LPD (W/sqm) [active units]\")","v":"LPD (W/sqm) [active units]"},"Annual hours","OS/ TC Required?",null,"Proposed Space Names","Zone 1 LPD (W/sqm ) [default units]","Zone 2 LPD (W/sqm ) [default units]","Zone 3 LPD (W/sqm ) [default units]","Zone 4 LPD (W/sqm ) [default units]",{"$f":"\"Zone \"&IF(ISBLANK(ProjectZone),\"N/A\",RIGHT(ProjectZone))&\" LPD \"&IF(ProjectUnits=\"Imperial\",\"(W/sqft)\",\"(W/sqm)\")&\" [active zone, active units]\"","v":"Zone N/A LPD (W/sqm) [active zone, active units]"},null,"Proposed Building Type Names","LPD (W/sqm) [default units]",{"$f":"IF(ProjectUnits=\"Imperial\",\"LPD (W/sqft) [active units]\",\"LPD (W/sqm) [active units]\")","v":"LPD (W/sqm) [active units]"},"Hours"]
["Airport - Concourse",3.9,{"$f":"IF(ProjectUnits=\"Imperial\",ROUND(B6/10.7639104,2),B6)","v":3.9},8760,null,null,"Entry canopies",2.7,2.7,4.3,4.3,{"$f":"IF(ProjectUnits=\"Imperial\",INDEX(NECB_ExteriorTable,1,RIGHT(ProjectZone)+1)/10.7639104,INDEX(NECB_ExteriorTable,1,RIGHT(ProjectZone)+1))","v":{"$error":"#VALUE!"}},null,"Automotive facility",8.8000000000000007,{"$f":"IF(ProjectUnits=\"Imperial\",ROUND(O6/10.7639104,2),O6)","v":8.8000000000000007},3210]
[{"$f":"IF(ProjectUnits = \"Imperial\", \"Atrium - First 40ft in height\", \"Atrium - First 13m in height\")","v":"Atrium - First 13m in height"},0.1,{"$f":"IF(ProjectUnits=\"Imperial\",ROUND(B7/3.2808399,2),B7)","v":0.1},3880,null,null,"Landscaping",0.4,0.5,0.5,0.5,{"$f":"IF(ProjectUnits=\"Imperial\",INDEX(NECB_ExteriorTable,2,RIGHT(ProjectZone)+1)/10.7639104,INDEX(NECB_ExteriorTable,2,RIGHT(ProjectZone)+1))","v":{"$error":"#VALUE!"}},null,"Convention centre",11.6,11.6,3530]
[{"$f":"IF(ProjectUnits = \"Imperial\", \"Atrium - Height above 40ft\", \"Atrium - Height above 13m\")","v":"Atrium - Height above 13m"},7.0000000000000007E-2,{"$f":"IF(ProjectUnits=\"Imperial\",ROUND(B8/3.2808399,2),B8)","v":7.0000000000000007E-2},3880,null,null,"Main entries [linear]",66,66,98,98,{"$f":"ROUND(IF(ProjectUnits=\"Imperial\",INDEX(NECB_ExteriorTable,3,RIGHT(ProjectZone)+1)/'Basic Lists'!$B106,INDEX(NECB_ExteriorTable,3,RIGHT(ProjectZone)+1)),2)","v":{"$error":"#VALUE!"}},null,"Courthouse",11.3,11.3,2820]
["Audience/Seating Area - For auditorium",8.5,{"$f":"IF(ProjectUnits=\"Imperial\",ROUND(B9/10.7639104,2),B9)","v":8.5},2980,true,null,"Open outdoor sales areas, vehicle sales lots",2.7,2.7,5.4,7.5,{"$f":"IF(ProjectUnits=\"Imperial\",INDEX(NECB_ExteriorTable,4,RIGHT(ProjectZone)+1)/10.7639104,INDEX(NECB_ExteriorTable,4,RIGHT(ProjectZone)+1))","v":{"$error":"#VALUE!"}},null,"Dining: bar lounge/leisure",10.7,10.7,4740]
["Audience/Seating Area - For Convention Centre",8.8000000000000007,8.8000000000000007,3880,null,null,"Other (non-main) entries [linear]",66,66,66,66,{"$f":"ROUND(IF(ProjectUnits=\"Imperial\",INDEX(NECB_ExteriorTable,5,RIGHT(ProjectZone)+1)/'Basic Lists'!$B106,INDEX(NECB_ExteriorTable,5,RIGHT(ProjectZone)+1)),2)","v":{"$error":"#VALUE!"}},null,"Dining: cafeteria/fast food",9.6999999999999993,9.6999999999999993,4590]
{"$rows_left_out":95}
{"sheet":"Basic Lists","index":8,"n_rows":107,"n_cols":18,"rows_kept":107,"cut":false,"hidden":true,"merged":[]}
["Yes_No","Project_Types","Compliance_Types","Building_Zones","Units","Compliance_Code","Interior_ControlsTypes","Control Reduction","Control Reduction (OS Req)","Exterior_ControlsTypes","Control Reduction","OSRequired_Spaces","Technology_Types","Ballast List","BallastTypes_Linear","BallastTypes_HID","N_A","Luminaire_Count"]
["Yes","Energy-Efficient Lighting Design","Building Area Method","Zone 1","Imperial","ASHRAE/IES Standard 90.1-2010","None",0,0,"Photocell and/or Timer",0,"Audience/Seating Area - For auditorium","T8 Fluor linear ","BallastTypes_Linear","IS-NBF","Magn"," ",3]
["No","System Design","Space-By-Space Method","Zone 2","Metric","NECB 2011","DDC Controls",0,0,"Photocell + Timer + OS",0.25,"Classroom/Lecture/Training - for Penitentiary","T5/T5HO Fluor linear","BallastTypes_Linear","IS-LBF","Elec",null,4]
[null,"Whole Building Design",null,"Zone 3",null,null,"Timer (enclosed area)",0.2,0,null,null,"Classroom/Lecture/Training - General","Other Fluor linear ","BallastTypes_Linear","IS-HBF",null,null,5]
[null,null,null,"Zone 4",null,null,"Photocell (private or zoned area)",0.15,0.15,null,null,"Conference/Meeting/Multipurpose","CFL pin-based","BallastTypes_HID","HE-IS-NBF",null,null,6]
[null,null,null,null,null,null,"Individual Dimmer (private)",0.1,0.1,null,null,"Dressing/Fitting Room - for Performance Arts Theatre","CFL screw-in","N_A","HE-IS-LBF",null,null,7]
[null,null,null,null,null,null,"OS (open space)",0.15,0,null,null,"Dressing/Fitting Room - for Retail","Induction","N_A","HE-IS-HBF",null,null,8]
[null,null,null,null,null,null,"OS (private/zoned area)",0.3,0,null,null,"Locker Room","LED","N_A","PrS-NBF"]
[null,null,null,null,null,null,"OS + Photocell (open space)",0.2,0.1,null,null,"Lounge/Recreation","OLED","N_A","PrS-LBF"]
[null,null,null,null,null,null,"OS + Photocell (private/zoned area)",0.3,0.15,null,null,"Office - Enclosed","MH/CMH/PSMH","BallastTypes_HID","PrS-HBF"]
{"$rows_left_out":97}