{"text_format":"1","workbook":"xlsx","n_sheets":19,"sheets":["Revisions Log","BC Hydro Summary","Instructions","Proposal","Study Inputs","Study Results","Proforma","Incremental Costs","LCC Analysis","CopyPaste","Study Fee Estimator","REFERENCE","Baseline Hourly Results","Proposed Hourly Results","BCH Baseline Table","Proposal Review - Mechanical","Proposal Review - Lighting","Study Review - Mechanical","Study Review - Lighting"],"not_rendered":{"charts":2,"images":1,"macros":1,"external_links":1,"defined_names":18,"comments":4,"pivot_tables":0},"unopened":[],"bounds":{"document_bytes":16777216,"sheet_cells":100000,"rows_first":2000,"rows_last":500,"rows_between":2000,"halvings":0,"cell_chars":16384,"cell_head_chars":4096},"cells_cut":0,"cells_raw":0,"read":"whole","date_system":"1900"}

{"sheet":"Revisions Log","index":0,"n_rows":4,"n_cols":9,"rows_kept":4,"cut":false,"hidden":true,"merged":[]}
["Year","Month","Day","By","Sheet","Changed","From","To","Why"]
[]
[2015,"November",12,"Salah","Proposal","Columns named \"ECM # (up to 24) where applicable\"","missing \" . \" in some cells","put \" . \" where missing","because it was causing cells in \"Study Inputs\" sheet to appear as yellow"]
[null,null,null,null,"Study Inputs","Columns named \"ECM # (up to 24) where applicable\"","some cells not linked to \"Proposal\" sheet","all cells now linked to \"Proposal\" sheet"]

{"sheet":"BC Hydro Summary","index":1,"n_rows":91,"n_cols":6,"rows_kept":91,"cut":false,"hidden":false,"merged":[[0,2,0,3],[69,0,77,5],[89,1,89,5],[90,1,90,5],[85,1,85,5],[86,1,86,5]]}
[null,null,"NEW \nCONSTRUCTION \nPROGRAM",null,{"$f":"IF('Study Results'!B92=0, \"Proposal\", \"Study Report\")","v":"Proposal"}]
["Energy Modeling Study Report Summary"]
["Project Name",{"$f":"'Study Inputs'!B5","v":0},null,null,"printed:",{"$f":"TODAY()","v":"2016-06-30"}]
["Project Owner",{"$f":"'Study Inputs'!B8","v":"company"},null,null,"BC Hydro Ref #",{"$f":"'Study Inputs'!D1","v":0}]
["Building Types",{"$f":"IF('Study Inputs'!B19=0,\"\",'Study Inputs'!B19)","v":""},{"$f":"IF('Study Inputs'!C19=0,\"\",'Study Inputs'!C19)","v":""},{"$f":"IF('Study Inputs'!D19=0,\"\",'Study Inputs'!D19)","v":""},{"$f":"IF('Study Inputs'!E19=0,\"\",'Study Inputs'!E19)","v":""},"Total Conditioned Area (m2)"]
["Conditioned Area (m2)",{"$f":"IFERROR(IF('Study Inputs'!A19=\"Metric units\",IF(B5=\"\",\"\",'Study Inputs'!B22),(IF(B5=\"\",\"\",'Study Inputs'!B22))/10.76),\"\")","v":""},{"$f":"IFERROR(IF('Study Inputs'!B19=\"Metric units\",IF(C5=\"\",\"\",'Study Inputs'!C22),(IF(C5=\"\",\"\",'Study Inputs'!C22))/10.76),\"\")","v":""},{"$f":"IFERROR(IF('Study Inputs'!C19=\"Metric units\",IF(D5=\"\",\"\",'Study Inputs'!D22),(IF(D5=\"\",\"\",'Study Inputs'!D22))/10.76),\"\")","v":""},{"$f":"IFERROR(IF('Study Inputs'!D19=\"Metric units\",IF(E5=\"\",\"\",'Study Inputs'!E22),(IF(E5=\"\",\"\",'Study Inputs'!E22))/10.76),\"\")","v":""},{"$f":"SUM(B6:E6)","v":0}]
{"$rows_left_out":86}
{"sheet":"Instructions","index":2,"n_rows":80,"n_cols":2,"rows_kept":80,"cut":false,"hidden":false,"merged":[[62,0,62,12],[26,0,26,12],[30,0,30,12],[18,0,18,11],[45,0,45,12],[41,0,41,12],[50,0,50,12],[51,0,51,12],[52,0,52,12],[54,0,54,12],[56,0,56,12],[32,0,32,12],[37,0,37,12],[39,0,39,12],[34,0,34,12],[58,0,58,12],[16,1,16,12],[22,0,22,12],[49,0,49,12],[5,0,5,12],[8,1,8,12],[9,1,9,12],[10,1,10,12],[15,1,15,12],[13,1,13,12],[14,1,14,12]]}
["BC Hydro Power Smart - New Construction Program"]
["Energy Modeling Study Proposal and Report Workbook"]
[]
["Introduction"]
[]
["This workbook has been developed by BC Hydro New Construction Program to standardize energy modeling study reporting format and provide consultants performing the work minimum inputs/results information required for technical review and proposal/study approval process. This workbook is to be completed as part of the requirements for energy study funding under BC Hydro's New Construction Program and it has to be submitted to BC Hydro in electronic format. \n\nAt project application stage, this workbook (with Proposal worksheet filled out) is to be submitted along with project application and consultants' proposal(s). The consultant's proposal(s) do not need to contain project technical details, but just  a reference to this workbook (Proposal worksheet tab).   Information provided in this workbook need not be duplicated in Consultants' proposal(s).  \n\nAt study report submission stage, this workbook is the only document required by BC Hydro for review. Consultants are welcome to organize and present study results to the customer in different format. If required, consultants are also welcome to add additional worksheets to the end of this workbook with additional calculations and project's details.\n\nThe workbook has been formatted to minimize re-entering data and shall be filled out in the following order:"]
{"$rows_left_out":75}
{"sheet":"Proposal","index":3,"n_rows":221,"n_cols":19,"rows_kept":221,"cut":false,"hidden":false,"merged":[[6,1,6,4],[150,0,167,5],[22,1,22,4],[86,15,86,17],[101,15,101,17],[118,15,118,17],[136,15,136,17],[140,15,140,17],[49,16,49,17],[68,15,68,17],[77,16,77,17],[50,15,50,17],[79,15,79,17],[44,16,44,17],[45,16,45,17],[46,16,46,17],[47,16,47,17],[48,16,48,17],[39,16,39,17],[40,16,40,17],[41,16,41,17],[42,16,42,17],[43,15,43,17],[34,16,34,17],[38,16,38,17],[30,15,30,17],[32,16,32,17],[33,16,33,17],[31,16,31,17],[86,10,86,12],[35,16,35,17],[44,11,44,12],[45,11,45,12],[46,11,46,12],[47,11,47,12],[48,11,48,12],[39,11,39,12],[68,10,68,12],[77,11,77,12],[50,10,50,12],[34,11,34,12],[35,11,35,12],[36,11,36,12],[37,11,37,12],[38,11,38,12],[30,10,30,12],[32,11,32,12],[33,11,33,12],[31,11,31,12],[30,5,30,7],[32,6,32,7],[33,6,33,7],[31,6,31,7],[34,6,34,7],[143,1,143,2],[37,1,37,2],[38,1,38,2],[41,1,41,2],[86,5,86,7],[101,5,101,7],[140,0,140,2],[101,0,101,2],[118,0,118,2],[136,0,136,2],[141,11,141,12],[142,11,142,12],[143,11,143,12],[50,5,50,7],[79,5,79,7],[118,5,118,7],[33,1,33,2],[31,1,31,2],[30,0,30,2],[32,1,32,2],[34,1,34,2],[35,1,35,2],[36,1,36,2],[79,0,79,2],[86,0,86,2],[43,0,43,2],[44,1,44,2],[39,1,39,2],[77,1,77,2],[50,0,50,2],[40,1,40,2],[42,1,42,2],[35,6,35,7],[36,6,36,7],[37,6,37,7],[38,6,38,7],[79,10,79,12],[141,16,141,17],[142,16,142,17],[143,16,143,17],[136,10,136,12],[136,5,136,7],[101,10,101,12],[41,11,41,12],[42,11,42,12],[43,10,43,12],[39,6,39,7],[40,6,40,7],[41,6,41,7],[42,6,42,7],[43,5,43,7],[118,10,118,12],[49,11,49,12],[77,6,77,7],[36,16,36,17],[37,16,37,17],[144,16,144,17],[137,1,137,2],[138,1,138,2],[139,1,139,2],[141,1,141,2],[142,1,142,2],[137,6,137,7],[138,6,138,7],[139,6,139,7],[137,11,137,12],[138,11,138,12],[139,11,139,12],[140,10,140,12],[140,5,140,7],[144,1,144,2],[141,6,141,7],[142,6,142,7],[143,6,143,7],[144,6,144,7],[144,11,144,12],[4,1,4,4],[5,1,5,4],[124,0,124,2],[124,5,124,7],[124,10,124,12],[124,15,124,17],[130,0,130,2],[130,5,130,7],[130,10,130,12],[130,15,130,17],[45,1,45,2],[46,1,46,2],[47,1,47,2],[49,1,49,2],[48,1,48,2],[68,0,68,2],[44,6,44,7],[45,6,45,7],[46,6,46,7],[47,6,47,7],[48,6,48,7],[49,6,49,7],[68,5,68,7],[40,11,40,12]]}
["NC Program - Energy Study Proposal",null,"BC Hydro Ref # >>>"]
["Green cells for user inputs (if applicable)",null,"BC Hydro KAM >>>"]
[null,null,"Proposal Date  >>>"]
["1. General Information"]
["Project Name"]
["Location/Address"]
{"$rows_left_out":216}
{"sheet":"Study Inputs","index":4,"n_rows":161,"n_cols":19,"rows_kept":161,"cut":false,"hidden":false,"merged":[[39,16,39,17],[40,16,40,17],[41,16,41,17],[42,16,42,17],[43,15,43,17],[86,15,86,17],[101,15,101,17],[44,16,44,17],[45,16,45,17],[46,16,46,17],[47,16,47,17],[48,16,48,17],[118,15,118,17],[136,15,136,17],[140,15,140,17],[49,16,49,17],[68,15,68,17],[77,16,77,17],[50,15,50,17],[79,15,79,17],[130,15,130,17],[124,15,124,17],[137,16,137,17],[138,16,138,17],[139,16,139,17],[37,16,37,17],[38,16,38,17],[30,15,30,17],[32,16,32,17],[33,16,33,17],[31,16,31,17],[31,11,31,12],[33,11,33,12],[32,11,32,12],[30,10,30,12],[38,11,38,12],[37,11,37,12],[36,11,36,12],[35,11,35,12],[34,11,34,12],[34,16,34,17],[35,16,35,17],[36,16,36,17],[43,10,43,12],[42,11,42,12],[41,11,41,12],[40,11,40,12],[39,11,39,12],[48,11,48,12],[47,11,47,12],[46,11,46,12],[45,11,45,12],[44,11,44,12],[79,10,79,12],[50,10,50,12],[77,11,77,12],[68,10,68,12],[49,11,49,12],[140,10,140,12],[136,10,136,12],[118,10,118,12],[101,10,101,12],[86,10,86,12],[130,10,130,12],[124,10,124,12],[137,11,137,12],[138,11,138,12],[139,11,139,12],[79,0,79,2],[86,0,86,2],[101,0,101,2],[118,0,118,2],[136,0,136,2],[77,1,77,2],[49,1,49,2],[68,0,68,2],[140,0,140,2],[130,0,130,2],[124,0,124,2],[137,1,137,2],[138,1,138,2],[139,1,139,2],[140,5,140,7],[50,5,50,7],[79,5,79,7],[86,5,86,7],[101,5,101,7],[118,5,118,7],[136,5,136,7],[48,6,48,7],[130,5,130,7],[124,5,124,7],[137,6,137,7],[138,6,138,7],[139,6,139,7],[4,1,4,4],[5,1,5,4],[40,1,40,2],[41,1,41,2],[42,1,42,2],[43,0,43,2],[44,1,44,2],[45,1,45,2],[39,1,39,2],[38,1,38,2],[30,0,30,2],[32,1,32,2],[33,1,33,2],[31,1,31,2],[34,1,34,2],[35,1,35,2],[36,1,36,2],[37,1,37,2],[22,1,22,4],[6,1,6,4],[46,1,46,2],[47,1,47,2],[48,1,48,2],[49,6,49,7],[68,5,68,7],[77,6,77,7],[46,6,46,7],[47,6,47,7],[45,6,45,7],[50,0,50,2],[40,6,40,7],[41,6,41,7],[42,6,42,7],[43,5,43,7],[44,6,44,7],[39,6,39,7],[30,5,30,7],[32,6,32,7],[33,6,33,7],[31,6,31,7],[35,6,35,7],[36,6,36,7],[37,6,37,7],[38,6,38,7],[34,6,34,7],[160,0,178,5],[141,11,141,12],[142,11,142,12],[143,11,143,12],[144,11,144,12],[141,16,141,17],[142,16,142,17],[143,16,143,17],[144,16,144,17],[141,1,141,2],[142,1,142,2],[143,1,143,2],[144,1,144,2],[141,6,141,7],[142,6,142,7],[143,6,143,7],[144,6,144,7],[150,0,158,5]]}
["NC Program - Energy Study Submission",null,{"$f":"Proposal!C1","v":"BC Hydro Ref # >>>"},{"$f":"Proposal!D1","v":0},null,"Yellow cells indicate change from the proposal inputs."]
[null,null,{"$f":"Proposal!C2","v":"BC Hydro KAM >>>"},{"$f":"Proposal!D2","v":0}]
[]
["1. General Information"]
[{"$f":"Proposal!A5","v":"Project Name"},{"$f":"Proposal!B5","v":0}]
[{"$f":"Proposal!A6","v":"Location/Address"},{"$f":"Proposal!B6","v":0}]
{"$rows_left_out":156}
{"sheet":"Study Results","index":5,"n_rows":148,"n_cols":58,"rows_kept":148,"cut":false,"hidden":false,"merged":[[53,0,53,4],[54,0,54,4],[52,0,52,3],[3,1,3,4],[3,8,3,11]]}
["NC Program - Energy Study Results",{"$f":"B52","v":"BC Hydro\nBaseline"},{"$f":"C52","v":"% of BC Hydro\nBaseline Total"},0,"EPM\nIf applicable","%\nsvg","ECM-1","%\nsvg","ECM-2","%\nsvg","ECM-3","%\nsvg","ECM-4","%\nsvg","ECM-5","%\nsvg","ECM-6","%\nsvg","ECM-7","%\nsvg","ECM-8","%\nsvg","ECM-9","%\nsvg","ECM-10","%\nsvg","ECM-11","%\nsvg","ECM-12","%\nsvg","ECM-13","%\nsvg","ECM-14","%\nsvg","ECM-15","%\nsvg","ECM-16","%\nsvg","ECM-17","%\nsvg","ECM-18","%\nsvg","ECM-19","%\nsvg","ECM-20","%\nsvg","ECM-21","%\nsvg","ECM-22","%\nsvg","ECM-23","%\nsvg","ECM-24","%\nsvg","Proposed","% of Proposed"]
["Green cells for user inputs (if applicable)",null,"DATE of SUBMISSION >>>","yyyy-mm-dd"]
["Different building types must have separate meters for electricity and gas where applicable. Energy consumption from individual meters is to be used to fill tese two tables."]
[null,"BC Hydro BASELINE Building",null,null,null,null,"TOTAL BASELINE",null,"PROPOSED Building (Approved Bundle)",null,null,null,null,null,null,"PROPOSED BUILDINGS"]
["Electricity in kWh / year\nGas in ekWh / year","Building Type 1","Building Type 2","Building Type 3","Building Type 4",null,"SUM (all buildings)",null,"Building Type 1","Building Type 2","Building Type 3","Building Type 4",null,"SUM (all buildings)",null,"Electricity in kWh / year\nGas in ekWh / year"]
["Space Heating (electric)",null,null,null,null,null,{"$f":"SUM(B6:E6)","v":0},null,null,null,null,null,null,{"$f":"SUM(I6:L6)","v":0},null,{"$f":"A6","v":"Space Heating (electric)"}]
{"$rows_left_out":143}
{"sheet":"Proforma","index":6,"n_rows":56,"n_cols":32,"rows_kept":56,"cut":false,"hidden":true,"merged":[]}
[null,"Cash flows"]
[]
[]
["Year","Measure 1","Measure 2","Measure 3","Measure 4","Measure 5","Measure 6","Measure 7","Measure 8","Measure 9","Measure 10","Measure 11","Measure 12","Measure 13","Measure 14","Measure 15","Measure 16","Measure 17","Measure 18","Measure 19","Measure 20","Measure 21","Measure 22","Measure 23","Measure 24","Measure 25",null,"Bundle 1","Bundle 2","Bundle 3","Bundle 4","Bundle 5"]
[null,"Savings","Savings","Savings","Savings","Savings","Savings","Savings","Savings","Savings","Savings","Savings","Savings","Savings","Savings","Savings","Savings","Savings","Savings","Savings","Savings","Savings","Savings","Savings","Savings","Savings",null,"Savings","Savings","Savings","Savings","Savings"]
[0,{"$f":"-'LCC Analysis'!$H$23","v":0},{"$f":"-'LCC Analysis'!$H$24","v":0},{"$f":"-'LCC Analysis'!$H$25","v":0},{"$f":"-'LCC Analysis'!$H$26","v":0},{"$f":"-'LCC Analysis'!$H$27","v":0},{"$f":"-'LCC Analysis'!$H$28","v":0},{"$f":"-'LCC Analysis'!$H$29","v":0},{"$f":"-'LCC Analysis'!$H$30","v":0},{"$f":"-'LCC Analysis'!$H$31","v":0},{"$f":"-'LCC Analysis'!$H$32","v":0},{"$f":"-'LCC Analysis'!$H$33","v":0},{"$f":"-'LCC Analysis'!$H$34","v":0},{"$f":"-'LCC Analysis'!$H$35","v":0},{"$f":"-'LCC Analysis'!$H$36","v":0},{"$f":"-'LCC Analysis'!$H$37","v":0},{"$f":"-'LCC Analysis'!$H$38","v":0},{"$f":"-'LCC Analysis'!$H$39","v":0},{"$f":"-'LCC Analysis'!$H$40","v":0},{"$f":"-'LCC Analysis'!$H$41","v":0},{"$f":"-'LCC Analysis'!$H$42","v":0},{"$f":"-'LCC Analysis'!$H$43","v":0},{"$f":"-'LCC Analysis'!$H$44","v":0},{"$f":"-'LCC Analysis'!$H$45","v":0},{"$f":"-'LCC Analysis'!$H$46","v":0},{"$f":"-'LCC Analysis'!$H$47","v":0},null,{"$f":"-'LCC Analysis'!$H$55","v":0},{"$f":"-'LCC Analysis'!$H$56","v":0},{"$f":"-'LCC Analysis'!$H$57","v":0},{"$f":"-'LCC Analysis'!$H$58","v":0},{"$f":"-'LCC Analysis'!$H$59","v":0}]
{"$rows_left_out":51}
{"sheet":"Incremental Costs","index":7,"n_rows":216,"n_cols":28,"rows_kept":216,"cut":false,"hidden":false,"merged":[[134,10,134,15],[126,10,126,15],[102,10,102,15],[78,10,78,15],[70,10,70,15],[62,10,62,15],[30,10,30,15],[22,10,22,15],[206,10,206,15],[198,10,198,15],[190,10,190,15],[182,10,182,15],[174,10,174,15],[166,10,166,15],[158,10,158,15],[150,10,150,15],[142,10,142,15],[200,1,202,1],[204,1,204,3],[192,1,194,1],[196,1,196,3],[198,1,199,1],[198,3,198,8],[184,1,186,1],[188,1,188,3],[190,1,191,1],[190,3,190,8],[176,1,178,1],[180,1,180,3],[182,1,183,1],[182,3,182,8],[168,1,170,1],[172,1,172,3],[174,1,175,1],[174,3,174,8],[160,1,162,1],[164,1,164,3],[166,1,167,1],[166,3,166,8],[152,1,154,1],[156,1,156,3],[158,1,159,1],[158,3,158,8],[144,1,146,1],[148,1,148,3],[150,1,151,1],[150,3,150,8],[136,1,138,1],[140,1,140,3],[142,1,143,1],[142,3,142,8],[126,3,126,8],[22,1,23,1],[22,3,22,8],[28,1,28,3],[30,1,31,1],[30,3,30,8],[32,1,34,1],[24,1,26,1],[60,1,60,3],[4,3,4,7],[6,3,6,5],[8,3,8,5],[8,8,8,10],[11,1,12,1],[11,3,11,8],[11,10,11,15],[56,1,58,1],[38,1,39,1],[38,3,38,8],[38,10,38,15],[40,1,42,1],[44,1,44,3],[46,1,47,1],[46,3,46,8],[46,10,46,15],[48,1,50,1],[52,1,52,3],[54,1,55,1],[54,3,54,8],[54,10,54,15],[36,1,36,3],[13,1,18,1],[20,1,20,3],[206,1,207,1],[206,3,206,8],[208,1,210,1],[62,1,63,1],[62,3,62,8],[64,1,66,1],[68,1,68,3],[70,1,71,1],[70,3,70,8],[78,1,79,1],[78,3,78,8],[80,1,82,1],[72,1,74,1],[76,1,76,3],[96,1,98,1],[100,1,100,3],[102,1,103,1],[102,3,102,8],[132,1,132,3],[134,1,135,1],[134,3,134,8],[120,1,122,1],[124,1,124,3],[126,1,127,1],[215,1,215,3],[215,6,215,7],[215,13,215,14],[212,1,212,3],[84,1,84,3],[86,1,87,1],[86,3,86,8],[86,10,86,15],[88,1,90,1],[92,1,92,3],[94,1,95,1],[94,3,94,8],[94,10,94,15],[112,1,114,1],[116,1,116,3],[118,1,119,1],[118,3,118,8],[118,10,118,15],[104,1,106,1],[108,1,108,3],[110,1,111,1],[110,3,110,8],[110,10,110,15],[128,1,130,1]]}
[null,null,null,null,null,null,null,null,null,null,null,null,null,null,null,null,null,null,null,null,null,null,null,"Hidden Y-AC"]
[null,"BC Hydro Power Smart New Construction Program"]
[null,"Energy Conservation Measure Incremental Capital Cost Estimate "]
[]
[null,"Project:",null,{"$f":"Proposal!B5","v":0}]
[]
{"$rows_left_out":211}
{"sheet":"LCC Analysis","index":8,"n_rows":94,"n_cols":29,"rows_kept":94,"cut":false,"hidden":false,"merged":[[4,2,4,5],[6,2,6,5],[8,2,8,5],[64,19,64,23],[20,2,20,6],[52,2,52,6],[52,9,52,10],[20,9,20,10],[64,2,64,6],[64,10,64,14]]}
[]
[null,"BC Hydro Power Smart New Construction Program"]
[null,"Life Cycle Cost (LCC) Analysis Spreadsheet"]
[null,null,"Date:",{"$f":"'Study Results'!D2","v":"yyyy-mm-dd"}]
[null,"Project:",{"$f":"'Study Inputs'!B5","v":0}]
[]
{"$rows_left_out":89}
{"sheet":"CopyPaste","index":9,"n_rows":61,"n_cols":32,"rows_kept":61,"cut":false,"hidden":true,"merged":[]}
["UNITS","Project #","Proj. Name","Proj. Developer","Date Entered","Mech Cons.","Elec Cons.","KAM","Location","Climate Zone","Building Type","Energy Code","Btype1 AC Area (metric)","Primary HS","Fortis BC","Non AC Area","Num Of Btypes","HS#1","Btype 2","B2 Area","HS#2","Btype3","B3 Area","HS#3","Btype4","B4 Area","HS#4"]
[{"$f":"'Study Inputs'!A19","v":"Imperial units"},{"$f":"IF('Study Inputs'!D1<>0, 'Study Inputs'!D1, \"\")","v":""},{"$f":"IF('Study Inputs'!B5=0, \"\", 'Study Inputs'!B5)","v":""},{"$f":"IF('Study Inputs'!B8=\"company\", \"\", 'Study Inputs'!B8)","v":""},{"$f":"TODAY()","v":"2016-06-30"},{"$f":"IF('Study Inputs'!B10=\"company\", \"\", 'Study Inputs'!B10)","v":""},{"$f":"IF('Study Inputs'!B11=\"company\", \"\", 'Study Inputs'!B11)","v":""},{"$f":"IF('Study Inputs'!D2=0, \"\", 'Study Inputs'!D2)","v":""},{"$f":"IF('Study Inputs'!B6<>0, 'Study Inputs'!B6, \"\")","v":""},{"$f":"'Study Inputs'!B33","v":"Coastal BC (ASHRAE Zone 5)"},{"$f":"IF('Study Inputs'!B19<>0, 'Study Inputs'!B19, \"\")","v":""},{"$f":"'Study Inputs'!B32","v":"ASHRAE 90.1 2010"},{"$f":"IF(A2=\"Metric units\", 'Study Inputs'!B22, 'Study Inputs'!B22*0.0929)","v":9.2899999999999996E-2},{"$f":"IF(AF4<>0, AF4, \"\")","v":""},{"$f":"'Study Inputs'!B36","v":"No"},{"$f":"IF(A2=\"Metric units\", 'Study Inputs'!B23, 'Study Inputs'!B23*0.0929)","v":0},{"$f":"COUNTIF('Study Inputs'!B19:E19,\"<>0\")","v":0},{"$f":"'Study Inputs'!B35","v":0},{"$f":"'Study Inputs'!C19","v":0},{"$f":"IF(A2=\"Metric units\", 'Study Inputs'!C22, 'Study Inputs'!C22*0.0929)","v":0},{"$f":"'Study Inputs'!G35","v":0},{"$f":"'Study Inputs'!D19","v":0},{"$f":"IF(A2=\"Metric units\", 'Study Inputs'!D22, 'Study Inputs'!D22*0.0929)","v":0},{"$f":"'Study Inputs'!L35","v":0},{"$f":"'Study Inputs'!E19","v":0},{"$f":"IF(A2=\"Metric units\", 'Study Inputs'!E22, 'Study Inputs'!E22*0.0929)","v":0},{"$f":"'Study Inputs'!Q35","v":0}]
[null,null,null,null,null,null,null,null,null,null,null,null,null,null,"Total Project AC Area:",{"$f":"IF(A2=\"Metric units\", 'Study Inputs'!F22, 'Study Inputs'!F22*0.0929)","v":9.2899999999999996E-2},null,null,null,null,null,null,null,null,null,null,null,null,"AC Area","HS","Max Area","HS of Max Area Bldg"]
[null,"LCC ECM Inputs",null,null,null,null,null,null,null,null,null,"# of ECMs:",{"$f":"COUNTIF(B8:B31, \"<>0\")","v":2},"EPM yes/no:",{"$f":"'Study Inputs'!B27","v":"No"},null,null,null,null,null,null,null,null,null,null,null,null,"Btype1",{"$f":"$M$2","v":9.2899999999999996E-2},{"$f":"$R$2","v":0},{"$f":"MAX(AC4:AC7)","v":9.2899999999999996E-2},{"$f":"INDEX(AD4:AD7, MATCH(AE4,AC4:AC7,0))","v":0}]
[null,{"$f":"'LCC Analysis'!B21","v":"Measure Name"},{"$f":"'LCC Analysis'!C22","v":"kWh"},{"$f":"'LCC Analysis'!D22","v":"kW"},{"$f":"'LCC Analysis'!E22","v":"GJ"},{"$f":"'LCC Analysis'!F22","v":"$"},{"$f":"'LCC Analysis'!G22","v":"Maint. $"},{"$f":"CONCATENATE('LCC Analysis'!H21, \" \", 'LCC Analysis'!H22)","v":"Incremental Capital Cost"},{"$f":"CONCATENATE('LCC Analysis'!I21, \" \", 'LCC Analysis'!I22)","v":"Life Expectancy"},"Standard ECM Name","In or Out","Area (m2)","Incr. $ / Area","BL Total Cost/Area","BL Cost ($)","ECM Total Cost/Area","ECM Total Cost ($)",null,null,null,null,null,null,null,null,null,null,"Btype2",{"$f":"$T$2","v":0},{"$f":"$U$2","v":0}]
[{"$f":"'LCC Analysis'!A23","v":0},{"$f":"'LCC Analysis'!B23","v":0},{"$f":"'LCC Analysis'!C23","v":0},{"$f":"'LCC Analysis'!D23","v":0},{"$f":"'LCC Analysis'!E23","v":0},{"$f":"'LCC Analysis'!F23","v":0},{"$f":"'LCC Analysis'!G23","v":0},{"$f":"'LCC Analysis'!H23","v":0},{"$f":"'LCC Analysis'!I23","v":25},"EPM",{"$f":"'LCC Analysis'!J67","v":0},{"$f":"'Incremental Costs'!AB20","v":0},{"$f":"IF(L6=0, 0, H6/L6)","v":0},{"$f":"IF(L6=0, 0, O6/L6)","v":0},{"$f":"'Incremental Costs'!I20","v":0},{"$f":"IF(L6=0, 0, Q6/L6)","v":0},{"$f":"'Incremental Costs'!P20","v":0},null,null,null,null,null,null,null,null,null,null,"Btype3",{"$f":"$W$2","v":0},{"$f":"$X$2","v":0}]
{"$rows_left_out":56}
{"sheet":"Study Fee Estimator","index":10,"n_rows":159,"n_cols":21,"rows_kept":159,"cut":false,"hidden":true,"merged":[[58,13,58,14],[63,13,63,14]]}
[null,"NC Program Energy Model Simulation Cost Estimator",null,null,null,null,"Data Source Details:",null,null,null,null,null,null,"BC Hydro NC Program Energy Study Cost Breakdown"]
[null,"Version 2.0","August, 2015",null,null,null,null,null,"Building Type","Complexity Factor"]
[null,null,"ES Hours","ES Total Cost",null,null,3,null,0,0]
[null,"Mechanical Consultant Coordination",{"$f":"U61","v":12},{"$f":"T61","v":1800},null,null,4,null,"Automotive Facility",0.8,null,null,null,"Energy Modelling",null,"Admin Staff","Energy Modeller","Engineer Lead","Complex Factor","Fee Estimate","Hours Estimate"]
[null,"Energy Modelling",{"$f":"B11","v":20},{"$f":"D11","v":6920},null,null,5,null,"Convention Centre",1.3,null,null,null,"Task","Subtask                                      ",100,150,180]
[null,"Lighting Consultant",null,null,null,null,6,null,"Courthouse",1,null,null,null,"Project Start-up","Start QA/QC Sheet, creat directory, etc.",2,null,null,1,{"$f":"($P$5*P6+$Q$5*Q6+$R$5*R6)*S6","v":200},{"$f":"(P6+Q6+R6)*S6","v":2}]
{"$rows_left_out":154}
{"sheet":"REFERENCE","index":11,"n_rows":76,"n_cols":22,"rows_kept":76,"cut":false,"hidden":true,"merged":[]}
["Climate Zone","Building Types","Standard ECMs (choose one)","ECM EMLs","Sorting Options","Standard End Use","Energy Codes","Units","ICC Units",null,"Primary Heating Source",null,null,null,null,"Yes/No",null,null,"Proposed Space Heating",null,null,"Exterior Wall Types"]
["GVRD and Victoria (ASHRAE Zone 4C)","Mixed Use","Roof Insulation Increase",25,"Project #","Process HVAC","ASHRAE 90.1 2004","Metric units","m2",null,"Electric",null,null,null,null,"Yes  ",null,null,null,"None",null,"Mass"]
["City of Vancouver and SFU (ASHRAE Zone 5)","Automotive Facility","Wall Insulation Increase",30,"Project Name","Fans","ASHRAE 90.1 2007","Imperial units","ft2",null,"Gas",null,null,null,null,"No",null,null,null,"PTACand PTHP",null,"Metal Building"]
["BC Interior Kelowna, Vernon (ASHRAE Zone 5)","Convention Centre","High Efficiency Glazing",25,"Building Type","Pumps","ASHRAE 90.1 2010",null,"# of units",null,"Hybrid","elec and gas serve the same system",null,null,null,null,null,null,null,"PSZ-AC - Pack rooftop air conditioner CV",null,"Steel-framed"]
["Vancouver Island except Victoria (ASHRAE Zone 5)","Courthouse","Parkade ceiling insulation",25,"Area","DHW","NECB 2011",null,"L/s",null,"Purchased",null,null,null,null,null,null,null,null,"Baseboard heating",null,"Wood-framed and Other"]
["Coastal BC (ASHRAE Zone 5)","Dining: Bar/Lounge/Leisure","Shading (concrete)",25,"Climate Zone","Space Cooling",null,null,"CFM",null,"Mixed","elec and gas serve separate systems",null,null,null,null,null,null,null,"VAV box (overhead and underfloor)"]
{"$rows_left_out":71}
{"sheet":"Baseline Hourly Results","index":12,"n_rows":1,"n_cols":1,"rows_kept":1,"cut":false,"hidden":false,"merged":[]}
["Copy/paste hourly results from your model for the whole year for electricity AND gas"]

{"sheet":"Proposed Hourly Results","index":13,"n_rows":1,"n_cols":1,"rows_kept":1,"cut":false,"hidden":false,"merged":[]}
["Copy/paste hourly results from your model for the whole year for electricity AND gas"]

{"sheet":"BCH Baseline Table","index":14,"n_rows":61,"n_cols":7,"rows_kept":61,"cut":false,"hidden":false,"merged":[[13,0,13,1],[20,0,20,4],[6,0,7,1],[6,2,6,4],[8,0,9,0],[10,0,10,1],[11,0,11,1],[12,0,12,1]]}
[]
["January, 2014"]
[]
["BC Hydro New Construction Program (NCP) - Baseline HVAC System Types Selection Table"]
["(For buildings complying to ASHRAE 90.1 2010 or NECB 2011)"]
[]
{"$rows_left_out":56}
{"sheet":"Proposal Review - Mechanical","index":15,"n_rows":12,"n_cols":7,"rows_kept":12,"cut":false,"hidden":false,"merged":[[0,0,0,2]]}
["Date",null,null,"2015-June-15","2015-June-25","2015-June-30","2015-July-25"]
["Comment #","Tab Name","Cell Reference","First Mechanical Review (reviewer name)","Response to First Mechanical Review (responder name)","Second Mechanical Review (reviewer name)","Response to Second Mechanical Review (responder name)"]
[1,"Proposal","D206~209"]
[2]
[3]
[4]
{"$rows_left_out":7}
{"sheet":"Proposal Review - Lighting","index":16,"n_rows":16,"n_cols":7,"rows_kept":16,"cut":false,"hidden":false,"merged":[[0,0,0,2]]}
["Date",null,null,"2015-June-15","2015-June-25","2015-June-30","2015-July-25"]
["Comment #","Tab Name","Cell Reference","First Lighting Review (reviewer name)","Response to First Lighting Review (responder name)","Second Lighting Review (reviewer name)","Response to Second Lighting Review (responder name)"]
[1,"Proposal","D206~209",null,null,"ok"]
[2]
[3]
[4]
{"$rows_left_out":11}
{"sheet":"Study Review - Mechanical","index":17,"n_rows":12,"n_cols":7,"rows_kept":12,"cut":false,"hidden":false,"merged":[[0,0,0,2]]}
["Date",null,null,"2015-June-15","2015-June-25","2015-June-30","2015-July-25"]
["Comment #","Tab Name","Cell Reference","First Mechanical Review (reviewer name)","Response to First Mechanical Review (responder name)","Second Mechanical Review (reviewer name)","Response to Second Mechanical Review (responder name)"]
[1,"Proposal","D206~209",null,null,"ok"]
[2]
[3]
[4]
{"$rows_left_out":7}
{"sheet":"Study Review - Lighting","index":18,"n_rows":16,"n_cols":7,"rows_kept":16,"cut":false,"hidden":false,"merged":[[0,0,0,2]]}
["Date",null,null,"2015-June-15","2015-June-25","2015-June-30","2015-July-25"]
["Comment #","Tab Name","Cell Reference","First Lighting Review (reviewer name)","Response to First Lighting Review (responder name)","Second Lighting Review (reviewer name)","Response to Second Lighting Review (responder name)"]
[1,"Proposal","D206~209",null,null,"ok"]
[2]
[3]
[4]
{"$rows_left_out":10}